You are viewing a plain text version of this content. The canonical link for it is here.
Posted to dev@juneau.apache.org by Apache Jenkins Server <je...@builds.apache.org> on 2026/05/23 14:12:40 UTC

Build failed in Jenkins: Juneau » Juneau-Java-17 #2316

See <https://ci-builds.apache.org/job/Juneau/job/Juneau-Java-17/2316/display/redirect?page=changes>

Changes:

[James Bognar] feat: TODO-66 RateLimitGuard + RequestIdFilter (juneau-rest-server)


------------------------------------------
[...truncated 965.59 KiB...]
DEBUG: Stack trace (without message):
  org.apache.juneau.serializer.SerializerSession.serialize(SerializerSession.java:833)
  org.apache.juneau.serializer.WriterSerializerSession.serialize(WriterSerializerSession.java:357)
  org.apache.juneau.serializer.WriterSerializer.serialize(WriterSerializer.java:1071)
  org.apache.juneau.uon.Common_UonTest.lambda$a08_recursion$0(Common_UonTest.java:193)
  org.junit.jupiter.api.AssertThrows.assertThrows(AssertThrows.java:54)
  org.junit.jupiter.api.AssertThrows.assertThrows(AssertThrows.java:35)
  org.junit.jupiter.api.Assertions.assertThrows(Assertions.java:3223)
  org.apache.juneau.TestUtils.assertThrowsWithMessage(TestUtils.java:207)
  org.apache.juneau.uon.Common_UonTest.a08_recursion(Common_UonTest.java:191)
  java.base/jdk.internal.reflect.NativeMethodAccessorImpl.invoke0(Native Method)
  java.base/jdk.internal.reflect.NativeMethodAccessorImpl.invoke(NativeMethodAccessorImpl.java:77)
  java.base/jdk.internal.reflect.DelegatingMethodAccessorImpl.invoke(DelegatingMethodAccessorImpl.java:43)
  java.base/java.lang.reflect.Method.invoke(Method.java:569)
  org.junit.platform.commons.util.ReflectionUtils.invokeMethod(ReflectionUtils.java:701)
  org.junit.platform.commons.support.ReflectionSupport.invokeMethod(ReflectionSupport.java:502)
  org.junit.jupiter.engine.support.MethodReflectionUtils.invoke(MethodReflectionUtils.java:45)
  org.junit.jupiter.engine.execution.MethodInvocation.proceed(MethodInvocation.java:61)
  org.junit.jupiter.engine.execution.InvocationInterceptorChain$ValidatingInvocation.proceed(InvocationInterceptorChain.java:124)
  org.junit.jupiter.engine.extension.TimeoutExtension.intercept(TimeoutExtension.java:163)
  org.junit.jupiter.engine.extension.TimeoutExtension.interceptTestableMethod(TimeoutExtension.java:148)
  org.junit.jupiter.engine.extension.TimeoutExtension.interceptTestMethod(TimeoutExtension.java:86)
  org.junit.jupiter.engine.execution.InterceptingExecutableInvoker$ReflectiveInterceptorCall.lambda$ofVoidMethod$0(InterceptingExecutableInvoker.java:123)
  org.junit.jupiter.engine.execution.InterceptingExecutableInvoker.lambda$invoke$0(InterceptingExecutableInvoker.java:105)
  org.junit.jupiter.engine.execution.InvocationInterceptorChain$InterceptedInvocation.proceed(InvocationInterceptorChain.java:99)
  org.junit.jupiter.engine.execution.InvocationInterceptorChain.proceed(InvocationInterceptorChain.java:66)
  org.junit.jupiter.engine.execution.InvocationInterceptorChain.chainAndInvoke(InvocationInterceptorChain.java:47)
  org.junit.jupiter.engine.execution.InvocationInterceptorChain.invoke(InvocationInterceptorChain.java:39)
  org.junit.jupiter.engine.execution.InterceptingExecutableInvoker.invoke(InterceptingExecutableInvoker.java:104)
  org.junit.jupiter.engine.execution.InterceptingExecutableInvoker.invoke(InterceptingExecutableInvoker.java:98)
  org.junit.jupiter.engine.execution.InterceptingExecutableInvoker.invokeVoid(InterceptingExecutableInvoker.java:71)
  org.junit.jupiter.engine.descriptor.TestMethodTestDescriptor.lambda$invokeTestMethod$0(TestMethodTestDescriptor.java:219)
  org.junit.platform.engine.support.hierarchical.ThrowableCollector.execute(ThrowableCollector.java:74)
  org.junit.jupiter.engine.descriptor.TestMethodTestDescriptor.invokeTestMethod(TestMethodTestDescriptor.java:215)
  org.junit.jupiter.engine.descriptor.TestMethodTestDescriptor.execute(TestMethodTestDescriptor.java:157)
  org.junit.jupiter.engine.descriptor.TestMethodTestDescriptor.execute(TestMethodTestDescriptor.java:70)
  org.junit.platform.engine.support.hierarchical.NodeTestTask.lambda$executeRecursively$2(NodeTestTask.java:176)
  org.junit.platform.engine.support.hierarchical.ThrowableCollector.execute(ThrowableCollector.java:74)
  org.junit.platform.engine.support.hierarchical.NodeTestTask.lambda$executeRecursively$1(NodeTestTask.java:166)
  org.junit.platform.engine.support.hierarchical.Node.around(Node.java:138)
  org.junit.platform.engine.support.hierarchical.NodeTestTask.lambda$executeRecursively$0(NodeTestTask.java:164)
  org.junit.platform.engine.support.hierarchical.ThrowableCollector.execute(ThrowableCollector.java:74)
  org.junit.platform.engine.support.hierarchical.NodeTestTask.executeRecursively(NodeTestTask.java:163)
  org.junit.platform.engine.support.hierarchical.NodeTestTask.execute(NodeTestTask.java:116)
  java.base/java.util.ArrayList.forEach(ArrayList.java:1511)
  org.junit.platform.engine.support.hierarchical.SameThreadHierarchicalTestExecutorService.invokeAll(SameThreadHierarchicalTestExecutorService.java:42)
  org.junit.platform.engine.support.hierarchical.NodeTestTask.lambda$executeRecursively$2(NodeTestTask.java:180)
  org.junit.platform.engine.support.hierarchical.ThrowableCollector.execute(ThrowableCollector.java:74)
  org.junit.platform.engine.support.hierarchical.NodeTestTask.lambda$executeRecursively$1(NodeTestTask.java:166)
  org.junit.platform.engine.support.hierarchical.Node.around(Node.java:138)
  org.junit.platform.engine.support.hierarchical.NodeTestTask.lambda$executeRecursively$0(NodeTestTask.java:164)
  org.junit.platform.engine.support.hierarchical.ThrowableCollector.execute(ThrowableCollector.java:74)
  org.junit.platform.engine.support.hierarchical.NodeTestTask.executeRecursively(NodeTestTask.java:163)
  org.junit.platform.engine.support.hierarchical.NodeTestTask.execute(NodeTestTask.java:116)
  java.base/java.util.ArrayList.forEach(ArrayList.java:1511)
  org.junit.platform.engine.support.hierarchical.SameThreadHierarchicalTestExecutorService.invokeAll(SameThreadHierarchicalTestExecutorService.java:42)
  org.junit.platform.engine.support.hierarchical.NodeTestTask.lambda$executeRecursively$2(NodeTestTask.java:180)
  org.junit.platform.engine.support.hierarchical.ThrowableCollector.execute(ThrowableCollector.java:74)
  org.junit.platform.engine.support.hierarchical.NodeTestTask.lambda$executeRecursively$1(NodeTestTask.java:166)
  org.junit.platform.engine.support.hierarchical.Node.around(Node.java:138)
  org.junit.platform.engine.support.hierarchical.NodeTestTask.lambda$executeRecursively$0(NodeTestTask.java:164)
  org.junit.platform.engine.support.hierarchical.ThrowableCollector.execute(ThrowableCollector.java:74)
  org.junit.platform.engine.support.hierarchical.NodeTestTask.executeRecursively(NodeTestTask.java:163)
  org.junit.platform.engine.support.hierarchical.NodeTestTask.execute(NodeTestTask.java:116)
  org.junit.platform.engine.support.hierarchical.SameThreadHierarchicalTestExecutorService.submit(SameThreadHierarchicalTestExecutorService.java:36)
  org.junit.platform.engine.support.hierarchical.HierarchicalTestExecutor.execute(HierarchicalTestExecutor.java:52)
  org.junit.platform.engine.support.hierarchical.HierarchicalTestEngine.execute(HierarchicalTestEngine.java:58)
  org.junit.platform.launcher.core.EngineExecutionOrchestrator.executeEngine(EngineExecutionOrchestrator.java:246)
  org.junit.platform.launcher.core.EngineExecutionOrchestrator.failOrExecuteEngine(EngineExecutionOrchestrator.java:218)
  org.junit.platform.launcher.core.EngineExecutionOrchestrator.execute(EngineExecutionOrchestrator.java:179)
  org.junit.platform.launcher.core.EngineExecutionOrchestrator.execute(EngineExecutionOrchestrator.java:108)
  org.junit.platform.launcher.core.EngineExecutionOrchestrator.lambda$execute$0(EngineExecutionOrchestrator.java:66)
  org.junit.platform.launcher.core.EngineExecutionOrchestrator.withInterceptedStreams(EngineExecutionOrchestrator.java:157)
  org.junit.platform.launcher.core.EngineExecutionOrchestrator.execute(EngineExecutionOrchestrator.java:65)
  org.junit.platform.launcher.core.DefaultLauncher.execute(DefaultLauncher.java:125)
  org.junit.platform.launcher.core.DefaultLauncher.execute(DefaultLauncher.java:114)
  org.junit.platform.launcher.core.DelegatingLauncher.execute(DelegatingLauncher.java:58)
  org.junit.platform.launcher.core.InterceptingLauncher.lambda$execute$2(InterceptingLauncher.java:57)
  org.junit.platform.launcher.core.ClasspathAlignmentCheckingLauncherInterceptor.intercept(ClasspathAlignmentCheckingLauncherInterceptor.java:25)
  org.junit.platform.launcher.core.InterceptingLauncher.execute(InterceptingLauncher.java:56)
  org.junit.platform.launcher.core.DelegatingLauncher.execute(DelegatingLauncher.java:58)
  java.base/jdk.internal.reflect.NativeMethodAccessorImpl.invoke0(Native Method)
  java.base/jdk.internal.reflect.NativeMethodAccessorImpl.invoke(NativeMethodAccessorImpl.java:77)
  java.base/jdk.internal.reflect.DelegatingMethodAccessorImpl.invoke(DelegatingMethodAccessorImpl.java:43)
  java.base/java.lang.reflect.Method.invoke(Method.java:569)
  org.apache.maven.surefire.api.util.ReflectionUtils.invokeMethodWithArray(ReflectionUtils.java:125)
  org.apache.maven.surefire.junitplatform.LauncherAdapter.executeWithCancellationToken(LauncherAdapter.java:68)
  org.apache.maven.surefire.junitplatform.LauncherAdapter.execute(LauncherAdapter.java:54)
  org.apache.maven.surefire.junitplatform.JUnitPlatformProvider.execute(JUnitPlatformProvider.java:203)
  org.apache.maven.surefire.junitplatform.JUnitPlatformProvider.invokeAllTests(JUnitPlatformProvider.java:168)
  org.apache.maven.surefire.junitplatform.JUnitPlatformProvider.invoke(JUnitPlatformProvider.java:136)
  org.apache.maven.surefire.booter.ForkedBooter.runSuitesInProcess(ForkedBooter.java:385)
  org.apache.maven.surefire.booter.ForkedBooter.execute(ForkedBooter.java:162)
  org.apache.maven.surefire.booter.ForkedBooter.run(ForkedBooter.java:507)
  org.apache.maven.surefire.booter.ForkedBooter.main(ForkedBooter.java:495)
[INFO] Tests run: 6, Failures: 0, Errors: 0, Skipped: 0, Time elapsed: 0.043 s -- in org.apache.juneau.uon.Common_UonTest
[INFO] Running org.apache.juneau.mstat.MethodExecStore_Test
[INFO] Tests run: 8, Failures: 0, Errors: 0, Skipped: 0, Time elapsed: 0.013 s -- in org.apache.juneau.mstat.MethodExecStore_Test
[INFO] Running org.apache.juneau.mstat.ThrownStore_Test
[INFO] Tests run: 13, Failures: 0, Errors: 0, Skipped: 0, Time elapsed: 0.023 s -- in org.apache.juneau.mstat.ThrownStore_Test
[INFO] Running org.apache.juneau.DynaBean_ComboRoundTripTest
[INFO] Tests run: 882, Failures: 0, Errors: 0, Skipped: 0, Time elapsed: 1.349 s -- in org.apache.juneau.DynaBean_ComboRoundTripTest
[INFO] Running org.apache.juneau.marshaller.Ini_Test
[INFO] Tests run: 4, Failures: 0, Errors: 0, Skipped: 0, Time elapsed: 0.004 s -- in org.apache.juneau.marshaller.Ini_Test
[INFO] Running org.apache.juneau.marshaller.Parquet_Test
[INFO] Tests run: 6, Failures: 0, Errors: 0, Skipped: 0, Time elapsed: 0.007 s -- in org.apache.juneau.marshaller.Parquet_Test
[INFO] Running org.apache.juneau.marshaller.Csv_Test
[INFO] Tests run: 2, Failures: 0, Errors: 0, Skipped: 0, Time elapsed: 0.003 s -- in org.apache.juneau.marshaller.Csv_Test
[INFO] Running org.apache.juneau.marshaller.Cbor_Test
[INFO] Tests run: 5, Failures: 0, Errors: 0, Skipped: 0, Time elapsed: 0.004 s -- in org.apache.juneau.marshaller.Cbor_Test
[INFO] Running org.apache.juneau.marshaller.Html_Test
[INFO] Tests run: 2, Failures: 0, Errors: 0, Skipped: 0, Time elapsed: 0.003 s -- in org.apache.juneau.marshaller.Html_Test
[INFO] Running org.apache.juneau.marshaller.RdfThrift_Test
[INFO] Tests run: 6, Failures: 0, Errors: 0, Skipped: 0, Time elapsed: 0.006 s -- in org.apache.juneau.marshaller.RdfThrift_Test
[INFO] Running org.apache.juneau.marshaller.Json_Test
[INFO] Tests run: 2, Failures: 0, Errors: 0, Skipped: 0, Time elapsed: 0.001 s -- in org.apache.juneau.marshaller.Json_Test
[INFO] Running org.apache.juneau.marshaller.Hjson_Test
[INFO] Tests run: 4, Failures: 0, Errors: 0, Skipped: 0, Time elapsed: 0.002 s -- in org.apache.juneau.marshaller.Hjson_Test
[INFO] Running org.apache.juneau.marshaller.OpenApi_Test
[INFO] Tests run: 2, Failures: 0, Errors: 0, Skipped: 0, Time elapsed: 0.002 s -- in org.apache.juneau.marshaller.OpenApi_Test
[INFO] Running org.apache.juneau.marshaller.Hocon_Test
[INFO] Tests run: 4, Failures: 0, Errors: 0, Skipped: 0, Time elapsed: 0.002 s -- in org.apache.juneau.marshaller.Hocon_Test
[INFO] Running org.apache.juneau.marshaller.Jsonl_Test
[INFO] Tests run: 4, Failures: 0, Errors: 0, Skipped: 0, Time elapsed: 0.002 s -- in org.apache.juneau.marshaller.Jsonl_Test
[INFO] Running org.apache.juneau.marshaller.Marshall_Test
[INFO] Tests run: 1, Failures: 0, Errors: 0, Skipped: 0, Time elapsed: 0 s -- in org.apache.juneau.marshaller.Marshall_Test
[INFO] Running org.apache.juneau.marshaller.Json5_Test
[INFO] Tests run: 2, Failures: 0, Errors: 0, Skipped: 0, Time elapsed: 0.001 s -- in org.apache.juneau.marshaller.Json5_Test
[INFO] Running org.apache.juneau.marshaller.Uon_Test
[INFO] Tests run: 2, Failures: 0, Errors: 0, Skipped: 0, Time elapsed: 0.001 s -- in org.apache.juneau.marshaller.Uon_Test
[INFO] Running org.apache.juneau.marshaller.MarshallUtils_Test
[INFO] Tests run: 9, Failures: 0, Errors: 0, Skipped: 0, Time elapsed: 0.014 s -- in org.apache.juneau.marshaller.MarshallUtils_Test
[INFO] Running org.apache.juneau.marshaller.Proto_Test
[INFO] Tests run: 7, Failures: 0, Errors: 0, Skipped: 0, Time elapsed: 0.005 s -- in org.apache.juneau.marshaller.Proto_Test
[INFO] Running org.apache.juneau.marshaller.CharRdfMarshallers_Test
[INFO] Tests run: 92, Failures: 0, Errors: 0, Skipped: 0, Time elapsed: 0.071 s -- in org.apache.juneau.marshaller.CharRdfMarshallers_Test
[INFO] Running org.apache.juneau.marshaller.MsgPack_Test
[INFO] Tests run: 2, Failures: 0, Errors: 0, Skipped: 0, Time elapsed: 0.001 s -- in org.apache.juneau.marshaller.MsgPack_Test
[INFO] Running org.apache.juneau.marshaller.Jcs_Test
[INFO] Tests run: 4, Failures: 0, Errors: 0, Skipped: 0, Time elapsed: 0.002 s -- in org.apache.juneau.marshaller.Jcs_Test
[INFO] Running org.apache.juneau.marshaller.RdfProto_Test
[INFO] Tests run: 6, Failures: 0, Errors: 0, Skipped: 0, Time elapsed: 0.006 s -- in org.apache.juneau.marshaller.RdfProto_Test
[INFO] Running org.apache.juneau.marshaller.UrlEncoding_Test
[INFO] Tests run: 2, Failures: 0, Errors: 0, Skipped: 0, Time elapsed: 0.002 s -- in org.apache.juneau.marshaller.UrlEncoding_Test
[INFO] Running org.apache.juneau.marshaller.Markdown_Test
[INFO] Tests run: 4, Failures: 0, Errors: 0, Skipped: 0, Time elapsed: 0.004 s -- in org.apache.juneau.marshaller.Markdown_Test
[INFO] Running org.apache.juneau.marshaller.Bson_Test
[INFO] Tests run: 6, Failures: 0, Errors: 0, Skipped: 0, Time elapsed: 0.002 s -- in org.apache.juneau.marshaller.Bson_Test
[INFO] Running org.apache.juneau.marshaller.PlainText_Test
[INFO] Tests run: 2, Failures: 0, Errors: 0, Skipped: 0, Time elapsed: 0.001 s -- in org.apache.juneau.marshaller.PlainText_Test
[INFO] Running org.apache.juneau.marshaller.Xml_Test
[INFO] Tests run: 2, Failures: 0, Errors: 0, Skipped: 0, Time elapsed: 0.001 s -- in org.apache.juneau.marshaller.Xml_Test
[INFO] 
[INFO] Results:
[INFO] 
[ERROR] Errors: 
[ERROR]   RateLimitGuard_Test.b01_bucketRefillsAtConfiguredRate:87 » Runtime Unexpected value.
	Expect='429'.
	Actual='200'.
[INFO] 
[ERROR] Tests run: 126933, Failures: 0, Errors: 1, Skipped: 20
[INFO] 
[INFO] 
[INFO] ------------------------------------------------------------------------
[INFO] Skipping Apache Juneau
[INFO] This project has been banned from the build due to previous failures.
[INFO] ------------------------------------------------------------------------
[INFO] ------------------------------------------------------------------------
[INFO] Reactor Summary for Apache Juneau 9.5.0-SNAPSHOT:
[INFO] 
[INFO] Apache Juneau ...................................... SUCCESS [ 30.359 s]
[INFO] Apache Juneau Core ................................. SUCCESS [  5.343 s]
[INFO] Apache Juneau Commons .............................. SUCCESS [ 34.971 s]
[INFO] Apache Juneau Marshall ............................. SUCCESS [ 53.579 s]
[INFO] juneau/core/marshall-rdf ........................... SUCCESS [ 13.576 s]
[INFO] Apache Juneau Config ............................... SUCCESS [ 11.255 s]
[INFO] Apache Juneau Assertions ........................... SUCCESS [ 11.372 s]
[INFO] Apache Juneau Bean-Centric Testing ................. SUCCESS [ 10.991 s]
[INFO] Apache Juneau Beans ................................ SUCCESS [  4.399 s]
[INFO] Apache Juneau RFC 7807 Beans ....................... SUCCESS [  9.944 s]
[INFO] Apache Juneau REST ................................. SUCCESS [  5.033 s]
[INFO] Apache Juneau REST Common .......................... SUCCESS [ 14.591 s]
[INFO] Apache Juneau REST Common (Classic) ................ SUCCESS [ 16.908 s]
[INFO] Apache Juneau Common Beans ......................... SUCCESS [  9.373 s]
[INFO] Apache Juneau HTML5 Beans .......................... SUCCESS [ 18.853 s]
[INFO] Apache Juneau JSON Schema Beans .................... SUCCESS [ 10.599 s]
[INFO] Apache Juneau Swagger 2.0 Beans .................... SUCCESS [ 11.120 s]
[INFO] Apache Juneau OpenAPI 3.0 Beans .................... SUCCESS [ 11.713 s]
[INFO] Apache Juneau REST Server .......................... SUCCESS [ 23.796 s]
[INFO] Apache Juneau REST Server RDF ...................... SUCCESS [ 10.398 s]
[INFO] Apache Juneau MCP Beans ............................ SUCCESS [  9.976 s]
[INFO] Apache Juneau REST Server MCP ...................... SUCCESS [ 10.019 s]
[INFO] Apache Juneau REST Server Spring Boot .............. SUCCESS [ 10.119 s]
[INFO] Apache Juneau REST Client .......................... SUCCESS [ 11.108 s]
[INFO] Apache Juneau REST Client (Classic) ................ SUCCESS [ 12.622 s]
[INFO] Apache Juneau REST Mock ............................ SUCCESS [ 11.527 s]
[INFO] Apache Juneau NG REST Client — Apache HttpClient 4.5 Transport SUCCESS [  9.678 s]
[INFO] Apache Juneau NG REST Client — Apache HttpClient 5.x Transport SUCCESS [  9.815 s]
[INFO] Apache Juneau NG REST Client — OkHttp Transport .... SUCCESS [  9.741 s]
[INFO] Apache Juneau NG REST Client — Jetty HttpClient Transport SUCCESS [  9.996 s]
[INFO] Apache Juneau Microservices ........................ SUCCESS [  4.076 s]
[INFO] Apache Juneau Microservice ......................... SUCCESS [ 10.686 s]
[INFO] Apache Juneau Microservice Jetty ................... SUCCESS [  7.444 s]
[INFO] Apache Juneau My Jetty Microservice ................ SUCCESS [  6.933 s]
[INFO] Apache Juneau My Spring Boot Microservice .......... SUCCESS [  6.266 s]
[INFO] Apache Juneau Server Config ........................ SUCCESS [  3.952 s]
[INFO] Apache Juneau Server Config Server ................. SUCCESS [  6.824 s]
[INFO] Apache Juneau Server Config Client ................. SUCCESS [  5.080 s]
[INFO] Apache Juneau Atom Beans ........................... SUCCESS [ 10.222 s]
[INFO] Apache Juneau Examples ............................. SUCCESS [  4.236 s]
[INFO] Apache Juneau Core Examples ........................ SUCCESS [ 10.896 s]
[INFO] Apache Juneau REST Examples ........................ SUCCESS [ 12.060 s]
[INFO] Apache Juneau REST Jetty Examples .................. SUCCESS [ 11.995 s]
[INFO] Apache Juneau REST Spring Boot Examples ............ SUCCESS [ 13.662 s]
[INFO] Apache Juneau REST Jetty Functional Tests .......... SUCCESS [ 23.389 s]
[INFO] Apache Juneau HAL Beans ............................ SUCCESS [  9.403 s]
[INFO] Apache Juneau JSON:API Beans ....................... SUCCESS [  9.340 s]
[INFO] Apache Juneau JSON Patch Beans ..................... SUCCESS [  8.861 s]
[INFO] Apache Juneau Unit Tests ........................... FAILURE [07:10 min]
[INFO] Apache Juneau Shaded Artifacts ..................... SKIPPED
[INFO] Apache Juneau Core (Shaded) ........................ SKIPPED
[INFO] Apache Juneau REST Client (Shaded) ................. SKIPPED
[INFO] Apache Juneau REST Server (Shaded) ................. SKIPPED
[INFO] Apache Juneau REST Server Spring Boot (Shaded) ..... SKIPPED
[INFO] Apache Juneau All (Shaded) ......................... SKIPPED
[INFO] Apache Juneau Distribution ......................... SKIPPED
[INFO] ------------------------------------------------------------------------
[INFO] BUILD FAILURE
[INFO] ------------------------------------------------------------------------
[INFO] Total time:  17:01 min
[INFO] Finished at: 2026-05-23T14:12:25Z
[INFO] ------------------------------------------------------------------------
[ERROR] Failed to execute goal org.apache.maven.plugins:maven-surefire-plugin:3.5.4:test (default-test) on project juneau-utest: 
[ERROR] 
[ERROR] See <https://ci-builds.apache.org/job/Juneau/job/Juneau-Java-17/ws/juneau-utest/target/surefire-reports> for the individual test results.
[ERROR] See dump files (if any exist) [date].dump, [date]-jvmRun[N].dump and [date].dumpstream.
[ERROR] -> [Help 1]
[ERROR] 
[ERROR] To see the full stack trace of the errors, re-run Maven with the -e switch.
[ERROR] Re-run Maven using the -X switch to enable full debug logging.
[ERROR] 
[ERROR] For more information about the errors and possible solutions, please read the following articles:
[ERROR] [Help 1] http://cwiki.apache.org/confluence/display/MAVEN/MojoFailureException
[ERROR] 
[ERROR] After correcting the problems, you can resume the build with the command
[ERROR]   mvn <args> -rf :juneau-utest
Build step 'Invoke top-level Maven targets' marked build as failure
Recording test results
[Checks API] No suitable checks publisher found.

Jenkins build is back to normal : Juneau » Juneau-Java-17 #2317

Posted by Apache Jenkins Server <je...@builds.apache.org>.
See <https://ci-builds.apache.org/job/Juneau/job/Juneau-Java-17/2317/display/redirect?page=changes>