You are viewing a plain text version of this content. The canonical link for it is here.
Posted to dev@lucene.apache.org by Apache Jenkins Server <je...@builds.apache.org> on 2012/01/28 01:19:23 UTC

[JENKINS] Lucene-Solr-tests-only-trunk-java7 - Build # 1631 - Still Failing

Build: https://builds.apache.org/job/Lucene-Solr-tests-only-trunk-java7/1631/

1 tests failed.
FAILED:  junit.framework.TestSuite.org.apache.solr.cloud.FullSolrCloudDistribCmdsTest

Error Message:
ERROR: SolrIndexSearcher opens=66 closes=65

Stack Trace:
junit.framework.AssertionFailedError: ERROR: SolrIndexSearcher opens=66 closes=65
	at org.apache.solr.SolrTestCaseJ4.endTrackingSearchers(SolrTestCaseJ4.java:152)
	at org.apache.solr.SolrTestCaseJ4.afterClassSolrTestCase(SolrTestCaseJ4.java:76)




Build Log (for compile errors):
[...truncated 9957 lines...]



---------------------------------------------------------------------
To unsubscribe, e-mail: dev-unsubscribe@lucene.apache.org
For additional commands, e-mail: dev-help@lucene.apache.org


[JENKINS] Lucene-Solr-tests-only-trunk-java7 - Build # 1632 - Still Failing

Posted by Apache Jenkins Server <je...@builds.apache.org>.
Build: https://builds.apache.org/job/Lucene-Solr-tests-only-trunk-java7/1632/

2 tests failed.
FAILED:  junit.framework.TestSuite.org.apache.solr.cloud.OverseerTest

Error Message:
ERROR: SolrIndexSearcher opens=0 closes=1

Stack Trace:
junit.framework.AssertionFailedError: ERROR: SolrIndexSearcher opens=0 closes=1
	at org.apache.solr.SolrTestCaseJ4.endTrackingSearchers(SolrTestCaseJ4.java:152)
	at org.apache.solr.SolrTestCaseJ4.afterClassSolrTestCase(SolrTestCaseJ4.java:76)


FAILED:  junit.framework.TestSuite.org.apache.solr.cloud.FullSolrCloudDistribCmdsTest

Error Message:
ERROR: SolrIndexSearcher opens=66 closes=65

Stack Trace:
junit.framework.AssertionFailedError: ERROR: SolrIndexSearcher opens=66 closes=65
	at org.apache.solr.SolrTestCaseJ4.endTrackingSearchers(SolrTestCaseJ4.java:152)
	at org.apache.solr.SolrTestCaseJ4.afterClassSolrTestCase(SolrTestCaseJ4.java:76)




Build Log (for compile errors):
[...truncated 10100 lines...]



---------------------------------------------------------------------
To unsubscribe, e-mail: dev-unsubscribe@lucene.apache.org
For additional commands, e-mail: dev-help@lucene.apache.org