You are viewing a plain text version of this content. The canonical link for it is here.
Posted to dev@lucene.apache.org by Apache Jenkins Server <je...@builds.apache.org> on 2014/10/01 11:48:40 UTC
[JENKINS] Lucene-Solr-Tests-5.x-Java7 - Build # 2145 - Failure
Build: https://builds.apache.org/job/Lucene-Solr-Tests-5.x-Java7/2145/
1 tests failed.
REGRESSION: org.apache.solr.cloud.DeleteLastCustomShardedReplicaTest.testDistribSearch
Error Message:
No live SolrServers available to handle this request:[http://127.0.0.1:45346, http://127.0.0.1:45343, http://127.0.0.1:37130]
Stack Trace:
org.apache.solr.client.solrj.SolrServerException: No live SolrServers available to handle this request:[http://127.0.0.1:45346, http://127.0.0.1:45343, http://127.0.0.1:37130]
at __randomizedtesting.SeedInfo.seed([B0D616B7E0527FAC:313098AF970D1F90]:0)
at org.apache.solr.client.solrj.impl.LBHttpSolrServer.request(LBHttpSolrServer.java:322)
at org.apache.solr.client.solrj.impl.CloudSolrServer.sendRequest(CloudSolrServer.java:880)
at org.apache.solr.client.solrj.impl.CloudSolrServer.requestWithRetryOnStaleState(CloudSolrServer.java:658)
at org.apache.solr.client.solrj.impl.CloudSolrServer.request(CloudSolrServer.java:601)
at org.apache.solr.cloud.DeleteLastCustomShardedReplicaTest.removeAndWaitForLastReplicaGone(DeleteLastCustomShardedReplicaTest.java:117)
at org.apache.solr.cloud.DeleteLastCustomShardedReplicaTest.doTest(DeleteLastCustomShardedReplicaTest.java:107)
at org.apache.solr.BaseDistributedSearchTestCase.testDistribSearch(BaseDistributedSearchTestCase.java:869)
at sun.reflect.NativeMethodAccessorImpl.invoke0(Native Method)
at sun.reflect.NativeMethodAccessorImpl.invoke(NativeMethodAccessorImpl.java:57)
at sun.reflect.DelegatingMethodAccessorImpl.invoke(DelegatingMethodAccessorImpl.java:43)
at java.lang.reflect.Method.invoke(Method.java:606)
at com.carrotsearch.randomizedtesting.RandomizedRunner.invoke(RandomizedRunner.java:1618)
at com.carrotsearch.randomizedtesting.RandomizedRunner$6.evaluate(RandomizedRunner.java:827)
at com.carrotsearch.randomizedtesting.RandomizedRunner$7.evaluate(RandomizedRunner.java:863)
at com.carrotsearch.randomizedtesting.RandomizedRunner$8.evaluate(RandomizedRunner.java:877)
at com.carrotsearch.randomizedtesting.rules.SystemPropertiesRestoreRule$1.evaluate(SystemPropertiesRestoreRule.java:53)
at org.apache.lucene.util.TestRuleSetupTeardownChained$1.evaluate(TestRuleSetupTeardownChained.java:50)
at org.apache.lucene.util.AbstractBeforeAfterRule$1.evaluate(AbstractBeforeAfterRule.java:46)
at com.carrotsearch.randomizedtesting.rules.SystemPropertiesInvariantRule$1.evaluate(SystemPropertiesInvariantRule.java:55)
at org.apache.lucene.util.TestRuleThreadAndTestName$1.evaluate(TestRuleThreadAndTestName.java:49)
at org.apache.lucene.util.TestRuleIgnoreAfterMaxFailures$1.evaluate(TestRuleIgnoreAfterMaxFailures.java:65)
at org.apache.lucene.util.TestRuleMarkFailure$1.evaluate(TestRuleMarkFailure.java:48)
at com.carrotsearch.randomizedtesting.rules.StatementAdapter.evaluate(StatementAdapter.java:36)
at com.carrotsearch.randomizedtesting.ThreadLeakControl$StatementRunner.run(ThreadLeakControl.java:365)
at com.carrotsearch.randomizedtesting.ThreadLeakControl.forkTimeoutingTask(ThreadLeakControl.java:798)
at com.carrotsearch.randomizedtesting.ThreadLeakControl$3.evaluate(ThreadLeakControl.java:458)
at com.carrotsearch.randomizedtesting.RandomizedRunner.runSingleTest(RandomizedRunner.java:836)
at com.carrotsearch.randomizedtesting.RandomizedRunner$3.evaluate(RandomizedRunner.java:738)
at com.carrotsearch.randomizedtesting.RandomizedRunner$4.evaluate(RandomizedRunner.java:772)
at com.carrotsearch.randomizedtesting.RandomizedRunner$5.evaluate(RandomizedRunner.java:783)
at com.carrotsearch.randomizedtesting.rules.StatementAdapter.evaluate(StatementAdapter.java:36)
at com.carrotsearch.randomizedtesting.rules.SystemPropertiesRestoreRule$1.evaluate(SystemPropertiesRestoreRule.java:53)
at org.apache.lucene.util.AbstractBeforeAfterRule$1.evaluate(AbstractBeforeAfterRule.java:46)
at org.apache.lucene.util.TestRuleStoreClassName$1.evaluate(TestRuleStoreClassName.java:42)
at com.carrotsearch.randomizedtesting.rules.SystemPropertiesInvariantRule$1.evaluate(SystemPropertiesInvariantRule.java:55)
at com.carrotsearch.randomizedtesting.rules.NoShadowingOrOverridesOnMethodsRule$1.evaluate(NoShadowingOrOverridesOnMethodsRule.java:39)
at com.carrotsearch.randomizedtesting.rules.NoShadowingOrOverridesOnMethodsRule$1.evaluate(NoShadowingOrOverridesOnMethodsRule.java:39)
at com.carrotsearch.randomizedtesting.rules.StatementAdapter.evaluate(StatementAdapter.java:36)
at com.carrotsearch.randomizedtesting.rules.StatementAdapter.evaluate(StatementAdapter.java:36)
at com.carrotsearch.randomizedtesting.rules.StatementAdapter.evaluate(StatementAdapter.java:36)
at org.apache.lucene.util.TestRuleAssertionsRequired$1.evaluate(TestRuleAssertionsRequired.java:43)
at org.apache.lucene.util.TestRuleMarkFailure$1.evaluate(TestRuleMarkFailure.java:48)
at org.apache.lucene.util.TestRuleIgnoreAfterMaxFailures$1.evaluate(TestRuleIgnoreAfterMaxFailures.java:65)
at org.apache.lucene.util.TestRuleIgnoreTestSuites$1.evaluate(TestRuleIgnoreTestSuites.java:55)
at com.carrotsearch.randomizedtesting.rules.StatementAdapter.evaluate(StatementAdapter.java:36)
at com.carrotsearch.randomizedtesting.ThreadLeakControl$StatementRunner.run(ThreadLeakControl.java:365)
at java.lang.Thread.run(Thread.java:745)
Caused by: org.apache.solr.client.solrj.impl.HttpSolrServer$RemoteSolrException: Could not remove replica : customcollreplicadeletion/a/core_node1
at org.apache.solr.client.solrj.impl.HttpSolrServer.executeMethod(HttpSolrServer.java:568)
at org.apache.solr.client.solrj.impl.HttpSolrServer.request(HttpSolrServer.java:215)
at org.apache.solr.client.solrj.impl.HttpSolrServer.request(HttpSolrServer.java:211)
at org.apache.solr.client.solrj.impl.LBHttpSolrServer.doRequest(LBHttpSolrServer.java:343)
at org.apache.solr.client.solrj.impl.LBHttpSolrServer.request(LBHttpSolrServer.java:304)
... 46 more
Build Log:
[...truncated 11508 lines...]
[junit4] Suite: org.apache.solr.cloud.DeleteLastCustomShardedReplicaTest
[junit4] 2> Creating dataDir: /usr/home/jenkins/jenkins-slave/workspace/Lucene-Solr-Tests-5.x-Java7/solr/build/solr-core/test/J3/temp/solr.cloud.DeleteLastCustomShardedReplicaTest-B0D616B7E0527FAC-001/init-core-data-001
[junit4] 2> 1592319 T3812 oas.SolrTestCaseJ4.buildSSLConfig Randomized ssl (false) and clientAuth (false)
[junit4] 2> 1592319 T3812 oas.BaseDistributedSearchTestCase.initHostContext Setting hostContext system property: /
[junit4] 2> 1592323 T3812 oas.SolrTestCaseJ4.setUp ###Starting testDistribSearch
[junit4] 2> 1592323 T3812 oasc.ZkTestServer.run STARTING ZK TEST SERVER
[junit4] 1> client port:0.0.0.0/0.0.0.0:0
[junit4] 2> 1592324 T3813 oasc.ZkTestServer$ZKServerMain.runFromConfig Starting server
[junit4] 2> 1592424 T3812 oasc.ZkTestServer.run start zk server on port:38237
[junit4] 2> 1592425 T3812 oascc.SolrZkClient.createZkCredentialsToAddAutomatically Using default ZkCredentialsProvider
[junit4] 2> 1592426 T3812 oascc.ConnectionManager.waitForConnected Waiting for client to connect to ZooKeeper
[junit4] 2> 1592429 T3819 oascc.ConnectionManager.process Watcher org.apache.solr.common.cloud.ConnectionManager@8aaed4e name:ZooKeeperConnection Watcher:127.0.0.1:38237 got event WatchedEvent state:SyncConnected type:None path:null path:null type:None
[junit4] 2> 1592429 T3812 oascc.ConnectionManager.waitForConnected Client is connected to ZooKeeper
[junit4] 2> 1592429 T3812 oascc.SolrZkClient.createZkACLProvider Using default ZkACLProvider
[junit4] 2> 1592429 T3812 oascc.SolrZkClient.makePath makePath: /solr
[junit4] 2> 1592431 T3812 oascc.SolrZkClient.createZkCredentialsToAddAutomatically Using default ZkCredentialsProvider
[junit4] 2> 1592432 T3812 oascc.ConnectionManager.waitForConnected Waiting for client to connect to ZooKeeper
[junit4] 2> 1592433 T3821 oascc.ConnectionManager.process Watcher org.apache.solr.common.cloud.ConnectionManager@665c15c5 name:ZooKeeperConnection Watcher:127.0.0.1:38237/solr got event WatchedEvent state:SyncConnected type:None path:null path:null type:None
[junit4] 2> 1592433 T3812 oascc.ConnectionManager.waitForConnected Client is connected to ZooKeeper
[junit4] 2> 1592433 T3812 oascc.SolrZkClient.createZkACLProvider Using default ZkACLProvider
[junit4] 2> 1592433 T3812 oascc.SolrZkClient.makePath makePath: /collections/collection1
[junit4] 2> 1592435 T3812 oascc.SolrZkClient.makePath makePath: /collections/collection1/shards
[junit4] 2> 1592436 T3812 oascc.SolrZkClient.makePath makePath: /collections/control_collection
[junit4] 2> 1592437 T3812 oascc.SolrZkClient.makePath makePath: /collections/control_collection/shards
[junit4] 2> 1592438 T3812 oasc.AbstractZkTestCase.putConfig put /usr/home/jenkins/jenkins-slave/workspace/Lucene-Solr-Tests-5.x-Java7/solr/core/src/test-files/solr/collection1/conf/solrconfig-tlog.xml to /configs/conf1/solrconfig.xml
[junit4] 2> 1592439 T3812 oascc.SolrZkClient.makePath makePath: /configs/conf1/solrconfig.xml
[junit4] 2> 1592440 T3812 oasc.AbstractZkTestCase.putConfig put /usr/home/jenkins/jenkins-slave/workspace/Lucene-Solr-Tests-5.x-Java7/solr/core/src/test-files/solr/collection1/conf/schema.xml to /configs/conf1/schema.xml
[junit4] 2> 1592441 T3812 oascc.SolrZkClient.makePath makePath: /configs/conf1/schema.xml
[junit4] 2> 1592543 T3812 oasc.AbstractZkTestCase.putConfig put /usr/home/jenkins/jenkins-slave/workspace/Lucene-Solr-Tests-5.x-Java7/solr/core/src/test-files/solr/collection1/conf/solrconfig.snippet.randomindexconfig.xml to /configs/conf1/solrconfig.snippet.randomindexconfig.xml
[junit4] 2> 1592543 T3812 oascc.SolrZkClient.makePath makePath: /configs/conf1/solrconfig.snippet.randomindexconfig.xml
[junit4] 2> 1592545 T3812 oasc.AbstractZkTestCase.putConfig put /usr/home/jenkins/jenkins-slave/workspace/Lucene-Solr-Tests-5.x-Java7/solr/core/src/test-files/solr/collection1/conf/stopwords.txt to /configs/conf1/stopwords.txt
[junit4] 2> 1592545 T3812 oascc.SolrZkClient.makePath makePath: /configs/conf1/stopwords.txt
[junit4] 2> 1592547 T3812 oasc.AbstractZkTestCase.putConfig put /usr/home/jenkins/jenkins-slave/workspace/Lucene-Solr-Tests-5.x-Java7/solr/core/src/test-files/solr/collection1/conf/protwords.txt to /configs/conf1/protwords.txt
[junit4] 2> 1592547 T3812 oascc.SolrZkClient.makePath makePath: /configs/conf1/protwords.txt
[junit4] 2> 1592549 T3812 oasc.AbstractZkTestCase.putConfig put /usr/home/jenkins/jenkins-slave/workspace/Lucene-Solr-Tests-5.x-Java7/solr/core/src/test-files/solr/collection1/conf/currency.xml to /configs/conf1/currency.xml
[junit4] 2> 1592549 T3812 oascc.SolrZkClient.makePath makePath: /configs/conf1/currency.xml
[junit4] 2> 1592550 T3812 oasc.AbstractZkTestCase.putConfig put /usr/home/jenkins/jenkins-slave/workspace/Lucene-Solr-Tests-5.x-Java7/solr/core/src/test-files/solr/collection1/conf/enumsConfig.xml to /configs/conf1/enumsConfig.xml
[junit4] 2> 1592551 T3812 oascc.SolrZkClient.makePath makePath: /configs/conf1/enumsConfig.xml
[junit4] 2> 1592552 T3812 oasc.AbstractZkTestCase.putConfig put /usr/home/jenkins/jenkins-slave/workspace/Lucene-Solr-Tests-5.x-Java7/solr/core/src/test-files/solr/collection1/conf/open-exchange-rates.json to /configs/conf1/open-exchange-rates.json
[junit4] 2> 1592553 T3812 oascc.SolrZkClient.makePath makePath: /configs/conf1/open-exchange-rates.json
[junit4] 2> 1592554 T3812 oasc.AbstractZkTestCase.putConfig put /usr/home/jenkins/jenkins-slave/workspace/Lucene-Solr-Tests-5.x-Java7/solr/core/src/test-files/solr/collection1/conf/mapping-ISOLatin1Accent.txt to /configs/conf1/mapping-ISOLatin1Accent.txt
[junit4] 2> 1592555 T3812 oascc.SolrZkClient.makePath makePath: /configs/conf1/mapping-ISOLatin1Accent.txt
[junit4] 2> 1592556 T3812 oasc.AbstractZkTestCase.putConfig put /usr/home/jenkins/jenkins-slave/workspace/Lucene-Solr-Tests-5.x-Java7/solr/core/src/test-files/solr/collection1/conf/old_synonyms.txt to /configs/conf1/old_synonyms.txt
[junit4] 2> 1592556 T3812 oascc.SolrZkClient.makePath makePath: /configs/conf1/old_synonyms.txt
[junit4] 2> 1592558 T3812 oasc.AbstractZkTestCase.putConfig put /usr/home/jenkins/jenkins-slave/workspace/Lucene-Solr-Tests-5.x-Java7/solr/core/src/test-files/solr/collection1/conf/synonyms.txt to /configs/conf1/synonyms.txt
[junit4] 2> 1592558 T3812 oascc.SolrZkClient.makePath makePath: /configs/conf1/synonyms.txt
[junit4] 2> 1593884 T3812 oejs.Server.doStart jetty-8.1.10.v20130312
[junit4] 2> 1593888 T3812 oejs.AbstractConnector.doStart Started SocketConnector@127.0.0.1:37130
[junit4] 2> 1593889 T3812 oass.SolrDispatchFilter.init SolrDispatchFilter.init()
[junit4] 2> 1593889 T3812 oasc.SolrResourceLoader.locateSolrHome JNDI not configured for solr (NoInitialContextEx)
[junit4] 2> 1593889 T3812 oasc.SolrResourceLoader.locateSolrHome using system property solr.solr.home: /usr/home/jenkins/jenkins-slave/workspace/Lucene-Solr-Tests-5.x-Java7/solr/build/solr-core/test/J3/temp/solr.cloud.DeleteLastCustomShardedReplicaTest-B0D616B7E0527FAC-001/tempDir-002
[junit4] 2> 1593890 T3812 oasc.SolrResourceLoader.<init> new SolrResourceLoader for directory: '/usr/home/jenkins/jenkins-slave/workspace/Lucene-Solr-Tests-5.x-Java7/solr/build/solr-core/test/J3/temp/solr.cloud.DeleteLastCustomShardedReplicaTest-B0D616B7E0527FAC-001/tempDir-002/'
[junit4] 2> 1593939 T3812 oasc.ConfigSolr.fromFile Loading container configuration from /usr/home/jenkins/jenkins-slave/workspace/Lucene-Solr-Tests-5.x-Java7/solr/build/solr-core/test/J3/temp/solr.cloud.DeleteLastCustomShardedReplicaTest-B0D616B7E0527FAC-001/tempDir-002/solr.xml
[junit4] 2> 1594016 T3812 oasc.CorePropertiesLocator.<init> Config-defined core root directory: /usr/home/jenkins/jenkins-slave/workspace/Lucene-Solr-Tests-5.x-Java7/solr/build/solr-core/test/J3/temp/solr.cloud.DeleteLastCustomShardedReplicaTest-B0D616B7E0527FAC-001/tempDir-002
[junit4] 2> 1594017 T3812 oasc.CoreContainer.<init> New CoreContainer 425993305
[junit4] 2> 1594017 T3812 oasc.CoreContainer.load Loading cores into CoreContainer [instanceDir=/usr/home/jenkins/jenkins-slave/workspace/Lucene-Solr-Tests-5.x-Java7/solr/build/solr-core/test/J3/temp/solr.cloud.DeleteLastCustomShardedReplicaTest-B0D616B7E0527FAC-001/tempDir-002/]
[junit4] 2> 1594018 T3812 oashc.HttpShardHandlerFactory.getParameter Setting socketTimeout to: 90000
[junit4] 2> 1594019 T3812 oashc.HttpShardHandlerFactory.getParameter Setting urlScheme to:
[junit4] 2> 1594019 T3812 oashc.HttpShardHandlerFactory.getParameter Setting connTimeout to: 15000
[junit4] 2> 1594020 T3812 oashc.HttpShardHandlerFactory.getParameter Setting maxConnectionsPerHost to: 20
[junit4] 2> 1594020 T3812 oashc.HttpShardHandlerFactory.getParameter Setting corePoolSize to: 0
[junit4] 2> 1594021 T3812 oashc.HttpShardHandlerFactory.getParameter Setting maximumPoolSize to: 2147483647
[junit4] 2> 1594021 T3812 oashc.HttpShardHandlerFactory.getParameter Setting maxThreadIdleTime to: 5
[junit4] 2> 1594022 T3812 oashc.HttpShardHandlerFactory.getParameter Setting sizeOfQueue to: -1
[junit4] 2> 1594022 T3812 oashc.HttpShardHandlerFactory.getParameter Setting fairnessPolicy to: false
[junit4] 2> 1594023 T3812 oasu.UpdateShardHandler.<init> Creating UpdateShardHandler HTTP client with params: socketTimeout=340000&connTimeout=45000&retry=false
[junit4] 2> 1594023 T3812 oasl.LogWatcher.createWatcher SLF4J impl is org.slf4j.impl.Log4jLoggerFactory
[junit4] 2> 1594024 T3812 oasl.LogWatcher.newRegisteredLogWatcher Registering Log Listener [Log4j (org.slf4j.impl.Log4jLoggerFactory)]
[junit4] 2> 1594024 T3812 oasc.CoreContainer.load Host Name: 127.0.0.1
[junit4] 2> 1594024 T3812 oasc.ZkContainer.initZooKeeper Zookeeper client=127.0.0.1:38237/solr
[junit4] 2> 1594025 T3812 oasc.ZkController.checkChrootPath zkHost includes chroot
[junit4] 2> 1594025 T3812 oascc.SolrZkClient.createZkCredentialsToAddAutomatically Using default ZkCredentialsProvider
[junit4] 2> 1594026 T3812 oascc.ConnectionManager.waitForConnected Waiting for client to connect to ZooKeeper
[junit4] 2> 1594027 T3832 oascc.ConnectionManager.process Watcher org.apache.solr.common.cloud.ConnectionManager@7d8e5c14 name:ZooKeeperConnection Watcher:127.0.0.1:38237 got event WatchedEvent state:SyncConnected type:None path:null path:null type:None
[junit4] 2> 1594028 T3812 oascc.ConnectionManager.waitForConnected Client is connected to ZooKeeper
[junit4] 2> 1594029 T3812 oascc.SolrZkClient.createZkACLProvider Using default ZkACLProvider
[junit4] 2> 1594030 T3812 oascc.ConnectionManager.waitForConnected Waiting for client to connect to ZooKeeper
[junit4] 2> 1594032 T3834 oascc.ConnectionManager.process Watcher org.apache.solr.common.cloud.ConnectionManager@736ff5b8 name:ZooKeeperConnection Watcher:127.0.0.1:38237/solr got event WatchedEvent state:SyncConnected type:None path:null path:null type:None
[junit4] 2> 1594032 T3812 oascc.ConnectionManager.waitForConnected Client is connected to ZooKeeper
[junit4] 2> 1594033 T3812 oascc.SolrZkClient.makePath makePath: /overseer/queue
[junit4] 2> 1594035 T3812 oascc.SolrZkClient.makePath makePath: /overseer/collection-queue-work
[junit4] 2> 1594037 T3812 oascc.SolrZkClient.makePath makePath: /overseer/collection-map-running
[junit4] 2> 1594039 T3812 oascc.SolrZkClient.makePath makePath: /overseer/collection-map-completed
[junit4] 2> 1594041 T3812 oascc.SolrZkClient.makePath makePath: /overseer/collection-map-failure
[junit4] 2> 1594042 T3812 oascc.SolrZkClient.makePath makePath: /live_nodes
[junit4] 2> 1594043 T3812 oasc.ZkController.createEphemeralLiveNode Register node as live in ZooKeeper:/live_nodes/127.0.0.1:37130_
[junit4] 2> 1594044 T3812 oascc.SolrZkClient.makePath makePath: /live_nodes/127.0.0.1:37130_
[junit4] 2> 1594046 T3812 oascc.SolrZkClient.makePath makePath: /overseer_elect
[junit4] 2> 1594047 T3812 oascc.SolrZkClient.makePath makePath: /overseer_elect/election
[junit4] 2> 1594048 T3812 oasc.Overseer.close Overseer (id=null) closing
[junit4] 2> 1594050 T3812 oasc.OverseerElectionContext.runLeaderProcess I am going to be the leader 127.0.0.1:37130_
[junit4] 2> 1594050 T3812 oascc.SolrZkClient.makePath makePath: /overseer_elect/leader
[junit4] 2> 1594051 T3812 oasc.Overseer.start Overseer (id=92547054845362179-127.0.0.1:37130_-n_0000000000) starting
[junit4] 2> 1594053 T3812 oascc.SolrZkClient.makePath makePath: /overseer/queue-work
[junit4] 2> 1594059 T3812 oasc.OverseerAutoReplicaFailoverThread.<init> Starting OverseerAutoReplicaFailoverThread autoReplicaFailoverWorkLoopDelay=10000 autoReplicaFailoverWaitAfterExpiration=10000 autoReplicaFailoverBadNodeExpiration=60000
[junit4] 2> 1594060 T3836 oasc.OverseerCollectionProcessor.run Process current queue of collection creations
[junit4] 2> 1594061 T3812 oascc.SolrZkClient.makePath makePath: /clusterstate.json
[junit4] 2> 1594063 T3812 oascc.SolrZkClient.makePath makePath: /aliases.json
[junit4] 2> 1594064 T3812 oascc.ZkStateReader.createClusterStateWatchersAndUpdate Updating cluster state from ZooKeeper...
[junit4] 2> 1594066 T3835 oasc.Overseer$ClusterStateUpdater.run Starting to work on the main queue
[junit4] 2> 1594068 T3812 oasc.CorePropertiesLocator.discover Looking for core definitions underneath /usr/home/jenkins/jenkins-slave/workspace/Lucene-Solr-Tests-5.x-Java7/solr/build/solr-core/test/J3/temp/solr.cloud.DeleteLastCustomShardedReplicaTest-B0D616B7E0527FAC-001/tempDir-002
[junit4] 2> 1594865 T3812 oasc.CorePropertiesLocator.discoverUnder Found core conf in /usr/home/jenkins/jenkins-slave/workspace/Lucene-Solr-Tests-5.x-Java7/solr/build/solr-core/test/J3/temp/solr.cloud.DeleteLastCustomShardedReplicaTest-B0D616B7E0527FAC-001/tempDir-002/conf/
[junit4] 2> 1594876 T3812 oasc.CorePropertiesLocator.discover Found 1 core definitions
[junit4] 2> 1594877 T3812 oass.SolrDispatchFilter.init user.dir=/usr/home/jenkins/jenkins-slave/workspace/Lucene-Solr-Tests-5.x-Java7/solr/build/solr-core/test/J3
[junit4] 2> 1594877 T3812 oass.SolrDispatchFilter.init SolrDispatchFilter.init() done
[junit4] 2> 1594878 T3812 oascc.SolrZkClient.createZkCredentialsToAddAutomatically Using default ZkCredentialsProvider
[junit4] 2> 1594878 T3812 oascc.ConnectionManager.waitForConnected Waiting for client to connect to ZooKeeper
[junit4] 2> 1594880 T3840 oascc.ConnectionManager.process Watcher org.apache.solr.common.cloud.ConnectionManager@61956a11 name:ZooKeeperConnection Watcher:127.0.0.1:38237/solr got event WatchedEvent state:SyncConnected type:None path:null path:null type:None
[junit4] 2> 1594880 T3812 oascc.ConnectionManager.waitForConnected Client is connected to ZooKeeper
[junit4] 2> 1594880 T3812 oascc.SolrZkClient.createZkACLProvider Using default ZkACLProvider
[junit4] 2> 1594881 T3812 oascc.ZkStateReader.createClusterStateWatchersAndUpdate Updating cluster state from ZooKeeper...
[junit4] 2> 1594883 T3812 oasc.ChaosMonkey.monkeyLog monkey: init - expire sessions:false cause connection loss:false
[junit4] 2> 1594883 T3812 oasc.AbstractFullDistribZkTestBase.createJettys Creating collection1 with stateFormat=2
[junit4] 2> 1594883 T3812 oascc.SolrZkClient.createZkCredentialsToAddAutomatically Using default ZkCredentialsProvider
[junit4] 2> 1594884 T3812 oascc.ConnectionManager.waitForConnected Waiting for client to connect to ZooKeeper
[junit4] 2> 1594885 T3842 oascc.ConnectionManager.process Watcher org.apache.solr.common.cloud.ConnectionManager@2b937eb6 name:ZooKeeperConnection Watcher:127.0.0.1:38237/solr got event WatchedEvent state:SyncConnected type:None path:null path:null type:None
[junit4] 2> 1594885 T3812 oascc.ConnectionManager.waitForConnected Client is connected to ZooKeeper
[junit4] 2> 1594886 T3812 oascc.SolrZkClient.createZkACLProvider Using default ZkACLProvider
[junit4] 2> 1594888 T3843 oasc.DistributedQueue$LatchChildWatcher.process LatchChildWatcher fired on path: /overseer/queue state: SyncConnected type NodeChildrenChanged
[junit4] 2> 1594889 T3835 oasc.Overseer$ClusterStateUpdater.buildCollection building a new collection: collection1
[junit4] 2> 1594890 T3835 oasc.Overseer$ClusterStateUpdater.createCollection Create collection collection1 with shards [shard1, shard2]
[junit4] 2> 1594890 T3835 oasc.Overseer$ClusterStateUpdater.createCollection state version collection1 2
[junit4] 2> 1594892 T3835 oasc.Overseer$ClusterStateUpdater.updateZkStates going to create_collection /collections/collection1/state.json
[junit4] 2> 1594893 T3843 oascc.ZkStateReader$2.process A cluster state change: WatchedEvent state:SyncConnected type:NodeDataChanged path:/clusterstate.json, has occurred - updating... (live nodes size: 1)
[junit4] 2> 1594893 T3844 oascc.ZkStateReader$2.process A cluster state change: WatchedEvent state:SyncConnected type:NodeDataChanged path:/clusterstate.json, has occurred - updating... (live nodes size: 1)
[junit4] 2> 1596287 T3812 oasc.AbstractFullDistribZkTestBase.createJettys create jetty 1
[junit4] 2> 1596288 T3812 oejs.Server.doStart jetty-8.1.10.v20130312
[junit4] 2> 1596292 T3812 oejs.AbstractConnector.doStart Started SocketConnector@127.0.0.1:45343
[junit4] 2> 1596292 T3812 oass.SolrDispatchFilter.init SolrDispatchFilter.init()
[junit4] 2> 1596293 T3812 oasc.SolrResourceLoader.locateSolrHome JNDI not configured for solr (NoInitialContextEx)
[junit4] 2> 1596293 T3812 oasc.SolrResourceLoader.locateSolrHome using system property solr.solr.home: ../../../../../../../../../../../usr/home/jenkins/jenkins-slave/workspace/Lucene-Solr-Tests-5.x-Java7/solr/build/solr-core/test/J3/temp/solr.cloud.DeleteLastCustomShardedReplicaTest-B0D616B7E0527FAC-001/tempDir-003
[junit4] 2> 1596293 T3812 oasc.SolrResourceLoader.<init> new SolrResourceLoader for directory: '../../../../../../../../../../../usr/home/jenkins/jenkins-slave/workspace/Lucene-Solr-Tests-5.x-Java7/solr/build/solr-core/test/J3/temp/solr.cloud.DeleteLastCustomShardedReplicaTest-B0D616B7E0527FAC-001/tempDir-003/'
[junit4] 2> 1596339 T3812 oasc.ConfigSolr.fromFile Loading container configuration from /usr/home/jenkins/jenkins-slave/workspace/Lucene-Solr-Tests-5.x-Java7/solr/build/solr-core/test/J3/../../../../../../../../../../../usr/home/jenkins/jenkins-slave/workspace/Lucene-Solr-Tests-5.x-Java7/solr/build/solr-core/test/J3/temp/solr.cloud.DeleteLastCustomShardedReplicaTest-B0D616B7E0527FAC-001/tempDir-003/solr.xml
[junit4] 2> 1596383 T3812 oasc.CorePropertiesLocator.<init> Config-defined core root directory: /usr/home/jenkins/jenkins-slave/workspace/Lucene-Solr-Tests-5.x-Java7/solr/build/solr-core/test/J3/../../../../../../../../../../../usr/home/jenkins/jenkins-slave/workspace/Lucene-Solr-Tests-5.x-Java7/solr/build/solr-core/test/J3/temp/solr.cloud.DeleteLastCustomShardedReplicaTest-B0D616B7E0527FAC-001/tempDir-003
[junit4] 2> 1596383 T3812 oasc.CoreContainer.<init> New CoreContainer 2068385892
[junit4] 2> 1596384 T3812 oasc.CoreContainer.load Loading cores into CoreContainer [instanceDir=../../../../../../../../../../../usr/home/jenkins/jenkins-slave/workspace/Lucene-Solr-Tests-5.x-Java7/solr/build/solr-core/test/J3/temp/solr.cloud.DeleteLastCustomShardedReplicaTest-B0D616B7E0527FAC-001/tempDir-003/]
[junit4] 2> 1596385 T3812 oashc.HttpShardHandlerFactory.getParameter Setting socketTimeout to: 90000
[junit4] 2> 1596385 T3812 oashc.HttpShardHandlerFactory.getParameter Setting urlScheme to:
[junit4] 2> 1596385 T3812 oashc.HttpShardHandlerFactory.getParameter Setting connTimeout to: 15000
[junit4] 2> 1596385 T3812 oashc.HttpShardHandlerFactory.getParameter Setting maxConnectionsPerHost to: 20
[junit4] 2> 1596385 T3812 oashc.HttpShardHandlerFactory.getParameter Setting corePoolSize to: 0
[junit4] 2> 1596386 T3812 oashc.HttpShardHandlerFactory.getParameter Setting maximumPoolSize to: 2147483647
[junit4] 2> 1596386 T3812 oashc.HttpShardHandlerFactory.getParameter Setting maxThreadIdleTime to: 5
[junit4] 2> 1596386 T3812 oashc.HttpShardHandlerFactory.getParameter Setting sizeOfQueue to: -1
[junit4] 2> 1596386 T3812 oashc.HttpShardHandlerFactory.getParameter Setting fairnessPolicy to: false
[junit4] 2> 1596387 T3812 oasu.UpdateShardHandler.<init> Creating UpdateShardHandler HTTP client with params: socketTimeout=340000&connTimeout=45000&retry=false
[junit4] 2> 1596387 T3812 oasl.LogWatcher.createWatcher SLF4J impl is org.slf4j.impl.Log4jLoggerFactory
[junit4] 2> 1596387 T3812 oasl.LogWatcher.newRegisteredLogWatcher Registering Log Listener [Log4j (org.slf4j.impl.Log4jLoggerFactory)]
[junit4] 2> 1596388 T3812 oasc.CoreContainer.load Host Name: 127.0.0.1
[junit4] 2> 1596388 T3812 oasc.ZkContainer.initZooKeeper Zookeeper client=127.0.0.1:38237/solr
[junit4] 2> 1596388 T3812 oasc.ZkController.checkChrootPath zkHost includes chroot
[junit4] 2> 1596388 T3812 oascc.SolrZkClient.createZkCredentialsToAddAutomatically Using default ZkCredentialsProvider
[junit4] 2> 1596389 T3812 oascc.ConnectionManager.waitForConnected Waiting for client to connect to ZooKeeper
[junit4] 2> 1596391 T3855 oascc.ConnectionManager.process Watcher org.apache.solr.common.cloud.ConnectionManager@79d35477 name:ZooKeeperConnection Watcher:127.0.0.1:38237 got event WatchedEvent state:SyncConnected type:None path:null path:null type:None
[junit4] 2> 1596391 T3812 oascc.ConnectionManager.waitForConnected Client is connected to ZooKeeper
[junit4] 2> 1596392 T3812 oascc.SolrZkClient.createZkACLProvider Using default ZkACLProvider
[junit4] 2> 1596393 T3812 oascc.ConnectionManager.waitForConnected Waiting for client to connect to ZooKeeper
[junit4] 2> 1596394 T3857 oascc.ConnectionManager.process Watcher org.apache.solr.common.cloud.ConnectionManager@28876513 name:ZooKeeperConnection Watcher:127.0.0.1:38237/solr got event WatchedEvent state:SyncConnected type:None path:null path:null type:None
[junit4] 2> 1596395 T3812 oascc.ConnectionManager.waitForConnected Client is connected to ZooKeeper
[junit4] 2> 1596399 T3812 oascc.ZkStateReader.createClusterStateWatchersAndUpdate Updating cluster state from ZooKeeper...
[junit4] 2> 1597403 T3812 oasc.ZkController.createEphemeralLiveNode Register node as live in ZooKeeper:/live_nodes/127.0.0.1:45343_
[junit4] 2> 1597404 T3812 oascc.SolrZkClient.makePath makePath: /live_nodes/127.0.0.1:45343_
[junit4] 2> 1597407 T3812 oasc.Overseer.close Overseer (id=null) closing
[junit4] 2> 1597411 T3812 oasc.CorePropertiesLocator.discover Looking for core definitions underneath /usr/home/jenkins/jenkins-slave/workspace/Lucene-Solr-Tests-5.x-Java7/solr/build/solr-core/test/J3/../../../../../../../../../../../usr/home/jenkins/jenkins-slave/workspace/Lucene-Solr-Tests-5.x-Java7/solr/build/solr-core/test/J3/temp/solr.cloud.DeleteLastCustomShardedReplicaTest-B0D616B7E0527FAC-001/tempDir-003
[junit4] 2> 1597500 T3812 oasc.CorePropertiesLocator.discoverUnder Found core conf in /usr/home/jenkins/jenkins-slave/workspace/Lucene-Solr-Tests-5.x-Java7/solr/build/solr-core/test/J3/../../../../../../../../../../../usr/home/jenkins/jenkins-slave/workspace/Lucene-Solr-Tests-5.x-Java7/solr/build/solr-core/test/J3/temp/solr.cloud.DeleteLastCustomShardedReplicaTest-B0D616B7E0527FAC-001/tempDir-003/conf/
[junit4] 2> 1598981 T3812 oasc.CorePropertiesLocator.discover Found 1 core definitions
[junit4] 2> 1598982 T3812 oass.SolrDispatchFilter.init user.dir=/usr/home/jenkins/jenkins-slave/workspace/Lucene-Solr-Tests-5.x-Java7/solr/build/solr-core/test/J3
[junit4] 2> 1598982 T3812 oass.SolrDispatchFilter.init SolrDispatchFilter.init() done
[junit4] 2> 1599863 T3812 oasc.AbstractFullDistribZkTestBase.createJettys create jetty 2
[junit4] 2> 1599864 T3812 oejs.Server.doStart jetty-8.1.10.v20130312
[junit4] 2> 1599867 T3812 oejs.AbstractConnector.doStart Started SocketConnector@127.0.0.1:45346
[junit4] 2> 1599867 T3812 oass.SolrDispatchFilter.init SolrDispatchFilter.init()
[junit4] 2> 1599868 T3812 oasc.SolrResourceLoader.locateSolrHome JNDI not configured for solr (NoInitialContextEx)
[junit4] 2> 1599868 T3812 oasc.SolrResourceLoader.locateSolrHome using system property solr.solr.home: /usr/home/jenkins/jenkins-slave/workspace/Lucene-Solr-Tests-5.x-Java7/solr/build/solr-core/test/J3/temp/solr.cloud.DeleteLastCustomShardedReplicaTest-B0D616B7E0527FAC-001/tempDir-004
[junit4] 2> 1599868 T3812 oasc.SolrResourceLoader.<init> new SolrResourceLoader for directory: '/usr/home/jenkins/jenkins-slave/workspace/Lucene-Solr-Tests-5.x-Java7/solr/build/solr-core/test/J3/temp/solr.cloud.DeleteLastCustomShardedReplicaTest-B0D616B7E0527FAC-001/tempDir-004/'
[junit4] 2> 1599897 T3812 oasc.ConfigSolr.fromFile Loading container configuration from /usr/home/jenkins/jenkins-slave/workspace/Lucene-Solr-Tests-5.x-Java7/solr/build/solr-core/test/J3/temp/solr.cloud.DeleteLastCustomShardedReplicaTest-B0D616B7E0527FAC-001/tempDir-004/solr.xml
[junit4] 2> 1599938 T3812 oasc.CorePropertiesLocator.<init> Config-defined core root directory: /usr/home/jenkins/jenkins-slave/workspace/Lucene-Solr-Tests-5.x-Java7/solr/build/solr-core/test/J3/temp/solr.cloud.DeleteLastCustomShardedReplicaTest-B0D616B7E0527FAC-001/tempDir-004
[junit4] 2> 1599939 T3812 oasc.CoreContainer.<init> New CoreContainer 731401142
[junit4] 2> 1599939 T3812 oasc.CoreContainer.load Loading cores into CoreContainer [instanceDir=/usr/home/jenkins/jenkins-slave/workspace/Lucene-Solr-Tests-5.x-Java7/solr/build/solr-core/test/J3/temp/solr.cloud.DeleteLastCustomShardedReplicaTest-B0D616B7E0527FAC-001/tempDir-004/]
[junit4] 2> 1599940 T3812 oashc.HttpShardHandlerFactory.getParameter Setting socketTimeout to: 90000
[junit4] 2> 1599940 T3812 oashc.HttpShardHandlerFactory.getParameter Setting urlScheme to:
[junit4] 2> 1599940 T3812 oashc.HttpShardHandlerFactory.getParameter Setting connTimeout to: 15000
[junit4] 2> 1599941 T3812 oashc.HttpShardHandlerFactory.getParameter Setting maxConnectionsPerHost to: 20
[junit4] 2> 1599941 T3812 oashc.HttpShardHandlerFactory.getParameter Setting corePoolSize to: 0
[junit4] 2> 1599941 T3812 oashc.HttpShardHandlerFactory.getParameter Setting maximumPoolSize to: 2147483647
[junit4] 2> 1599941 T3812 oashc.HttpShardHandlerFactory.getParameter Setting maxThreadIdleTime to: 5
[junit4] 2> 1599942 T3812 oashc.HttpShardHandlerFactory.getParameter Setting sizeOfQueue to: -1
[junit4] 2> 1599942 T3812 oashc.HttpShardHandlerFactory.getParameter Setting fairnessPolicy to: false
[junit4] 2> 1599942 T3812 oasu.UpdateShardHandler.<init> Creating UpdateShardHandler HTTP client with params: socketTimeout=340000&connTimeout=45000&retry=false
[junit4] 2> 1599943 T3812 oasl.LogWatcher.createWatcher SLF4J impl is org.slf4j.impl.Log4jLoggerFactory
[junit4] 2> 1599943 T3812 oasl.LogWatcher.newRegisteredLogWatcher Registering Log Listener [Log4j (org.slf4j.impl.Log4jLoggerFactory)]
[junit4] 2> 1599943 T3812 oasc.CoreContainer.load Host Name: 127.0.0.1
[junit4] 2> 1599943 T3812 oasc.ZkContainer.initZooKeeper Zookeeper client=127.0.0.1:38237/solr
[junit4] 2> 1599944 T3812 oasc.ZkController.checkChrootPath zkHost includes chroot
[junit4] 2> 1599944 T3812 oascc.SolrZkClient.createZkCredentialsToAddAutomatically Using default ZkCredentialsProvider
[junit4] 2> 1599945 T3812 oascc.ConnectionManager.waitForConnected Waiting for client to connect to ZooKeeper
[junit4] 2> 1599946 T3870 oascc.ConnectionManager.process Watcher org.apache.solr.common.cloud.ConnectionManager@1b92b016 name:ZooKeeperConnection Watcher:127.0.0.1:38237 got event WatchedEvent state:SyncConnected type:None path:null path:null type:None
[junit4] 2> 1599947 T3812 oascc.ConnectionManager.waitForConnected Client is connected to ZooKeeper
[junit4] 2> 1599947 T3812 oascc.SolrZkClient.createZkACLProvider Using default ZkACLProvider
[junit4] 2> 1599949 T3812 oascc.ConnectionManager.waitForConnected Waiting for client to connect to ZooKeeper
[junit4] 2> 1599950 T3872 oascc.ConnectionManager.process Watcher org.apache.solr.common.cloud.ConnectionManager@415510b9 name:ZooKeeperConnection Watcher:127.0.0.1:38237/solr got event WatchedEvent state:SyncConnected type:None path:null path:null type:None
[junit4] 2> 1599950 T3812 oascc.ConnectionManager.waitForConnected Client is connected to ZooKeeper
[junit4] 2> 1599954 T3812 oascc.ZkStateReader.createClusterStateWatchersAndUpdate Updating cluster state from ZooKeeper...
[junit4] 2> 1600958 T3812 oasc.ZkController.createEphemeralLiveNode Register node as live in ZooKeeper:/live_nodes/127.0.0.1:45346_
[junit4] 2> 1600959 T3812 oascc.SolrZkClient.makePath makePath: /live_nodes/127.0.0.1:45346_
[junit4] 2> 1600962 T3812 oasc.Overseer.close Overseer (id=null) closing
[junit4] 2> 1600966 T3812 oasc.CorePropertiesLocator.discover Looking for core definitions underneath /usr/home/jenkins/jenkins-slave/workspace/Lucene-Solr-Tests-5.x-Java7/solr/build/solr-core/test/J3/temp/solr.cloud.DeleteLastCustomShardedReplicaTest-B0D616B7E0527FAC-001/tempDir-004
[junit4] 2> 1600987 T3812 oasc.CorePropertiesLocator.discoverUnder Found core conf in /usr/home/jenkins/jenkins-slave/workspace/Lucene-Solr-Tests-5.x-Java7/solr/build/solr-core/test/J3/temp/solr.cloud.DeleteLastCustomShardedReplicaTest-B0D616B7E0527FAC-001/tempDir-004/conf/
[junit4] 2> 1601970 T3812 oasc.CorePropertiesLocator.discover Found 1 core definitions
[junit4] 2> 1601971 T3812 oass.SolrDispatchFilter.init user.dir=/usr/home/jenkins/jenkins-slave/workspace/Lucene-Solr-Tests-5.x-Java7/solr/build/solr-core/test/J3
[junit4] 2> 1601971 T3812 oass.SolrDispatchFilter.init SolrDispatchFilter.init() done
[junit4] 2> 1601973 T3812 oasc.AbstractFullDistribZkTestBase.createCollection Creating collection with stateFormat=2: customcollreplicadeletion
[junit4] 2> 1601973 T3812 oascc.SolrZkClient.createZkCredentialsToAddAutomatically Using default ZkCredentialsProvider
[junit4] 2> 1601974 T3812 oascc.ConnectionManager.waitForConnected Waiting for client to connect to ZooKeeper
[junit4] 2> 1601975 T3876 oascc.ConnectionManager.process Watcher org.apache.solr.common.cloud.ConnectionManager@56067fb4 name:ZooKeeperConnection Watcher:127.0.0.1:38237/solr got event WatchedEvent state:SyncConnected type:None path:null path:null type:None
[junit4] 2> 1601976 T3812 oascc.ConnectionManager.waitForConnected Client is connected to ZooKeeper
[junit4] 2> 1601976 T3812 oascc.SolrZkClient.createZkACLProvider Using default ZkACLProvider
[junit4] 2> 1601977 T3812 oascc.ZkStateReader.createClusterStateWatchersAndUpdate Updating cluster state from ZooKeeper...
[junit4] 2> 1601981 T3825 oasha.CollectionsHandler.handleCreateAction Creating Collection : replicationFactor=1&stateFormat=2&maxShardsPerNode=5&wt=javabin&shards=a,b&version=2&numShards=1&name=customcollreplicadeletion&router.name=implicit&action=CREATE
[junit4] 2> 1601982 T3843 oasc.DistributedQueue$LatchChildWatcher.process LatchChildWatcher fired on path: /overseer/collection-queue-work state: SyncConnected type NodeChildrenChanged
[junit4] 2> 1601983 T3836 oasc.OverseerCollectionProcessor.run Overseer Collection Processor: Get the message id:/overseer/collection-queue-work/qn-0000000000 message:{
[junit4] 2> "operation":"create",
[junit4] 2> "fromApi":"true",
[junit4] 2> "name":"customcollreplicadeletion",
[junit4] 2> "replicationFactor":"1",
[junit4] 2> "numShards":"1",
[junit4] 2> "maxShardsPerNode":"5",
[junit4] 2> "shards":"a,b",
[junit4] 2> "stateFormat":"2",
[junit4] 2> "router.name":"implicit"}
[junit4] 2> 1601984 T3877 oasc.OverseerCollectionProcessor.processMessage WARN OverseerCollectionProcessor.processMessage : create , {
[junit4] 2> "operation":"create",
[junit4] 2> "fromApi":"true",
[junit4] 2> "name":"customcollreplicadeletion",
[junit4] 2> "replicationFactor":"1",
[junit4] 2> "numShards":"1",
[junit4] 2> "maxShardsPerNode":"5",
[junit4] 2> "shards":"a,b",
[junit4] 2> "stateFormat":"2",
[junit4] 2> "router.name":"implicit"}
[junit4] 2> 1601985 T3877 oasc.OverseerCollectionProcessor.createConfNode Only one config set found in zk - using it:conf1
[junit4] 2> 1601985 T3877 oasc.OverseerCollectionProcessor.createConfNode creating collections conf node /collections/customcollreplicadeletion
[junit4] 2> 1601985 T3877 oascc.SolrZkClient.makePath makePath: /collections/customcollreplicadeletion
[junit4] 2> 1601987 T3843 oasc.DistributedQueue$LatchChildWatcher.process LatchChildWatcher fired on path: /overseer/queue state: SyncConnected type NodeChildrenChanged
[junit4] 2> 1601990 T3835 oasc.Overseer$ClusterStateUpdater.buildCollection building a new collection: customcollreplicadeletion
[junit4] 2> 1601990 T3835 oasc.Overseer$ClusterStateUpdater.createCollection Create collection customcollreplicadeletion with shards [a, b]
[junit4] 2> 1601990 T3835 oasc.Overseer$ClusterStateUpdater.createCollection state version customcollreplicadeletion 2
[junit4] 2> 1601992 T3835 oasc.Overseer$ClusterStateUpdater.updateZkStates going to create_collection /collections/customcollreplicadeletion/state.json
[junit4] 2> 1601992 T3858 oascc.ZkStateReader$2.process A cluster state change: WatchedEvent state:SyncConnected type:NodeDataChanged path:/clusterstate.json, has occurred - updating... (live nodes size: 3)
[junit4] 2> 1601993 T3878 oascc.ZkStateReader$2.process A cluster state change: WatchedEvent state:SyncConnected type:NodeDataChanged path:/clusterstate.json, has occurred - updating... (live nodes size: 3)
[junit4] 2> 1601992 T3844 oascc.ZkStateReader$2.process A cluster state change: WatchedEvent state:SyncConnected type:NodeDataChanged path:/clusterstate.json, has occurred - updating... (live nodes size: 3)
[junit4] 2> 1601993 T3873 oascc.ZkStateReader$2.process A cluster state change: WatchedEvent state:SyncConnected type:NodeDataChanged path:/clusterstate.json, has occurred - updating... (live nodes size: 3)
[junit4] 2> 1601992 T3843 oascc.ZkStateReader$2.process A cluster state change: WatchedEvent state:SyncConnected type:NodeDataChanged path:/clusterstate.json, has occurred - updating... (live nodes size: 3)
[junit4] 2> 1602088 T3877 oasc.OverseerCollectionProcessor.createCollection Creating SolrCores for new collection customcollreplicadeletion, shardNames [a, b] , replicationFactor : 1
[junit4] 2> 1602089 T3877 oasc.OverseerCollectionProcessor.createCollection Creating shard customcollreplicadeletion_a_replica1 as part of slice a of collection customcollreplicadeletion on 127.0.0.1:37130_
[junit4] 2> 1602089 T3877 oasc.OverseerCollectionProcessor.createCollection Creating shard customcollreplicadeletion_b_replica1 as part of slice b of collection customcollreplicadeletion on 127.0.0.1:45343_
[junit4] 2> 1602092 T3824 oasha.CoreAdminHandler.handleCreateAction core create command collection.configName=conf1&shard=a&wt=javabin&qt=/admin/cores&version=2&numShards=2&collection=customcollreplicadeletion&name=customcollreplicadeletion_a_replica1&action=CREATE
[junit4] 2> 1602093 T3847 oasha.CoreAdminHandler.handleCreateAction core create command collection.configName=conf1&shard=b&wt=javabin&qt=/admin/cores&version=2&numShards=2&collection=customcollreplicadeletion&name=customcollreplicadeletion_b_replica1&action=CREATE
[junit4] 2> 1602095 T3824 oasc.ZkController.publish publishing core=customcollreplicadeletion_a_replica1 state=down collection=customcollreplicadeletion
[junit4] 2> 1602097 T3843 oasc.DistributedQueue$LatchChildWatcher.process LatchChildWatcher fired on path: /overseer/queue state: SyncConnected type NodeChildrenChanged
[junit4] 2> 1602097 T3847 oasc.ZkController.publish publishing core=customcollreplicadeletion_b_replica1 state=down collection=customcollreplicadeletion
[junit4] 2> 1602097 T3824 oasc.ZkController.preRegister Registering watch for external collection customcollreplicadeletion
[junit4] 2> 1602099 T3847 oasc.ZkController.preRegister Registering watch for external collection customcollreplicadeletion
[junit4] 2> 1602099 T3847 oascc.ZkStateReader.addZkWatch addZkWatch customcollreplicadeletion
[junit4] 2> 1602099 T3835 oasc.Overseer$ClusterStateUpdater.updateState Update state numShards=2 message={
[junit4] 2> "core":"customcollreplicadeletion_a_replica1",
[junit4] 2> "base_url":"http://127.0.0.1:37130",
[junit4] 2> "operation":"state",
[junit4] 2> "shard":"a",
[junit4] 2> "numShards":"2",
[junit4] 2> "collection":"customcollreplicadeletion",
[junit4] 2> "state":"down",
[junit4] 2> "node_name":"127.0.0.1:37130_",
[junit4] 2> "roles":null}
[junit4] 2> 1602099 T3847 oascc.ZkStateReader.addZkWatch Updating collection state at /collections/customcollreplicadeletion/state.json from ZooKeeper...
[junit4] 2> 1602100 T3847 oascc.ZkStateReader.updateWatchedCollection Updating data for customcollreplicadeletion to ver 0
[junit4] 2> 1602101 T3847 oasc.ZkController.waitForCoreNodeName look for our core node name
[junit4] 2> 1602104 T3835 oasc.Overseer$ClusterStateUpdater.updateZkStates going to update_collection /collections/customcollreplicadeletion/state.json
[junit4] 2> 1602105 T3858 oascc.ZkStateReader$7.process A cluster state change: WatchedEvent state:SyncConnected type:NodeDataChanged path:/collections/customcollreplicadeletion/state.json, has occurred - updating...
[junit4] 2> 1602106 T3858 oascc.ZkStateReader.updateWatchedCollection Updating data for customcollreplicadeletion to ver 1
[junit4] 2> 1602106 T3824 oascc.ZkStateReader.addZkWatch addZkWatch customcollreplicadeletion
[junit4] 2> 1602106 T3824 oascc.ZkStateReader.addZkWatch Updating collection state at /collections/customcollreplicadeletion/state.json from ZooKeeper...
[junit4] 2> 1602107 T3824 oascc.ZkStateReader.updateWatchedCollection Updating data for customcollreplicadeletion to ver 1
[junit4] 2> 1602108 T3824 oasc.ZkController.waitForCoreNodeName look for our core node name
[junit4] 2> 1602108 T3824 oasc.ZkController.waitForShardId waiting to find shard id in clusterstate for customcollreplicadeletion_a_replica1
[junit4] 2> 1602108 T3824 oasc.ZkController.createCollectionZkNode Check for collection zkNode:customcollreplicadeletion
[junit4] 2> 1602109 T3824 oasc.ZkController.createCollectionZkNode Collection zkNode exists
[junit4] 2> 1602109 T3824 oascc.ZkStateReader.readConfigName Load collection config from:/collections/customcollreplicadeletion
[junit4] 2> 1602110 T3824 oascc.ZkStateReader.readConfigName path=/collections/customcollreplicadeletion configName=conf1 specified config exists in ZooKeeper
[junit4] 2> 1602110 T3835 oascc.ZkStateReader.updateWatchedCollection Updating data for customcollreplicadeletion to ver 1
[junit4] 2> 1602110 T3824 oasc.SolrResourceLoader.<init> new SolrResourceLoader for directory: '/usr/home/jenkins/jenkins-slave/workspace/Lucene-Solr-Tests-5.x-Java7/solr/build/solr-core/test/J3/temp/solr.cloud.DeleteLastCustomShardedReplicaTest-B0D616B7E0527FAC-001/tempDir-002/customcollreplicadeletion_a_replica1/'
[junit4] 2> 1602110 T3835 oasc.Overseer$ClusterStateUpdater.updateState Update state numShards=2 message={
[junit4] 2> "core":"customcollreplicadeletion_b_replica1",
[junit4] 2> "base_url":"http://127.0.0.1:45343",
[junit4] 2> "operation":"state",
[junit4] 2> "shard":"b",
[junit4] 2> "numShards":"2",
[junit4] 2> "collection":"customcollreplicadeletion",
[junit4] 2> "state":"down",
[junit4] 2> "node_name":"127.0.0.1:45343_",
[junit4] 2> "roles":null}
[junit4] 2> 1602112 T3843 oasc.DistributedQueue$LatchChildWatcher.process LatchChildWatcher fired on path: /overseer/queue state: SyncConnected type NodeChildrenChanged
[junit4] 2> 1602112 T3835 oasc.Overseer$ClusterStateUpdater.updateZkStates going to update_collection /collections/customcollreplicadeletion/state.json
[junit4] 2> 1602113 T3843 oascc.ZkStateReader$7.process A cluster state change: WatchedEvent state:SyncConnected type:NodeDataChanged path:/collections/customcollreplicadeletion/state.json, has occurred - updating...
[junit4] 2> 1602113 T3858 oascc.ZkStateReader$7.process A cluster state change: WatchedEvent state:SyncConnected type:NodeDataChanged path:/collections/customcollreplicadeletion/state.json, has occurred - updating...
[junit4] 2> 1602114 T3858 oascc.ZkStateReader.updateWatchedCollection Updating data for customcollreplicadeletion to ver 2
[junit4] 2> 1602115 T3843 oascc.ZkStateReader.updateWatchedCollection Updating data for customcollreplicadeletion to ver 2
[junit4] 2> 1602184 T3824 oasc.SolrConfig.<init> Using Lucene MatchVersion: 5.0.0
[junit4] 2> 1602216 T3824 oasc.SolrConfig.<init> Loaded SolrConfig: solrconfig.xml
[junit4] 2> 1602217 T3824 oass.IndexSchema.readSchema Reading Solr Schema from schema.xml
[junit4] 2> 1602224 T3824 oass.IndexSchema.readSchema [customcollreplicadeletion_a_replica1] Schema name=test
[junit4] 2> 1602475 T3824 oass.OpenExchangeRatesOrgProvider.init Initialized with rates=open-exchange-rates.json, refreshInterval=1440.
[junit4] 2> 1602482 T3824 oass.IndexSchema.readSchema default search field in schema is text
[junit4] 2> 1602484 T3824 oass.IndexSchema.readSchema unique key field: id
[junit4] 2> 1602493 T3824 oass.FileExchangeRateProvider.reload Reloading exchange rates from file currency.xml
[junit4] 2> 1602496 T3824 oass.FileExchangeRateProvider.reload Reloading exchange rates from file currency.xml
[junit4] 2> 1602499 T3824 oass.OpenExchangeRatesOrgProvider.reload Reloading exchange rates from open-exchange-rates.json
[junit4] 2> 1602500 T3824 oass.OpenExchangeRatesOrgProvider$OpenExchangeRates.<init> WARN Unknown key IMPORTANT NOTE
[junit4] 2> 1602502 T3824 oass.OpenExchangeRatesOrgProvider$OpenExchangeRates.<init> WARN Expected key, got STRING
[junit4] 2> 1602502 T3824 oass.OpenExchangeRatesOrgProvider.reload Reloading exchange rates from open-exchange-rates.json
[junit4] 2> 1602503 T3824 oass.OpenExchangeRatesOrgProvider$OpenExchangeRates.<init> WARN Unknown key IMPORTANT NOTE
[junit4] 2> 1602503 T3824 oass.OpenExchangeRatesOrgProvider$OpenExchangeRates.<init> WARN Expected key, got STRING
[junit4] 2> 1602503 T3824 oasc.CoreContainer.create Creating SolrCore 'customcollreplicadeletion_a_replica1' using configuration from collection customcollreplicadeletion
[junit4] 2> 1602503 T3824 oasc.SolrCore.initDirectoryFactory org.apache.solr.core.MockDirectoryFactory
[junit4] 2> 1602504 T3824 oasc.SolrCore.<init> [customcollreplicadeletion_a_replica1] Opening new SolrCore at /usr/home/jenkins/jenkins-slave/workspace/Lucene-Solr-Tests-5.x-Java7/solr/build/solr-core/test/J3/temp/solr.cloud.DeleteLastCustomShardedReplicaTest-B0D616B7E0527FAC-001/tempDir-002/customcollreplicadeletion_a_replica1/, dataDir=/usr/home/jenkins/jenkins-slave/workspace/Lucene-Solr-Tests-5.x-Java7/solr/build/solr-core/test/J3/temp/solr.cloud.DeleteLastCustomShardedReplicaTest-B0D616B7E0527FAC-001/tempDir-002/customcollreplicadeletion_a_replica1/data/
[junit4] 2> 1602504 T3824 oasc.JmxMonitoredMap.<init> JMX monitoring is enabled. Adding Solr mbeans to JMX Server: com.sun.jmx.mbeanserver.JmxMBeanServer@3657517
[junit4] 2> 1602505 T3824 oasc.CachingDirectoryFactory.get return new directory for /usr/home/jenkins/jenkins-slave/workspace/Lucene-Solr-Tests-5.x-Java7/solr/build/solr-core/test/J3/temp/solr.cloud.DeleteLastCustomShardedReplicaTest-B0D616B7E0527FAC-001/tempDir-002/customcollreplicadeletion_a_replica1/data
[junit4] 2> 1602505 T3824 oasc.SolrCore.getNewIndexDir New index directory detected: old=null new=/usr/home/jenkins/jenkins-slave/workspace/Lucene-Solr-Tests-5.x-Java7/solr/build/solr-core/test/J3/temp/solr.cloud.DeleteLastCustomShardedReplicaTest-B0D616B7E0527FAC-001/tempDir-002/customcollreplicadeletion_a_replica1/data/index/
[junit4] 2> 1602505 T3824 oasc.SolrCore.initIndex WARN [customcollreplicadeletion_a_replica1] Solr index directory '/usr/home/jenkins/jenkins-slave/workspace/Lucene-Solr-Tests-5.x-Java7/solr/build/solr-core/test/J3/temp/solr.cloud.DeleteLastCustomShardedReplicaTest-B0D616B7E0527FAC-001/tempDir-002/customcollreplicadeletion_a_replica1/data/index' doesn't exist. Creating new index...
[junit4] 2> 1602506 T3824 oasc.CachingDirectoryFactory.get return new directory for /usr/home/jenkins/jenkins-slave/workspace/Lucene-Solr-Tests-5.x-Java7/solr/build/solr-core/test/J3/temp/solr.cloud.DeleteLastCustomShardedReplicaTest-B0D616B7E0527FAC-001/tempDir-002/customcollreplicadeletion_a_replica1/data/index
[junit4] 2> 1602506 T3824 oasu.RandomMergePolicy.<init> RandomMergePolicy wrapping class org.apache.lucene.index.TieredMergePolicy: [TieredMergePolicy: maxMergeAtOnce=42, maxMergeAtOnceExplicit=16, maxMergedSegmentMB=17.1474609375, floorSegmentMB=2.169921875, forceMergeDeletesPctAllowed=12.465002054469714, segmentsPerTier=30.0, maxCFSSegmentSizeMB=8.796093022207999E12, noCFSRatio=0.0
[junit4] 2> 1602507 T3824 oasc.SolrDeletionPolicy.onCommit SolrDeletionPolicy.onCommit: commits: num=1
[junit4] 2> commit{dir=MockDirectoryWrapper(RAMDirectory(id=lucene-63eb1162)),segFN=segments_1,generation=1}
[junit4] 2> 1602507 T3824 oasc.SolrDeletionPolicy.updateCommits newest commit generation = 1
[junit4] 2> 1602510 T3824 oasup.UpdateRequestProcessorChain.init creating updateRequestProcessorChain "nodistrib"
[junit4] 2> 1602511 T3824 oasup.UpdateRequestProcessorChain.init creating updateRequestProcessorChain "dedupe"
[junit4] 2> 1602511 T3824 oasup.UpdateRequestProcessorChain.init inserting DistributedUpdateProcessorFactory into updateRequestProcessorChain "dedupe"
[junit4] 2> 1602511 T3824 oasup.UpdateRequestProcessorChain.init creating updateRequestProcessorChain "stored_sig"
[junit4] 2> 1602511 T3824 oasup.UpdateRequestProcessorChain.init inserting DistributedUpdateProcessorFactory into updateRequestProcessorChain "stored_sig"
[junit4] 2> 1602512 T3824 oasup.UpdateRequestProcessorChain.init creating updateRequestProcessorChain "distrib-dup-test-chain-explicit"
[junit4] 2> 1602512 T3824 oasup.UpdateRequestProcessorChain.init creating updateRequestProcessorChain "distrib-dup-test-chain-implicit"
[junit4] 2> 1602512 T3824 oasup.UpdateRequestProcessorChain.init inserting DistributedUpdateProcessorFactory into updateRequestProcessorChain "distrib-dup-test-chain-implicit"
[junit4] 2> 1602513 T3824 oasc.SolrCore.loadUpdateProcessorChains no updateRequestProcessorChain defined as default, creating implicit default
[junit4] 2> 1602513 T3824 oasc.RequestHandlers.initHandlersFromConfig created /update/csv: org.apache.solr.handler.UpdateRequestHandler
[junit4] 2> 1602513 T3824 oasc.RequestHandlers.initHandlersFromConfig created /update/json/docs: org.apache.solr.handler.UpdateRequestHandler
[junit4] 2> 1602514 T3824 oasc.RequestHandlers.initHandlersFromConfig created /update/json: org.apache.solr.handler.UpdateRequestHandler
[junit4] 2> 1602514 T3824 oasc.RequestHandlers.initHandlersFromConfig created standard: solr.StandardRequestHandler
[junit4] 2> 1602515 T3824 oasc.RequestHandlers.initHandlersFromConfig created /get: solr.RealTimeGetHandler
[junit4] 2> 1602515 T3824 oasc.RequestHandlers.initHandlersFromConfig adding lazy requestHandler: solr.ReplicationHandler
[junit4] 2> 1602515 T3824 oasc.RequestHandlers.initHandlersFromConfig created /replication: solr.ReplicationHandler
[junit4] 2> 1602516 T3824 oasc.RequestHandlers.initHandlersFromConfig created /update: solr.UpdateRequestHandler
[junit4] 2> 1602516 T3824 oasc.RequestHandlers.initHandlersFromConfig created /admin/: org.apache.solr.handler.admin.AdminHandlers
[junit4] 2> 1602516 T3824 oasc.RequestHandlers.initHandlersFromConfig created /admin/file: solr.admin.ShowFileRequestHandler
[junit4] 2> 1602517 T3824 oasc.RequestHandlers.initHandlersFromConfig created /admin/fileedit: solr.admin.EditFileRequestHandler
[junit4] 2> 1602529 T3824 oashl.XMLLoader.init xsltCacheLifetimeSeconds=60
[junit4] 2> 1602530 T3824 oashl.XMLLoader.init xsltCacheLifetimeSeconds=60
[junit4] 2> 1602532 T3824 oashl.XMLLoader.init xsltCacheLifetimeSeconds=60
[junit4] 2> 1602533 T3824 oashl.XMLLoader.init xsltCacheLifetimeSeconds=60
[junit4] 2> 1602537 T3824 oasu.CommitTracker.<init> Hard AutoCommit: disabled
[junit4] 2> 1602537 T3824 oasu.CommitTracker.<init> Soft AutoCommit: disabled
[junit4] 2> 1602537 T3824 oasu.RandomMergePolicy.<init> RandomMergePolicy wrapping class org.apache.lucene.index.LogDocMergePolicy: [LogDocMergePolicy: minMergeSize=1000, mergeFactor=8, maxMergeSize=9223372036854775807, maxMergeSizeForForcedMerge=9223372036854775807, calibrateSizeByDeletes=true, maxMergeDocs=2147483647, maxCFSSegmentSizeMB=8.796093022207999E12, noCFSRatio=0.370415053787596]
[junit4] 2> 1602538 T3824 oasc.SolrDeletionPolicy.onInit SolrDeletionPolicy.onInit: commits: num=1
[junit4] 2> commit{dir=MockDirectoryWrapper(RAMDirectory(id=lucene-63eb1162)),segFN=segments_1,generation=1}
[junit4] 2> 1602538 T3824 oasc.SolrDeletionPolicy.updateCommits newest commit generation = 1
[junit4] 2> 1602539 T3824 oass.SolrIndexSearcher.<init> Opening Searcher@5526d41a[customcollreplicadeletion_a_replica1] main
[junit4] 2> 1602539 T3824 oascc.ZkStateReader.readConfigName Load collection config from:/collections/customcollreplicadeletion
[junit4] 2> 1602540 T3824 oascc.ZkStateReader.readConfigName path=/collections/customcollreplicadeletion configName=conf1 specified config exists in ZooKeeper
[junit4] 2> 1602540 T3824 oasr.ManagedResourceStorage.newStorageIO Setting up ZooKeeper-based storage for the RestManager with znodeBase: /configs/conf1
[junit4] 2> 1602540 T3824 oasr.ManagedResourceStorage$ZooKeeperStorageIO.configure Configured ZooKeeperStorageIO with znodeBase: /configs/conf1
[junit4] 2> 1602540 T3824 oasr.RestManager.init Initializing RestManager with initArgs: {}
[junit4] 2> 1602541 T3824 oasr.ManagedResourceStorage.load Reading _rest_managed.json using ZooKeeperStorageIO:path=/configs/conf1
[junit4] 2> 1602541 T3824 oasr.ManagedResourceStorage$ZooKeeperStorageIO.openInputStream No data found for znode /configs/conf1/_rest_managed.json
[junit4] 2> 1602541 T3824 oasr.ManagedResourceStorage.load Loaded null at path _rest_managed.json using ZooKeeperStorageIO:path=/configs/conf1
[junit4] 2> 1602542 T3824 oascc.SolrZkClient.makePath makePath: /configs/conf1/_rest_managed.json
[junit4] 2> 1602544 T3824 oasr.ManagedResourceStorage$ZooKeeperStorageIO$1.close Wrote 38 bytes to new znode /configs/conf1/_rest_managed.json
[junit4] 2> 1602544 T3824 oasr.ManagedResourceStorage$JsonStorage.store Saved JSON object to path _rest_managed.json using ZooKeeperStorageIO:path=/configs/conf1
[junit4] 2> 1602544 T3824 oasr.RestManager.init Initializing 0 registered ManagedResources
[junit4] 2> 1602546 T3881 oasc.SolrCore.registerSearcher [customcollreplicadeletion_a_replica1] Registered new searcher Searcher@5526d41a[customcollreplicadeletion_a_replica1] main{ExitableDirectoryReader(UninvertingDirectoryReader())}
[junit4] 2> 1602548 T3824 oasc.CoreContainer.registerCore registering core: customcollreplicadeletion_a_replica1
[junit4] 2> 1602549 T3824 oasc.ZkController.register Register replica - core:customcollreplicadeletion_a_replica1 address:http://127.0.0.1:37130 collection:customcollreplicadeletion shard:a
[junit4] 2> 1602550 T3824 oascc.SolrZkClient.makePath makePath: /collections/customcollreplicadeletion/leader_elect/a/election
[junit4] 2> 1602555 T3824 oasc.ShardLeaderElectionContext.runLeaderProcess Running the leader process for shard a
[junit4] 2> 1602556 T3843 oasc.DistributedQueue$LatchChildWatcher.process LatchChildWatcher fired on path: /overseer/queue state: SyncConnected type NodeChildrenChanged
[junit4] 2> 1602556 T3824 oasc.ShardLeaderElectionContext.waitForReplicasToComeUp Enough replicas found to continue.
[junit4] 2> 1602557 T3824 oasc.ShardLeaderElectionContext.runLeaderProcess I may be the new leader - try and sync
[junit4] 2> ASYNC NEW_CORE C476 name=customcollreplicadeletion_a_replica1 org.apache.solr.core.SolrCore@6f0bf8a6 url=http://127.0.0.1:37130/customcollreplicadeletion_a_replica1 node=127.0.0.1:37130_ C476_STATE=coll:customcollreplicadeletion core:customcollreplicadeletion_a_replica1 props:{core=customcollreplicadeletion_a_replica1, base_url=http://127.0.0.1:37130, state=down, node_name=127.0.0.1:37130_}
[junit4] 2> 1602557 T3824 C476 P37130 oasc.SyncStrategy.sync Sync replicas to http://127.0.0.1:37130/customcollreplicadeletion_a_replica1/
[junit4] 2> 1602558 T3824 C476 P37130 oasc.SyncStrategy.syncReplicas Sync Success - now sync replicas to me
[junit4] 2> 1602558 T3824 C476 P37130 oasc.SyncStrategy.syncToMe http://127.0.0.1:37130/customcollreplicadeletion_a_replica1/ has no replicas
[junit4] 2> 1602558 T3824 oasc.ShardLeaderElectionContext.runLeaderProcess I am the new leader: http://127.0.0.1:37130/customcollreplicadeletion_a_replica1/ a
[junit4] 2> 1602558 T3835 oascc.ZkStateReader.updateWatchedCollection Updating data for customcollreplicadeletion to ver 2
[junit4] 2> 1602559 T3824 oascc.SolrZkClient.makePath makePath: /collections/customcollreplicadeletion/leaders/a
[junit4] 2> 1602560 T3835 oasc.Overseer$ClusterStateUpdater.updateZkStates going to update_collection /collections/customcollreplicadeletion/state.json
[junit4] 2> 1602561 T3858 oascc.ZkStateReader$7.process A cluster state change: WatchedEvent state:SyncConnected type:NodeDataChanged path:/collections/customcollreplicadeletion/state.json, has occurred - updating...
[junit4] 2> 1602561 T3843 oascc.ZkStateReader$7.process A cluster state change: WatchedEvent state:SyncConnected type:NodeDataChanged path:/collections/customcollreplicadeletion/state.json, has occurred - updating...
[junit4] 2> 1602562 T3858 oascc.ZkStateReader.updateWatchedCollection Updating data for customcollreplicadeletion to ver 3
[junit4] 2> 1602562 T3843 oascc.ZkStateReader.updateWatchedCollection Updating data for customcollreplicadeletion to ver 3
[junit4] 2> 1602564 T3835 oascc.ZkStateReader.updateWatchedCollection Updating data for customcollreplicadeletion to ver 3
[junit4] 2> 1602565 T3843 oasc.DistributedQueue$LatchChildWatcher.process LatchChildWatcher fired on path: /overseer/queue state: SyncConnected type NodeChildrenChanged
[junit4] 2> 1602566 T3835 oasc.Overseer$ClusterStateUpdater.updateZkStates going to update_collection /collections/customcollreplicadeletion/state.json
[junit4] 2> 1602566 T3843 oascc.ZkStateReader$7.process A cluster state change: WatchedEvent state:SyncConnected type:NodeDataChanged path:/collections/customcollreplicadeletion/state.json, has occurred - updating...
[junit4] 2> 1602566 T3858 oascc.ZkStateReader$7.process A cluster state change: WatchedEvent state:SyncConnected type:NodeDataChanged path:/collections/customcollreplicadeletion/state.json, has occurred - updating...
[junit4] 2> 1602567 T3858 oascc.ZkStateReader.updateWatchedCollection Updating data for customcollreplicadeletion to ver 4
[junit4] 2> 1602567 T3843 oascc.ZkStateReader.updateWatchedCollection Updating data for customcollreplicadeletion to ver 4
[junit4] 2> 1602613 T3824 oasc.ZkController.register We are http://127.0.0.1:37130/customcollreplicadeletion_a_replica1/ and leader is http://127.0.0.1:37130/customcollreplicadeletion_a_replica1/
[junit4] 2> 1602614 T3824 oasc.ZkController.register No LogReplay needed for core=customcollreplicadeletion_a_replica1 baseURL=http://127.0.0.1:37130
[junit4] 2> 1602614 T3824 oasc.ZkController.checkRecovery I am the leader, no recovery necessary
[junit4] 2> 1602614 T3824 oasc.ZkController.publish publishing core=customcollreplicadeletion_a_replica1 state=active collection=customcollreplicadeletion
[junit4] 2> 1602615 T3843 oasc.DistributedQueue$LatchChildWatcher.process LatchChildWatcher fired on path: /overseer/queue state: SyncConnected type NodeChildrenChanged
[junit4] 2> 1602617 T3824 oascc.ZkStateReader.updateWatchedCollection Updating data for customcollreplicadeletion to ver 4
[junit4] 2> 1602618 T3824 oass.SolrDispatchFilter.handleAdminRequest [admin] webapp=null path=/admin/cores params={collection.configName=conf1&shard=a&wt=javabin&qt=/admin/cores&version=2&numShards=2&collection=customcollreplicadeletion&name=customcollreplicadeletion_a_replica1&action=CREATE} status=0 QTime=526
[junit4] 2> 1602618 T3835 oascc.ZkStateReader.updateWatchedCollection Updating data for customcollreplicadeletion to ver 4
[junit4] 2> 1602619 T3835 oasc.Overseer$ClusterStateUpdater.updateState Update state numShards=2 message={
[junit4] 2> "core":"customcollreplicadeletion_a_replica1",
[junit4] 2> "base_url":"http://127.0.0.1:37130",
[junit4] 2> "operation":"state",
[junit4] 2> "shard":"a",
[junit4] 2> "core_node_name":"core_node1",
[junit4] 2> "numShards":"2",
[junit4] 2> "collection":"customcollreplicadeletion",
[junit4] 2> "state":"active",
[junit4] 2> "node_name":"127.0.0.1:37130_",
[junit4] 2> "roles":null}
[junit4] 2> 1602620 T3835 oasc.Overseer$ClusterStateUpdater.updateZkStates going to update_collection /collections/customcollreplicadeletion/state.json
[junit4] 2> 1602620 T3843 oascc.ZkStateReader$7.process A cluster state change: WatchedEvent state:SyncConnected type:NodeDataChanged path:/collections/customcollreplicadeletion/state.json, has occurred - updating...
[junit4] 2> 1602620 T3858 oascc.ZkStateReader$7.process A cluster state change: WatchedEvent state:SyncConnected type:NodeDataChanged path:/collections/customcollreplicadeletion/state.json, has occurred - updating...
[junit4] 2> 1602621 T3858 oascc.ZkStateReader.updateWatchedCollection Updating data for customcollreplicadeletion to ver 5
[junit4] 2> 1602621 T3843 oascc.ZkStateReader.updateWatchedCollection Updating data for customcollreplicadeletion to ver 5
[junit4] 2> 1603101 T3847 oasc.ZkController.waitForShardId waiting to find shard id in clusterstate for customcollreplicadeletion_b_replica1
[junit4] 2> 1603102 T3847 oasc.ZkController.createCollectionZkNode Check for collection zkNode:customcollreplicadeletion
[junit4] 2> 1603103 T3847 oasc.ZkController.createCollectionZkNode Collection zkNode exists
[junit4] 2> 1603103 T3847 oascc.ZkStateReader.readConfigName Load collection config from:/collections/customcollreplicadeletion
[junit4] 2> 1603104 T3847 oascc.ZkStateReader.readConfigName path=/collections/customcollreplicadeletion configName=conf1 specified config exists in ZooKeeper
[junit4] 2> 1603104 T3847 oasc.SolrResourceLoader.<init> new SolrResourceLoader for directory: '../../../../../../../../../../../usr/home/jenkins/jenkins-slave/workspace/Lucene-Solr-Tests-5.x-Java7/solr/build/solr-core/test/J3/temp/solr.cloud.DeleteLastCustomShardedReplicaTest-B0D616B7E0527FAC-001/tempDir-003/customcollreplicadeletion_b_replica1/'
[junit4] 2> 1603154 T3847 oasc.SolrConfig.<init> Using Lucene MatchVersion: 5.0.0
[junit4] 2> 1603202 T3847 oasc.SolrConfig.<init> Loaded SolrConfig: solrconfig.xml
[junit4] 2> 1603303 T3847 oass.IndexSchema.readSchema Reading Solr Schema from schema.xml
[junit4] 2> 1603318 T3847 oass.IndexSchema.readSchema [customcollreplicadeletion_b_replica1] Schema name=test
[junit4] 2> 1603687 T3847 oass.OpenExchangeRatesOrgProvider.init Initialized with rates=open-exchange-rates.json, refreshInterval=1440.
[junit4] 2> 1603693 T3847 oass.IndexSchema.readSchema default search field in schema is text
[junit4] 2> 1603697 T3847 oass.IndexSchema.readSchema unique key field: id
[junit4] 2> 1603706 T3847 oass.FileExchangeRateProvider.reload Reloading exchange rates from file currency.xml
[junit4] 2> 1603711 T3847 oass.FileExchangeRateProvider.reload Reloading exchange rates from file currency.xml
[junit4] 2> 1603716 T3847 oass.OpenExchangeRatesOrgProvider.reload Reloading exchange rates from open-exchange-rates.json
[junit4] 2> 1603717 T3847 oass.OpenExchangeRatesOrgProvider$OpenExchangeRates.<init> WARN Unknown key IMPORTANT NOTE
[junit4] 2> 1603717 T3847 oass.OpenExchangeRatesOrgProvider$OpenExchangeRates.<init> WARN Expected key, got STRING
[junit4] 2> 1603717 T3847 oass.OpenExchangeRatesOrgProvider.reload Reloading exchange rates from open-exchange-rates.json
[junit4] 2> 1603718 T3847 oass.OpenExchangeRatesOrgProvider$OpenExchangeRates.<init> WARN Unknown key IMPORTANT NOTE
[junit4] 2> 1603718 T3847 oass.OpenExchangeRatesOrgProvider$OpenExchangeRates.<init> WARN Expected key, got STRING
[junit4] 2> 1603719 T3847 oasc.CoreContainer.create Creating SolrCore 'customcollreplicadeletion_b_replica1' using configuration from collection customcollreplicadeletion
[junit4] 2> 1603719 T3847 oasc.SolrCore.initDirectoryFactory org.apache.solr.core.MockDirectoryFactory
[junit4] 2> 1603720 T3847 oasc.SolrCore.<init> [customcollreplicadeletion_b_replica1] Opening new SolrCore at ../../../../../../../../../../../usr/home/jenkins/jenkins-slave/workspace/Lucene-Solr-Tests-5.x-Java7/solr/build/solr-core/test/J3/temp/solr.cloud.DeleteLastCustomShardedReplicaTest-B0D616B7E0527FAC-001/tempDir-003/customcollreplicadeletion_b_replica1/, dataDir=/usr/home/jenkins/jenkins-slave/workspace/Lucene-Solr-Tests-5.x-Java7/solr/build/solr-core/test/J3/../../../../../../../../../../../usr/home/jenkins/jenkins-slave/workspace/Lucene-Solr-Tests-5.x-Java7/solr/build/solr-core/test/J3/temp/solr.cloud.DeleteLastCustomShardedReplicaTest-B0D616B7E0527FAC-001/tempDir-003/customcollreplicadeletion_b_replica1/data/
[junit4] 2> 1603720 T3847 oasc.JmxMonitoredMap.<init> JMX monitoring is enabled. Adding Solr mbeans to JMX Server: com.sun.jmx.mbeanserver.JmxMBeanServer@3657517
[junit4] 2> 1603721 T3847 oasc.CachingDirectoryFactory.get return new directory for /usr/home/jenkins/jenkins-slave/workspace/Lucene-Solr-Tests-5.x-Java7/solr/build/solr-core/test/J3/../../../../../../../../../../../usr/home/jenkins/jenkins-slave/workspace/Lucene-Solr-Tests-5.x-Java7/solr/build/solr-core/test/J3/temp/solr.cloud.DeleteLastCustomShardedReplicaTest-B0D616B7E0527FAC-001/tempDir-003/customcollreplicadeletion_b_replica1/data
[junit4] 2> 1603722 T3847 oasc.SolrCore.getNewIndexDir New index directory detected: old=null new=/usr/home/jenkins/jenkins-slave/workspace/Lucene-Solr-Tests-5.x-Java7/solr/build/solr-core/test/J3/../../../../../../../../../../../usr/home/jenkins/jenkins-slave/workspace/Lucene-Solr-Tests-5.x-Java7/solr/build/solr-core/test/J3/temp/solr.cloud.DeleteLastCustomShardedReplicaTest-B0D616B7E0527FAC-001/tempDir-003/customcollreplicadeletion_b_replica1/data/index/
[junit4] 2> 1603722 T3847 oasc.SolrCore.initIndex WARN [customcollreplicadeletion_b_replica1] Solr index directory '/usr/home/jenkins/jenkins-slave/workspace/Lucene-Solr-Tests-5.x-Java7/solr/build/solr-core/test/J3/../../../../../../../../../../../usr/home/jenkins/jenkins-slave/workspace/Lucene-Solr-Tests-5.x-Java7/solr/build/solr-core/test/J3/temp/solr.cloud.DeleteLastCustomShardedReplicaTest-B0D616B7E0527FAC-001/tempDir-003/customcollreplicadeletion_b_replica1/data/index' doesn't exist. Creating new index...
[junit4] 2> 1603723 T3847 oasc.CachingDirectoryFactory.get return new directory for /usr/home/jenkins/jenkins-slave/workspace/Lucene-Solr-Tests-5.x-Java7/solr/build/solr-core/test/J3/../../../../../../../../../../../usr/home/jenkins/jenkins-slave/workspace/Lucene-Solr-Tests-5.x-Java7/solr/build/solr-core/test/J3/temp/solr.cloud.DeleteLastCustomShardedReplicaTest-B0D616B7E0527FAC-001/tempDir-003/customcollreplicadeletion_b_replica1/data/index
[junit4] 2> 1603723 T3847 oasu.RandomMergePolicy.<init> RandomMergePolicy wrapping class org.apache.lucene.index.TieredMergePolicy: [TieredMergePolicy: maxMergeAtOnce=42, maxMergeAtOnceExplicit=16, maxMergedSegmentMB=17.1474609375, floorSegmentMB=2.169921875, forceMergeDeletesPctAllowed=12.465002054469714, segmentsPerTier=30.0, maxCFSSegmentSizeMB=8.796093022207999E12, noCFSRatio=0.0
[junit4] 2> 1603724 T3847 oasc.SolrDeletionPolicy.onCommit SolrDeletionPolicy.onCommit: commits: num=1
[junit4] 2> commit{dir=MockDirectoryWrapper(RAMDirectory(id=lucene-77d54920)),segFN=segments_1,generation=1}
[junit4] 2> 1603724 T3847 oasc.SolrDeletionPolicy.updateCommits newest commit generation = 1
[junit4] 2> 1603729 T3847 oasup.UpdateRequestProcessorChain.init creating updateRequestProcessorChain "nodistrib"
[junit4] 2> 1603730 T3847 oasup.UpdateRequestProcessorChain.init creating updateRequestProcessorChain "dedupe"
[junit4] 2> 1603730 T3847 oasup.UpdateRequestProcessorChain.init inserting DistributedUpdateProcessorFactory into updateRequestProcessorChain "dedupe"
[junit4] 2> 1603731 T3847 oasup.UpdateRequestProcessorChain.init creating updateRequestProcessorChain "stored_sig"
[junit4] 2> 1603731 T3847 oasup.UpdateRequestProcessorChain.init inserting DistributedUpdateProcessorFactory into updateRequestProcessorChain "stored_sig"
[junit4] 2> 1603732 T3847 oasup.UpdateRequestProcessorChain.init creating updateRequestProcessorChain "distrib-dup-test-chain-explicit"
[junit4] 2> 1603732 T3847 oasup.UpdateRequestProcessorChain.init creating updateRequestProcessorChain "distrib-dup-test-chain-implicit"
[junit4] 2> 1603733 T3847 oasup.UpdateRequestProcessorChain.init inserting DistributedUpdateProcessorFactory into updateRequestProcessorChain "distrib-dup-test-chain-implicit"
[junit4] 2> 1603733 T3847 oasc.SolrCore.loadUpdateProcessorChains no updateRequestProcessorChain defined as default, creating implicit default
[junit4] 2> 1603734 T3847 oasc.RequestHandlers.initHandlersFromConfig created /update/csv: org.apache.solr.handler.UpdateRequestHandler
[junit4] 2> 1603734 T3847 oasc.RequestHandlers.initHandlersFromConfig created /update/json/docs: org.apache.solr.handler.UpdateRequestHandler
[junit4] 2> 1603735 T3847 oasc.RequestHandlers.initHandlersFromConfig created /update/json: org.apache.solr.handler.UpdateRequestHandler
[junit4] 2> 1603735 T3847 oasc.RequestHandlers.initHandlersFromConfig created standard: solr.StandardRequestHandler
[junit4] 2> 1603736 T3847 oasc.RequestHandlers.initHandlersFromConfig created /get: solr.RealTimeGetHandler
[junit4] 2> 1603736 T3847 oasc.RequestHandlers.initHandlersFromConfig adding lazy requestHandler: solr.ReplicationHandler
[junit4] 2> 1603737 T3847 oasc.RequestHandlers.initHandlersFromConfig created /replication: solr.ReplicationHandler
[junit4] 2> 1603737 T3847 oasc.RequestHandlers.initHandlersFromConfig created /update: solr.UpdateRequestHandler
[junit4] 2> 1603738 T3847 oasc.RequestHandlers.initHandlersFromConfig created /admin/: org.apache.solr.handler.admin.AdminHandlers
[junit4] 2> 1603738 T3847 oasc.RequestHandlers.initHandlersFromConfig created /admin/file: solr.admin.ShowFileRequestHandler
[junit4] 2> 1603739 T3847 oasc.RequestHandlers.initHandlersFromConfig created /admin/fileedit: solr.admin.EditFileRequestHandler
[junit4] 2> 1603742 T3847 oashl.XMLLoader.init xsltCacheLifetimeSeconds=60
[junit4] 2> 1603744 T3847 oashl.XMLLoader.init xsltCacheLifetimeSeconds=60
[junit4] 2> 1603746 T3847 oashl.XMLLoader.init xsltCacheLifetimeSeconds=60
[junit4] 2> 1603748 T3847 oashl.XMLLoader.init xsltCacheLifetimeSeconds=60
[junit4] 2> 1603755 T3847 oasu.CommitTracker.<init> Hard AutoCommit: disabled
[junit4] 2> 1603755 T3847 oasu.CommitTracker.<init> Soft AutoCommit: disabled
[junit4] 2> 1603756 T3847 oasu.RandomMergePolicy.<init> RandomMergePolicy wrapping class org.apache.lucene.index.LogDocMergePolicy: [LogDocMergePolicy: minMergeSize=1000, mergeFactor=8, maxMergeSize=9223372036854775807, maxMergeSizeForForcedMerge=9223372036854775807, calibrateSizeByDeletes=true, maxMergeDocs=2147483647, maxCFSSegmentSizeMB=8.796093022207999E12, noCFSRatio=0.370415053787596]
[junit4] 2> 1603757 T3847 oasc.SolrDeletionPolicy.onInit SolrDeletionPolicy.onInit: commits: num=1
[junit4] 2> commit{dir=MockDirectoryWrapper(RAMDirectory(id=lucene-77d54920)),segFN=segments_1,generation=1}
[junit4] 2> 1603757 T3847 oasc.SolrDeletionPolicy.updateCommits newest commit generation = 1
[junit4] 2> 1603758 T3847 oass.SolrIndexSearcher.<init> Opening Searcher@59bf6031[customcollreplicadeletion_b_replica1] main
[junit4] 2> 1603758 T3847 oascc.ZkStateReader.readConfigName Load collection config from:/collections/customcollreplicadeletion
[junit4] 2> 1603759 T3847 oascc.ZkStateReader.readConfigName path=/collections/customcollreplicadeletion configName=conf1 specified config exists in ZooKeeper
[junit4] 2> 1603760 T3847 oasr.ManagedResourceStorage.newStorageIO Setting up ZooKeeper-based storage for the RestManager with znodeBase: /configs/conf1
[junit4] 2> 1603760 T3847 oasr.ManagedResourceStorage$ZooKeeperStorageIO.configure Configured ZooKeeperStorageIO with znodeBase: /configs/conf1
[junit4] 2> 1603760 T3847 oasr.RestManager.init Initializing RestManager with initArgs: {}
[junit4] 2> 1603761 T3847 oasr.ManagedResourceStorage.load Reading _rest_managed.json using ZooKeeperStorageIO:path=/configs/conf1
[junit4] 2> 1603762 T3847 oasr.ManagedResourceStorage$ZooKeeperStorageIO.openInputStream Read 38 bytes from znode /configs/conf1/_rest_managed.json
[junit4] 2> 1603762 T3847 oasr.ManagedResourceStorage.load Loaded LinkedHashMap at path _rest_managed.json using ZooKeeperStorageIO:path=/configs/conf1
[junit4] 2> 1603762 T3847 oasr.ManagedResource.reloadFromStorage Loaded initArgs {} for /rest/managed
[junit4] 2> 1603763 T3847 oasr.RestManager.init Initializing 0 registered ManagedResources
[junit4] 2> 1603766 T3883 oasc.SolrCore.registerSearcher [customcollreplicadeletion_b_replica1] Registered new searcher Searcher@59bf6031[customcollreplicadeletion_b_replica1] main{ExitableDirectoryReader(UninvertingDirectoryReader())}
[junit4] 2> 1603769 T3847 oasc.CoreContainer.registerCore registering core: customcollreplicadeletion_b_replica1
[junit4] 2> 1603769 T3847 oasc.ZkController.register Register replica - core:customcollreplicadeletion_b_replica1 address:http://127.0.0.1:45343 collection:customcollreplicadeletion shard:b
[junit4] 2> 1603770 T3847 oascc.SolrZkClient.makePath makePath: /collections/customcollreplicadeletion/leader_elect/b/election
[junit4] 2> 1603774 T3847 oasc.ShardLeaderElectionContext.runLeaderProcess Running the leader process for shard b
[junit4] 2> 1603776 T3843 oasc.DistributedQueue$LatchChildWatcher.process LatchChildWatcher fired on path: /overseer/queue state: SyncConnected type NodeChildrenChanged
[junit4] 2> 1603776 T3847 oasc.ShardLeaderElectionContext.waitForReplicasToComeUp Enough replicas found to continue.
[junit4] 2> 1603776 T3847 oasc.ShardLeaderElectionContext.runLeaderProcess I may be the new leader - try and sync
[junit4] 2> ASYNC NEW_CORE C477 name=customcollreplicadeletion_b_replica1 org.apache.solr.core.SolrCore@6eeda47a url=http://127.0.0.1:45343/customcollreplicadeletion_b_replica1 node=127.0.0.1:45343_ C477_STATE=coll:customcollreplicadeletion core:customcollreplicadeletion_b_replica1 props:{core=customcollreplicadeletion_b_replica1, base_url=http://127.0.0.1:45343, state=down, node_name=127.0.0.1:45343_}
[junit4] 2> 1603777 T3847 C477 P45343 oasc.SyncStrategy.sync Sync replicas to http://127.0.0.1:45343/customcollreplicadeletion_b_replica1/
[junit4] 2> 1603777 T3847 C477 P45343 oasc.SyncStrategy.syncReplicas Sync Success - now sync replicas to me
[junit4] 2> 1603777 T3847 C477 P45343 oasc.SyncStrategy.syncToMe http://127.0.0.1:45343/customcollreplicadeletion_b_replica1/ has no replicas
[junit4] 2> 1603778 T3847 oasc.ShardLeaderElectionContext.runLeaderProcess I am the new leader: http://127.0.0.1:45343/customcollreplicadeletion_b_replica1/ b
[junit4] 2> 1603778 T3847 oascc.SolrZkClient.makePath makePath: /collections/customcollreplicadeletion/leaders/b
[junit4] 2> 1603779 T3835 oascc.ZkStateReader.updateWatchedCollection Updating data for customcollreplicadeletion to ver 5
[junit4] 2> 1603781 T3835 oasc.Overseer$ClusterStateUpdater.updateZkStates going to update_collection /collections/customcollreplicadeletion/state.json
[junit4] 2> 1603781 T3843 oascc.ZkStateReader$7.process A cluster state change: WatchedEvent state:SyncConnected type:NodeDataChanged path:/collections/customcollreplicadeletion/state.json, has occurred - updating...
[junit4] 2> 1603781 T3858 oascc.ZkStateReader$7.process A cluster state change: WatchedEvent state:SyncConnected type:NodeDataChanged path:/collections/customcollreplicadeletion/state.json, has occurred - updating...
[junit4] 2> 1603782 T3858 oascc.ZkStateReader.updateWatchedCollection Updating data for customcollreplicadeletion to ver 6
[junit4] 2> 1603783 T3843 oascc.ZkStateReader.updateWatchedCollection Updating data for customcollreplicadeletion to ver 6
[junit4] 2> 1603785 T3835 oascc.ZkStateReader.updateWatchedCollection Updating data for customcollreplicadeletion to ver 6
[junit4] 2> 1603787 T3843 oasc.DistributedQueue$LatchChildWatcher.process LatchChildWatcher fired on path: /overseer/queue state: SyncConnected type NodeChildrenChanged
[junit4] 2> 1603787 T3835 oasc.Overseer$ClusterStateUpdater.updateZkStates going to update_collection /collections/customcollreplicadeletion/state.json
[junit4] 2> 1603788 T3858 oascc.ZkStateReader$7.process A cluster state change: WatchedEvent state:SyncConnected type:NodeDataChanged path:/collections/customcollreplicadeletion/state.json, has occurred - updating...
[junit4] 2> 1603788 T3843 oascc.ZkStateReader$7.process A cluster state change: WatchedEvent state:SyncConnected type:NodeDataChanged path:/collections/customcollreplicadeletion/state.json, has occurred - updating...
[junit4] 2> 1603788 T3858 oascc.ZkStateReader.updateWatchedCollection Updating data for customcollreplicadeletion to ver 7
[junit4] 2> 1603789 T3843 oascc.ZkStateReader.updateWatchedCollection Updating data for customcollreplicadeletion to ver 7
[junit4] 2> 1603832 T3847 oasc.ZkController.register We are http://127.0.0.1:45343/customcollreplicadeletion_b_replica1/ and leader is http://127.0.0.1:45343/customcollreplicadeletion_b_replica1/
[junit4] 2> 1603833 T3847 oasc.ZkController.register No LogReplay needed for core=customcollreplicadeletion_b_replica1 baseURL=http://127.0.0.1:45343
[junit4] 2> 1603833 T3847 oasc.ZkController.checkRecovery I am the leader, no recovery necessary
[junit4] 2> 1603833 T3847 oasc.ZkController.publish publishing core=customcollreplicadeletion_b_replica1 state=active collection=customcollreplicadeletion
[junit4] 2> 1603835 T3843 oasc.DistributedQueue$LatchChildWatcher.process LatchChildWatcher fired on path: /overseer/queue state: SyncConnected type NodeChildrenChanged
[junit4] 2> 1603836 T3847 oascc.ZkStateReader.updateWatchedCollection Updating data for customcollreplicadeletion to ver 7
[junit4] 2> 1603838 T3835 oascc.ZkStateReader.updateWatchedCollection Updating data for customcollreplicadeletion to ver 7
[junit4] 2> 1603838 T3835 oasc.Overseer$ClusterStateUpdater.updateState Update state numShards=2 message={
[junit4] 2> "core":"customcollreplicadeletion_b_replica1",
[junit4] 2> "base_url":"http://127.0.0.1:45343",
[junit4] 2> "operation":"state",
[junit4] 2> "shard":"b",
[junit4] 2> "core_node_name":"core_node2",
[junit4] 2> "numShards":"2",
[junit4] 2> "collection":"customcollreplicadeletion",
[junit4] 2> "state":"active",
[junit4] 2> "node_name":"127.0.0.1:45343_",
[junit4] 2> "roles":null}
[junit4] 2> 1603839 T3847 oass.SolrDispatchFilter.handleAdminRequest [admin] webapp=null path=/admin/cores params={collection.configName=conf1&shard=b&wt=javabin&qt=/admin/cores&version=2&numShards=2&collection=customcollreplicadeletion&name=customcollreplicadeletion_b_replica1&action=CREATE} status=0 QTime=1746
[junit4] 2> 1603839 T3877 oasc.OverseerCollectionProcessor.createCollection Finished create command on all shards for collection: customcollreplicadeletion
[junit4] 2> 1603840 T3835 oasc.Overseer$ClusterStateUpdater.updateZkStates going to update_collection /collections/customcollreplicadeletion/state.json
[junit4] 2> 1603841 T3858 oascc.ZkStateReader$7.process A cluster state change: WatchedEvent state:SyncConnected type:NodeDataChanged path:/collections/customcollreplicadeletion/state.json, has occurred - updating...
[junit4] 2> 1603841 T3843 oascc.ZkStateReader$7.process A cluster state change: WatchedEvent state:SyncConnected type:NodeDataChanged path:/collections/customcollreplicadeletion/state.json, has occurred - updating...
[junit4] 2> 1603843 T3858 oascc.ZkStateReader.updateWatchedCollection Updating data for customcollreplicadeletion to ver 8
[junit4] 2> 1603844 T3843 oascc.ZkStateReader.updateWatchedCollection Updating data for customcollreplicadeletion to ver 8
[junit4] 2> 1603849 T3877 oasc.OverseerCollectionProcessor$Runner.run Overseer Collection Processor: Message id:/overseer/collection-queue-work/qn-0000000000 complete, response:{success={null={responseHeader={status=0,QTime=526},core=customcollreplicadeletion_a_replica1},null={responseHeader={status=0,QTime=1746},core=customcollreplicadeletion_b_replica1}}}
[junit4] 2> 1603850 T3843 oasc.DistributedQueue$LatchChildWatcher.process LatchChildWatcher fired on path: /overseer/collection-queue-work/qnr-0000000000 state: SyncConnected type NodeDataChanged
[junit4] 2> 1603851 T3843 oasc.DistributedQueue$LatchChildWatcher.process LatchChildWatcher fired on path: /overseer/collection-queue-work state: SyncConnected type NodeChildrenChanged
[junit4] 2> 1603853 T3825 oass.SolrDispatchFilter.handleAdminRequest [admin] webapp=null path=/admin/collections params={replicationFactor=1&stateFormat=2&maxShardsPerNode=5&wt=javabin&shards=a,b&version=2&numShards=1&name=customcollreplicadeletion&router.name=implicit&action=CREATE} status=0 QTime=1872
[junit4] 2> 1603854 T3812 oasc.AbstractDistribZkTestBase.waitForRecoveriesToFinish Wait for recoveries to finish - collection: customcollreplicadeletion failOnTimeout:true timeout (sec):330
[junit4] 2> 1603856 T3812 oasc.AbstractDistribZkTestBase.waitForRecoveriesToFinish Recoveries finished - collection: customcollreplicadeletion
[junit4] 2> 1603856 T3812 oascc.SolrZkClient.createZkCredentialsToAddAutomatically Using default ZkCredentialsProvider
[junit4] 2> 1603857 T3812 oascc.ConnectionManager.waitForConnected Waiting for client to connect to ZooKeeper
[junit4] 2> 1603859 T3886 oascc.ConnectionManager.process Watcher org.apache.solr.common.cloud.ConnectionManager@3909b34e name:ZooKeeperConnection Watcher:127.0.0.1:38237/solr got event WatchedEvent state:SyncConnected type:None path:null path:null type:None
[junit4] 2> 1603859 T3812 oascc.ConnectionManager.waitForConnected Client is connected to ZooKeeper
[junit4] 2> 1603859 T3812 oascc.SolrZkClient.createZkACLProvider Using default ZkACLProvider
[junit4] 2> 1603860 T3812 oascc.ZkStateReader.createClusterStateWatchersAndUpdate Updating cluster state from ZooKeeper...
[junit4] 2> 1603866 T3825 oasha.CollectionsHandler.handleRemoveReplica Remove replica: shard=a&replica=core_node1&wt=javabin&version=2&collection=customcollreplicadeletion&action=deletereplica
[junit4] 2> 1603867 T3843 oasc.DistributedQueue$LatchChildWatcher.process LatchChildWatcher fired on path: /overseer/collection-queue-work state: SyncConnected type NodeChildrenChanged
[junit4] 2> 1603868 T3836 oasc.OverseerCollectionProcessor.run Overseer Collection Processor: Get the message id:/overseer/collection-queue-work/qn-0000000002 message:{
[junit4] 2> "operation":"deletereplica",
[junit4] 2> "collection":"customcollreplicadeletion",
[junit4] 2> "shard":"a",
[junit4] 2> "replica":"core_node1"}
[junit4] 2> 1603868 T3887 oasc.OverseerCollectionProcessor.processMessage WARN OverseerCollectionProcessor.processMessage : deletereplica , {
[junit4] 2> "operation":"deletereplica",
[junit4] 2> "collection":"customcollreplicadeletion",
[junit4] 2> "shard":"a",
[junit4] 2> "replica":"core_node1"}
[junit4] 2> 1603872 T3824 oasc.SolrCore.close [customcollreplicadeletion_a_replica1] CLOSING SolrCore org.apache.solr.core.SolrCore@6f0bf8a6
[junit4] 2> 1603881 T3824 oasu.DirectUpdateHandler2.close closing DirectUpdateHandler2{commits=0,autocommits=0,soft autocommits=0,optimizes=0,rollbacks=0,expungeDeletes=0,docsPending=0,adds=0,deletesById=0,deletesByQuery=0,errors=0,cumulative_adds=0,cumulative_deletesById=0,cumulative_deletesByQuery=0,cumulative_errors=0,transaction_logs_total_size=0,transaction_logs_total_number=0}
[junit4] 2> 1603882 T3824 oasu.SolrCoreState.decrefSolrCoreState Closing SolrCoreState
[junit4] 2> 1603882 T3824 oasu.DefaultSolrCoreState.closeIndexWriter SolrCoreState ref count has reached 0 - closing IndexWriter
[junit4] 2> 1603882 T3824 oasu.DefaultSolrCoreState.closeIndexWriter closing IndexWriter with IndexWriterCloser
[junit4] 2> 1603883 T3824 oasc.SolrCore.closeSearcher [customcollreplicadeletion_a_replica1] Closing main searcher on request.
[junit4] 2> 1603884 T3824 oasc.CachingDirectoryFactory.close Closing MockDirectoryFactory - 2 directories currently being tracked
[junit4] 2> 1603884 T3824 oasc.CachingDirectoryFactory.closeCacheValue looking to close /usr/home/jenkins/jenkins-slave/workspace/Lucene-Solr-Tests-5.x-Java7/solr/build/solr-core/test/J3/temp/solr.cloud.DeleteLastCustomShardedReplicaTest-B0D616B7E0527FAC-001/tempDir-002/customcollreplicadeletion_a_replica1/data [CachedDir<<refCount=0;path=/usr/home/jenkins/jenkins-slave/workspace/Lucene-Solr-Tests-5.x-Java7/solr/build/solr-core/test/J3/temp/solr.cloud.DeleteLastCustomShardedReplicaTest-B0D616B7E0527FAC-001/tempDir-002/customcollreplicadeletion_a_replica1/data;done=false>>]
[junit4] 2> 1603884 T3824 oasc.CachingDirectoryFactory.closeCacheValue looking to close /usr/home/jenkins/jenkins-slave/workspace/Lucene-Solr-Tests-5.x-Java7/solr/build/solr-core/test/J3/temp/solr.cloud.DeleteLastCustomShardedReplicaTest-B0D616B7E0527FAC-001/tempDir-002/customcollreplicadeletion_a_replica1/data/index [CachedDir<<refCount=0;path=/
[...truncated too long message...]
-core/test/J3/../../../../../../../../../../../usr/home/jenkins/jenkins-slave/workspace/Lucene-Solr-Tests-5.x-Java7/solr/build/solr-core/test/J3/temp/solr.cloud.DeleteLastCustomShardedReplicaTest-B0D616B7E0527FAC-001/tempDir-003/customcollreplicadeletion_b_replica1/data/index
[junit4] 2> 1715752 T3812 oasc.CachingDirectoryFactory.closeCacheValue looking to close /usr/home/jenkins/jenkins-slave/workspace/Lucene-Solr-Tests-5.x-Java7/solr/build/solr-core/test/J3/../../../../../../../../../../../usr/home/jenkins/jenkins-slave/workspace/Lucene-Solr-Tests-5.x-Java7/solr/build/solr-core/test/J3/temp/solr.cloud.DeleteLastCustomShardedReplicaTest-B0D616B7E0527FAC-001/tempDir-003/customcollreplicadeletion_b_replica1/data [CachedDir<<refCount=0;path=/usr/home/jenkins/jenkins-slave/workspace/Lucene-Solr-Tests-5.x-Java7/solr/build/solr-core/test/J3/../../../../../../../../../../../usr/home/jenkins/jenkins-slave/workspace/Lucene-Solr-Tests-5.x-Java7/solr/build/solr-core/test/J3/temp/solr.cloud.DeleteLastCustomShardedReplicaTest-B0D616B7E0527FAC-001/tempDir-003/customcollreplicadeletion_b_replica1/data;done=false>>]
[junit4] 2> 1715752 T3812 oasc.CachingDirectoryFactory.close Closing directory: /usr/home/jenkins/jenkins-slave/workspace/Lucene-Solr-Tests-5.x-Java7/solr/build/solr-core/test/J3/../../../../../../../../../../../usr/home/jenkins/jenkins-slave/workspace/Lucene-Solr-Tests-5.x-Java7/solr/build/solr-core/test/J3/temp/solr.cloud.DeleteLastCustomShardedReplicaTest-B0D616B7E0527FAC-001/tempDir-003/customcollreplicadeletion_b_replica1/data
[junit4] 2> 1715753 T3812 oasc.Overseer.close Overseer (id=92547054845362183-127.0.0.1:45343_-n_0000000001) closing
[junit4] 2> 1715754 T3897 oasc.Overseer$ClusterStateUpdater.run Overseer Loop exiting : 127.0.0.1:45343_
[junit4] 2> 1715757 T3901 oasc.OverseerElectionContext.runLeaderProcess I am going to be the leader 127.0.0.1:45346_
[junit4] 2> 1715758 T3901 oascc.SolrZkClient.makePath makePath: /overseer_elect/leader
[junit4] 2> 1715759 T3901 oasc.Overseer.start Overseer (id=92547054845362185-127.0.0.1:45346_-n_0000000002) starting
[junit4] 2> 1715766 T3901 oasc.OverseerAutoReplicaFailoverThread.<init> Starting OverseerAutoReplicaFailoverThread autoReplicaFailoverWorkLoopDelay=10000 autoReplicaFailoverWaitAfterExpiration=10000 autoReplicaFailoverBadNodeExpiration=60000
[junit4] 2> 1715766 T3903 oasc.OverseerCollectionProcessor.run Process current queue of collection creations
[junit4] 2> 1715768 T3902 oasc.Overseer$ClusterStateUpdater.run Starting to work on the main queue
[junit4] 2> 1717256 T3896 oascc.ZkStateReader$3.process WARN ZooKeeper watch triggered, but Solr cannot talk to ZK
[junit4] 2> 1717258 T3812 oejsh.ContextHandler.doStop stopped o.e.j.s.ServletContextHandler{/,null}
[junit4] 2> 1722260 T3812 oasc.ChaosMonkey.monkeyLog monkey: stop shard! 45346
[junit4] 2> 1722261 T3812 oasc.CoreContainer.shutdown Shutting down CoreContainer instance=731401142
[junit4] 2> 1722262 T3812 oasc.Overseer.close Overseer (id=92547054845362185-127.0.0.1:45346_-n_0000000002) closing
[junit4] 2> 1722263 T3902 oasc.Overseer$ClusterStateUpdater.run Overseer Loop exiting : 127.0.0.1:45346_
[junit4] 2> 1722265 T3901 oascc.ZkStateReader$3.process WARN ZooKeeper watch triggered, but Solr cannot talk to ZK
[junit4] 2> 1722266 T3812 oejsh.ContextHandler.doStop stopped o.e.j.s.ServletContextHandler{/,null}
[junit4] 2> 1727267 T3812 oas.SolrTestCaseJ4.tearDown ###Ending testDistribSearch
[junit4] 2> 1727269 T3812 oasc.ZkTestServer.send4LetterWord connecting to 127.0.0.1:38237 38237
[junit4] 2> 1728394 T3813 oasc.ZkTestServer.send4LetterWord connecting to 127.0.0.1:38237 38237
[junit4] 2> NOTE: reproduce with: ant test -Dtestcase=DeleteLastCustomShardedReplicaTest -Dtests.method=testDistribSearch -Dtests.seed=B0D616B7E0527FAC -Dtests.multiplier=2 -Dtests.slow=true -Dtests.locale=en_SG -Dtests.timezone=America/Antigua -Dtests.file.encoding=US-ASCII
[junit4] ERROR 136s J3 | DeleteLastCustomShardedReplicaTest.testDistribSearch <<<
[junit4] > Throwable #1: org.apache.solr.client.solrj.SolrServerException: No live SolrServers available to handle this request:[http://127.0.0.1:45346, http://127.0.0.1:45343, http://127.0.0.1:37130]
[junit4] > at __randomizedtesting.SeedInfo.seed([B0D616B7E0527FAC:313098AF970D1F90]:0)
[junit4] > at org.apache.solr.client.solrj.impl.LBHttpSolrServer.request(LBHttpSolrServer.java:322)
[junit4] > at org.apache.solr.client.solrj.impl.CloudSolrServer.sendRequest(CloudSolrServer.java:880)
[junit4] > at org.apache.solr.client.solrj.impl.CloudSolrServer.requestWithRetryOnStaleState(CloudSolrServer.java:658)
[junit4] > at org.apache.solr.client.solrj.impl.CloudSolrServer.request(CloudSolrServer.java:601)
[junit4] > at org.apache.solr.cloud.DeleteLastCustomShardedReplicaTest.removeAndWaitForLastReplicaGone(DeleteLastCustomShardedReplicaTest.java:117)
[junit4] > at org.apache.solr.cloud.DeleteLastCustomShardedReplicaTest.doTest(DeleteLastCustomShardedReplicaTest.java:107)
[junit4] > at org.apache.solr.BaseDistributedSearchTestCase.testDistribSearch(BaseDistributedSearchTestCase.java:869)
[junit4] > at java.lang.Thread.run(Thread.java:745)
[junit4] > Caused by: org.apache.solr.client.solrj.impl.HttpSolrServer$RemoteSolrException: Could not remove replica : customcollreplicadeletion/a/core_node1
[junit4] > at org.apache.solr.client.solrj.impl.HttpSolrServer.executeMethod(HttpSolrServer.java:568)
[junit4] > at org.apache.solr.client.solrj.impl.HttpSolrServer.request(HttpSolrServer.java:215)
[junit4] > at org.apache.solr.client.solrj.impl.HttpSolrServer.request(HttpSolrServer.java:211)
[junit4] > at org.apache.solr.client.solrj.impl.LBHttpSolrServer.doRequest(LBHttpSolrServer.java:343)
[junit4] > at org.apache.solr.client.solrj.impl.LBHttpSolrServer.request(LBHttpSolrServer.java:304)
[junit4] > ... 46 more
[junit4] 2> 1728539 T3812 oas.SolrTestCaseJ4.deleteCore ###deleteCore
[junit4] 2> NOTE: leaving temporary files on disk at: /usr/home/jenkins/jenkins-slave/workspace/Lucene-Solr-Tests-5.x-Java7/solr/build/solr-core/test/J3/temp/solr.cloud.DeleteLastCustomShardedReplicaTest-B0D616B7E0527FAC-001
[junit4] 2> 136225 T3811 ccr.ThreadLeakControl.checkThreadLeaks WARNING Will linger awaiting termination of 1 leaked thread(s).
[junit4] 2> NOTE: test params are: codec=Asserting(Lucene50): {}, docValues:{}, sim=DefaultSimilarity, locale=en_SG, timezone=America/Antigua
[junit4] 2> NOTE: FreeBSD 9.1-RELEASE-p3 amd64/Oracle Corporation 1.7.0_65 (64-bit)/cpus=16,threads=1,free=139901096,total=245366784
[junit4] 2> NOTE: All tests run in this JVM: [TestShardHandlerFactory, TestBlendedInfixSuggestions, SynonymTokenizerTest, AlternateDirectoryTest, TestCollapseQParserPlugin, TestRawResponseWriter, TestMiniSolrCloudCluster, MultiThreadedOCPTest, ParsingFieldUpdateProcessorsTest, BadCopyFieldTest, XmlUpdateRequestHandlerTest, CoreAdminHandlerTest, InfoHandlerTest, TestLRUCache, CopyFieldTest, TestQuerySenderListener, DistributedQueryComponentOptimizationTest, TestClassNameShortening, TestNonDefinedSimilarityFactory, URLClassifyProcessorTest, TestCloudPivotFacet, TestCustomSort, IndexSchemaRuntimeFieldTest, TestLazyCores, DistribDocExpirationUpdateProcessorTest, DebugComponentTest, FileBasedSpellCheckerTest, DocValuesMissingTest, TestSolrJ, MBeansHandlerTest, DocExpirationUpdateProcessorFactoryTest, ShowFileRequestHandlerTest, TestFieldResource, QueryParsingTest, LukeRequestHandlerTest, XsltUpdateRequestHandlerTest, TestHashPartitioner, TestRealTimeGet, TestPhraseSuggestions, EnumFieldTest, TestSystemIdResolver, TestImplicitCoreProperties, TestArbitraryIndexDir, SimpleFacetsTest, OverriddenZkACLAndCredentialsProvidersTest, OverseerTest, MinimalSchemaTest, SuggesterWFSTTest, TestStandardQParsers, PluginInfoTest, TestSolr4Spatial2, TestOmitPositions, TestReplicationHandler, TestDistributedSearch, CloudExitableDirectoryReaderTest, TestManagedSchemaFieldResource, TestDistribDocBasedVersion, DistributedSuggestComponentTest, TestModifyConfFiles, DeleteLastCustomShardedReplicaTest]
[junit4] Completed on J3 in 136.50s, 1 test, 1 error <<< FAILURES!
[...truncated 514 lines...]
BUILD FAILED
/usr/home/jenkins/jenkins-slave/workspace/Lucene-Solr-Tests-5.x-Java7/build.xml:524: The following error occurred while executing this line:
/usr/home/jenkins/jenkins-slave/workspace/Lucene-Solr-Tests-5.x-Java7/build.xml:472: The following error occurred while executing this line:
/usr/home/jenkins/jenkins-slave/workspace/Lucene-Solr-Tests-5.x-Java7/build.xml:61: The following error occurred while executing this line:
/usr/home/jenkins/jenkins-slave/workspace/Lucene-Solr-Tests-5.x-Java7/extra-targets.xml:39: The following error occurred while executing this line:
/usr/home/jenkins/jenkins-slave/workspace/Lucene-Solr-Tests-5.x-Java7/solr/build.xml:189: The following error occurred while executing this line:
/usr/home/jenkins/jenkins-slave/workspace/Lucene-Solr-Tests-5.x-Java7/solr/common-build.xml:496: The following error occurred while executing this line:
/usr/home/jenkins/jenkins-slave/workspace/Lucene-Solr-Tests-5.x-Java7/lucene/common-build.xml:1360: The following error occurred while executing this line:
/usr/home/jenkins/jenkins-slave/workspace/Lucene-Solr-Tests-5.x-Java7/lucene/common-build.xml:962: There were test failures: 431 suites, 1778 tests, 1 error, 59 ignored (24 assumptions)
Total time: 54 minutes 15 seconds
Build step 'Invoke Ant' marked build as failure
Archiving artifacts
Sending artifact delta relative to Lucene-Solr-Tests-5.x-Java7 #2144
Archived 5 artifacts
Archive block size is 32768
Received 0 blocks and 165545430 bytes
Compression is 0.0%
Took 29 sec
Recording test results
Email was triggered for: Failure
Sending email for trigger: Failure
[JENKINS] Lucene-Solr-Tests-5.x-Java7 - Build # 2147 - Still
Failing
Posted by Apache Jenkins Server <je...@builds.apache.org>.
Build: https://builds.apache.org/job/Lucene-Solr-Tests-5.x-Java7/2147/
1 tests failed.
REGRESSION: org.apache.solr.SolrInfoMBeanTest.testCallMBeanInfo
Error Message:
Stack Trace:
java.lang.AssertionError
at __randomizedtesting.SeedInfo.seed([14B5983D1FB1352B:EBD3150174C94835]:0)
at org.junit.Assert.fail(Assert.java:92)
at org.junit.Assert.assertTrue(Assert.java:43)
at org.junit.Assert.assertNotNull(Assert.java:526)
at org.junit.Assert.assertNotNull(Assert.java:537)
at org.apache.solr.SolrInfoMBeanTest.testCallMBeanInfo(SolrInfoMBeanTest.java:66)
at sun.reflect.NativeMethodAccessorImpl.invoke0(Native Method)
at sun.reflect.NativeMethodAccessorImpl.invoke(NativeMethodAccessorImpl.java:57)
at sun.reflect.DelegatingMethodAccessorImpl.invoke(DelegatingMethodAccessorImpl.java:43)
at java.lang.reflect.Method.invoke(Method.java:606)
at com.carrotsearch.randomizedtesting.RandomizedRunner.invoke(RandomizedRunner.java:1618)
at com.carrotsearch.randomizedtesting.RandomizedRunner$6.evaluate(RandomizedRunner.java:827)
at com.carrotsearch.randomizedtesting.RandomizedRunner$7.evaluate(RandomizedRunner.java:863)
at com.carrotsearch.randomizedtesting.RandomizedRunner$8.evaluate(RandomizedRunner.java:877)
at com.carrotsearch.randomizedtesting.rules.SystemPropertiesRestoreRule$1.evaluate(SystemPropertiesRestoreRule.java:53)
at org.apache.lucene.util.TestRuleSetupTeardownChained$1.evaluate(TestRuleSetupTeardownChained.java:50)
at org.apache.lucene.util.AbstractBeforeAfterRule$1.evaluate(AbstractBeforeAfterRule.java:46)
at com.carrotsearch.randomizedtesting.rules.SystemPropertiesInvariantRule$1.evaluate(SystemPropertiesInvariantRule.java:55)
at org.apache.lucene.util.TestRuleThreadAndTestName$1.evaluate(TestRuleThreadAndTestName.java:49)
at org.apache.lucene.util.TestRuleIgnoreAfterMaxFailures$1.evaluate(TestRuleIgnoreAfterMaxFailures.java:65)
at org.apache.lucene.util.TestRuleMarkFailure$1.evaluate(TestRuleMarkFailure.java:48)
at com.carrotsearch.randomizedtesting.rules.StatementAdapter.evaluate(StatementAdapter.java:36)
at com.carrotsearch.randomizedtesting.ThreadLeakControl$StatementRunner.run(ThreadLeakControl.java:365)
at com.carrotsearch.randomizedtesting.ThreadLeakControl.forkTimeoutingTask(ThreadLeakControl.java:798)
at com.carrotsearch.randomizedtesting.ThreadLeakControl$3.evaluate(ThreadLeakControl.java:458)
at com.carrotsearch.randomizedtesting.RandomizedRunner.runSingleTest(RandomizedRunner.java:836)
at com.carrotsearch.randomizedtesting.RandomizedRunner$3.evaluate(RandomizedRunner.java:738)
at com.carrotsearch.randomizedtesting.RandomizedRunner$4.evaluate(RandomizedRunner.java:772)
at com.carrotsearch.randomizedtesting.RandomizedRunner$5.evaluate(RandomizedRunner.java:783)
at com.carrotsearch.randomizedtesting.rules.StatementAdapter.evaluate(StatementAdapter.java:36)
at com.carrotsearch.randomizedtesting.rules.SystemPropertiesRestoreRule$1.evaluate(SystemPropertiesRestoreRule.java:53)
at org.apache.lucene.util.AbstractBeforeAfterRule$1.evaluate(AbstractBeforeAfterRule.java:46)
at org.apache.lucene.util.TestRuleStoreClassName$1.evaluate(TestRuleStoreClassName.java:42)
at com.carrotsearch.randomizedtesting.rules.SystemPropertiesInvariantRule$1.evaluate(SystemPropertiesInvariantRule.java:55)
at com.carrotsearch.randomizedtesting.rules.NoShadowingOrOverridesOnMethodsRule$1.evaluate(NoShadowingOrOverridesOnMethodsRule.java:39)
at com.carrotsearch.randomizedtesting.rules.NoShadowingOrOverridesOnMethodsRule$1.evaluate(NoShadowingOrOverridesOnMethodsRule.java:39)
at com.carrotsearch.randomizedtesting.rules.StatementAdapter.evaluate(StatementAdapter.java:36)
at com.carrotsearch.randomizedtesting.rules.StatementAdapter.evaluate(StatementAdapter.java:36)
at com.carrotsearch.randomizedtesting.rules.StatementAdapter.evaluate(StatementAdapter.java:36)
at org.apache.lucene.util.TestRuleAssertionsRequired$1.evaluate(TestRuleAssertionsRequired.java:43)
at org.apache.lucene.util.TestRuleMarkFailure$1.evaluate(TestRuleMarkFailure.java:48)
at org.apache.lucene.util.TestRuleIgnoreAfterMaxFailures$1.evaluate(TestRuleIgnoreAfterMaxFailures.java:65)
at org.apache.lucene.util.TestRuleIgnoreTestSuites$1.evaluate(TestRuleIgnoreTestSuites.java:55)
at com.carrotsearch.randomizedtesting.rules.StatementAdapter.evaluate(StatementAdapter.java:36)
at com.carrotsearch.randomizedtesting.ThreadLeakControl$StatementRunner.run(ThreadLeakControl.java:365)
at java.lang.Thread.run(Thread.java:745)
Build Log:
[...truncated 11376 lines...]
[junit4] Suite: org.apache.solr.SolrInfoMBeanTest
[junit4] 2> Creating dataDir: /usr/home/jenkins/jenkins-slave/workspace/Lucene-Solr-Tests-5.x-Java7/solr/build/solr-core/test/J0/temp/solr.SolrInfoMBeanTest-14B5983D1FB1352B-001/init-core-data-001
[junit4] 2> 1475642 T3899 oas.SolrTestCaseJ4.buildSSLConfig Randomized ssl (false) and clientAuth (false)
[junit4] 2> 1475644 T3899 oas.SolrTestCaseJ4.initCore ####initCore
[junit4] 2> 1475645 T3899 oasc.SolrResourceLoader.<init> new SolrResourceLoader for directory: '/usr/home/jenkins/jenkins-slave/workspace/Lucene-Solr-Tests-5.x-Java7/solr/core/src/test-files/solr/collection1/'
[junit4] 2> 1475646 T3899 oasc.SolrResourceLoader.replaceClassLoader Adding 'file:/usr/home/jenkins/jenkins-slave/workspace/Lucene-Solr-Tests-5.x-Java7/solr/core/src/test-files/solr/collection1/lib/classes/' to classloader
[junit4] 2> 1475647 T3899 oasc.SolrResourceLoader.replaceClassLoader Adding 'file:/usr/home/jenkins/jenkins-slave/workspace/Lucene-Solr-Tests-5.x-Java7/solr/core/src/test-files/solr/collection1/lib/README' to classloader
[junit4] 2> 1475647 T3899 oasc.SolrResourceLoader.replaceClassLoader Adding 'file:/usr/home/jenkins/jenkins-slave/workspace/Lucene-Solr-Tests-5.x-Java7/solr/core/src/test-files/solr/collection1/lib/.svn/' to classloader
[junit4] 2> 1475753 T3899 oasc.SolrConfig.<init> Using Lucene MatchVersion: 5.0.0
[junit4] 2> 1475799 T3899 oasc.SolrConfig.<init> Loaded SolrConfig: solrconfig.xml
[junit4] 2> 1475800 T3899 oass.IndexSchema.readSchema Reading Solr Schema from schema.xml
[junit4] 2> 1475807 T3899 oass.IndexSchema.readSchema [null] Schema name=test
[junit4] 2> 1476058 T3899 oass.OpenExchangeRatesOrgProvider.init Initialized with rates=open-exchange-rates.json, refreshInterval=1440.
[junit4] 2> 1476065 T3899 oass.IndexSchema.readSchema default search field in schema is text
[junit4] 2> 1476067 T3899 oass.IndexSchema.readSchema unique key field: id
[junit4] 2> 1476075 T3899 oass.FileExchangeRateProvider.reload Reloading exchange rates from file currency.xml
[junit4] 2> 1476078 T3899 oass.FileExchangeRateProvider.reload Reloading exchange rates from file currency.xml
[junit4] 2> 1476080 T3899 oass.OpenExchangeRatesOrgProvider.reload Reloading exchange rates from open-exchange-rates.json
[junit4] 2> 1476081 T3899 oass.OpenExchangeRatesOrgProvider$OpenExchangeRates.<init> WARN Unknown key IMPORTANT NOTE
[junit4] 2> 1476081 T3899 oass.OpenExchangeRatesOrgProvider$OpenExchangeRates.<init> WARN Expected key, got STRING
[junit4] 2> 1476082 T3899 oass.OpenExchangeRatesOrgProvider.reload Reloading exchange rates from open-exchange-rates.json
[junit4] 2> 1476082 T3899 oass.OpenExchangeRatesOrgProvider$OpenExchangeRates.<init> WARN Unknown key IMPORTANT NOTE
[junit4] 2> 1476082 T3899 oass.OpenExchangeRatesOrgProvider$OpenExchangeRates.<init> WARN Expected key, got STRING
[junit4] 2> 1476082 T3899 oasc.SolrResourceLoader.locateSolrHome JNDI not configured for solr (NoInitialContextEx)
[junit4] 2> 1476083 T3899 oasc.SolrResourceLoader.locateSolrHome using system property solr.solr.home: /usr/home/jenkins/jenkins-slave/workspace/Lucene-Solr-Tests-5.x-Java7/solr/core/src/test-files/solr
[junit4] 2> 1476083 T3899 oasc.SolrResourceLoader.<init> new SolrResourceLoader for directory: '/usr/home/jenkins/jenkins-slave/workspace/Lucene-Solr-Tests-5.x-Java7/solr/core/src/test-files/solr/'
[junit4] 2> 1476124 T3899 oasc.CoreContainer.<init> New CoreContainer 1371724469
[junit4] 2> 1476125 T3899 oasc.CoreContainer.load Loading cores into CoreContainer [instanceDir=/usr/home/jenkins/jenkins-slave/workspace/Lucene-Solr-Tests-5.x-Java7/solr/core/src/test-files/solr/]
[junit4] 2> 1476125 T3899 oashc.HttpShardHandlerFactory.getParameter Setting socketTimeout to: 0
[junit4] 2> 1476126 T3899 oashc.HttpShardHandlerFactory.getParameter Setting urlScheme to: null
[junit4] 2> 1476126 T3899 oashc.HttpShardHandlerFactory.getParameter Setting connTimeout to: 0
[junit4] 2> 1476126 T3899 oashc.HttpShardHandlerFactory.getParameter Setting maxConnectionsPerHost to: 20
[junit4] 2> 1476126 T3899 oashc.HttpShardHandlerFactory.getParameter Setting corePoolSize to: 0
[junit4] 2> 1476126 T3899 oashc.HttpShardHandlerFactory.getParameter Setting maximumPoolSize to: 2147483647
[junit4] 2> 1476127 T3899 oashc.HttpShardHandlerFactory.getParameter Setting maxThreadIdleTime to: 5
[junit4] 2> 1476127 T3899 oashc.HttpShardHandlerFactory.getParameter Setting sizeOfQueue to: -1
[junit4] 2> 1476127 T3899 oashc.HttpShardHandlerFactory.getParameter Setting fairnessPolicy to: false
[junit4] 2> 1476127 T3899 oasu.UpdateShardHandler.<init> Creating UpdateShardHandler HTTP client with params: socketTimeout=30000&connTimeout=30000&retry=false
[junit4] 2> 1476127 T3899 oasl.LogWatcher.createWatcher SLF4J impl is org.slf4j.impl.Log4jLoggerFactory
[junit4] 2> 1476128 T3899 oasl.LogWatcher.newRegisteredLogWatcher Registering Log Listener [Log4j (org.slf4j.impl.Log4jLoggerFactory)]
[junit4] 2> 1476128 T3899 oasc.CoreContainer.load Host Name:
[junit4] 2> 1476131 T3900 oasc.SolrResourceLoader.<init> new SolrResourceLoader for directory: '/usr/home/jenkins/jenkins-slave/workspace/Lucene-Solr-Tests-5.x-Java7/solr/core/src/test-files/solr/collection1/'
[junit4] 2> 1476133 T3900 oasc.SolrResourceLoader.replaceClassLoader Adding 'file:/usr/home/jenkins/jenkins-slave/workspace/Lucene-Solr-Tests-5.x-Java7/solr/core/src/test-files/solr/collection1/lib/classes/' to classloader
[junit4] 2> 1476133 T3900 oasc.SolrResourceLoader.replaceClassLoader Adding 'file:/usr/home/jenkins/jenkins-slave/workspace/Lucene-Solr-Tests-5.x-Java7/solr/core/src/test-files/solr/collection1/lib/README' to classloader
[junit4] 2> 1476133 T3900 oasc.SolrResourceLoader.replaceClassLoader Adding 'file:/usr/home/jenkins/jenkins-slave/workspace/Lucene-Solr-Tests-5.x-Java7/solr/core/src/test-files/solr/collection1/lib/.svn/' to classloader
[junit4] 2> 1476174 T3900 oasc.SolrConfig.<init> Using Lucene MatchVersion: 5.0.0
[junit4] 2> 1476253 T3900 oasc.SolrConfig.<init> Loaded SolrConfig: solrconfig.xml
[junit4] 2> 1476254 T3900 oass.IndexSchema.readSchema Reading Solr Schema from schema.xml
[junit4] 2> 1476266 T3900 oass.IndexSchema.readSchema [collection1] Schema name=test
[junit4] 2> 1476589 T3900 oass.OpenExchangeRatesOrgProvider.init Initialized with rates=open-exchange-rates.json, refreshInterval=1440.
[junit4] 2> 1476593 T3900 oass.IndexSchema.readSchema default search field in schema is text
[junit4] 2> 1476595 T3900 oass.IndexSchema.readSchema unique key field: id
[junit4] 2> 1476602 T3900 oass.FileExchangeRateProvider.reload Reloading exchange rates from file currency.xml
[junit4] 2> 1476605 T3900 oass.FileExchangeRateProvider.reload Reloading exchange rates from file currency.xml
[junit4] 2> 1476608 T3900 oass.OpenExchangeRatesOrgProvider.reload Reloading exchange rates from open-exchange-rates.json
[junit4] 2> 1476608 T3900 oass.OpenExchangeRatesOrgProvider$OpenExchangeRates.<init> WARN Unknown key IMPORTANT NOTE
[junit4] 2> 1476608 T3900 oass.OpenExchangeRatesOrgProvider$OpenExchangeRates.<init> WARN Expected key, got STRING
[junit4] 2> 1476609 T3900 oass.OpenExchangeRatesOrgProvider.reload Reloading exchange rates from open-exchange-rates.json
[junit4] 2> 1476609 T3900 oass.OpenExchangeRatesOrgProvider$OpenExchangeRates.<init> WARN Unknown key IMPORTANT NOTE
[junit4] 2> 1476609 T3900 oass.OpenExchangeRatesOrgProvider$OpenExchangeRates.<init> WARN Expected key, got STRING
[junit4] 2> 1476609 T3900 oasc.CoreContainer.create Creating SolrCore 'collection1' using configuration from instancedir /usr/home/jenkins/jenkins-slave/workspace/Lucene-Solr-Tests-5.x-Java7/solr/core/src/test-files/solr/collection1/
[junit4] 2> 1476610 T3900 oasc.SolrCore.initDirectoryFactory org.apache.solr.core.MockDirectoryFactory
[junit4] 2> 1476610 T3900 oasc.SolrCore.<init> [collection1] Opening new SolrCore at /usr/home/jenkins/jenkins-slave/workspace/Lucene-Solr-Tests-5.x-Java7/solr/core/src/test-files/solr/collection1/, dataDir=/usr/home/jenkins/jenkins-slave/workspace/Lucene-Solr-Tests-5.x-Java7/solr/build/solr-core/test/J0/temp/solr.SolrInfoMBeanTest-14B5983D1FB1352B-001/init-core-data-001/
[junit4] 2> 1476610 T3900 oasc.JmxMonitoredMap.<init> JMX monitoring is enabled. Adding Solr mbeans to JMX Server: com.sun.jmx.mbeanserver.JmxMBeanServer@1413659c
[junit4] 2> 1476611 T3900 oasc.CachingDirectoryFactory.get return new directory for /usr/home/jenkins/jenkins-slave/workspace/Lucene-Solr-Tests-5.x-Java7/solr/build/solr-core/test/J0/temp/solr.SolrInfoMBeanTest-14B5983D1FB1352B-001/init-core-data-001
[junit4] 2> 1476611 T3900 oasc.SolrCore.getNewIndexDir New index directory detected: old=null new=/usr/home/jenkins/jenkins-slave/workspace/Lucene-Solr-Tests-5.x-Java7/solr/build/solr-core/test/J0/temp/solr.SolrInfoMBeanTest-14B5983D1FB1352B-001/init-core-data-001/index/
[junit4] 2> 1476611 T3900 oasc.SolrCore.initIndex WARN [collection1] Solr index directory '/usr/home/jenkins/jenkins-slave/workspace/Lucene-Solr-Tests-5.x-Java7/solr/build/solr-core/test/J0/temp/solr.SolrInfoMBeanTest-14B5983D1FB1352B-001/init-core-data-001/index' doesn't exist. Creating new index...
[junit4] 2> 1476611 T3900 oasc.CachingDirectoryFactory.get return new directory for /usr/home/jenkins/jenkins-slave/workspace/Lucene-Solr-Tests-5.x-Java7/solr/build/solr-core/test/J0/temp/solr.SolrInfoMBeanTest-14B5983D1FB1352B-001/init-core-data-001/index
[junit4] 2> 1476611 T3900 oasu.RandomMergePolicy.<init> RandomMergePolicy wrapping class org.apache.lucene.index.TieredMergePolicy: [TieredMergePolicy: maxMergeAtOnce=11, maxMergeAtOnceExplicit=25, maxMergedSegmentMB=1.9189453125, floorSegmentMB=1.7509765625, forceMergeDeletesPctAllowed=12.255853616880207, segmentsPerTier=35.0, maxCFSSegmentSizeMB=8.796093022207999E12, noCFSRatio=0.0
[junit4] 2> 1476612 T3900 oasc.SolrDeletionPolicy.onCommit SolrDeletionPolicy.onCommit: commits: num=1
[junit4] 2> commit{dir=RateLimitedDirectoryWrapper(MockDirectoryWrapper(RAMDirectory(id=lucene-28f0a213))),segFN=segments_1,generation=1}
[junit4] 2> 1476612 T3900 oasc.SolrDeletionPolicy.updateCommits newest commit generation = 1
[junit4] 2> 1476613 T3900 oasc.SolrCore.initWriters created xml: solr.XMLResponseWriter
[junit4] 2> 1476616 T3900 oasup.UpdateRequestProcessorChain.init creating updateRequestProcessorChain "dedupe"
[junit4] 2> 1476616 T3900 oasup.UpdateRequestProcessorChain.init inserting DistributedUpdateProcessorFactory into updateRequestProcessorChain "dedupe"
[junit4] 2> 1476616 T3900 oasup.UpdateRequestProcessorChain.init creating updateRequestProcessorChain "dedupe-allfields"
[junit4] 2> 1476616 T3900 oasup.UpdateRequestProcessorChain.init inserting DistributedUpdateProcessorFactory into updateRequestProcessorChain "dedupe-allfields"
[junit4] 2> 1476616 T3900 oasup.UpdateRequestProcessorChain.init creating updateRequestProcessorChain "stored_sig"
[junit4] 2> 1476617 T3900 oasup.UpdateRequestProcessorChain.init inserting DistributedUpdateProcessorFactory into updateRequestProcessorChain "stored_sig"
[junit4] 2> 1476617 T3900 oasup.UpdateRequestProcessorChain.init creating updateRequestProcessorChain "uniq-fields"
[junit4] 2> 1476617 T3900 oasup.UpdateRequestProcessorChain.init inserting DistributedUpdateProcessorFactory into updateRequestProcessorChain "uniq-fields"
[junit4] 2> 1476617 T3900 oasup.UpdateRequestProcessorChain.init creating updateRequestProcessorChain "distrib-dup-test-chain-explicit"
[junit4] 2> 1476617 T3900 oasup.UpdateRequestProcessorChain.init creating updateRequestProcessorChain "distrib-dup-test-chain-implicit"
[junit4] 2> 1476618 T3900 oasup.UpdateRequestProcessorChain.init inserting DistributedUpdateProcessorFactory into updateRequestProcessorChain "distrib-dup-test-chain-implicit"
[junit4] 2> 1476618 T3900 oasc.SolrCore.loadUpdateProcessorChains no updateRequestProcessorChain defined as default, creating implicit default
[junit4] 2> 1476618 T3900 oasc.RequestHandlers.initHandlersFromConfig created /update/csv: org.apache.solr.handler.UpdateRequestHandler
[junit4] 2> 1476619 T3900 oasc.RequestHandlers.initHandlersFromConfig created /update/json/docs: org.apache.solr.handler.UpdateRequestHandler
[junit4] 2> 1476619 T3900 oasc.RequestHandlers.initHandlersFromConfig created /update/json: org.apache.solr.handler.UpdateRequestHandler
[junit4] 2> 1476619 T3900 oasc.RequestHandlers.initHandlersFromConfig adding lazy requestHandler: solr.ReplicationHandler
[junit4] 2> 1476619 T3900 oasc.RequestHandlers.initHandlersFromConfig created /replication: solr.ReplicationHandler
[junit4] 2> 1476619 T3900 oasc.RequestHandlers.initHandlersFromConfig created standard: solr.StandardRequestHandler
[junit4] 2> 1476620 T3900 oasc.RequestHandlers.initHandlersFromConfig created /get: solr.RealTimeGetHandler
[junit4] 2> 1476620 T3900 oasc.RequestHandlers.initHandlersFromConfig created dismax: solr.SearchHandler
[junit4] 2> 1476620 T3900 oasc.RequestHandlers.initHandlersFromConfig created mock: org.apache.solr.core.MockQuerySenderListenerReqHandler
[junit4] 2> 1476621 T3900 oasc.RequestHandlers.initHandlersFromConfig created /admin/: org.apache.solr.handler.admin.AdminHandlers
[junit4] 2> 1476621 T3900 oasc.RequestHandlers.initHandlersFromConfig created /admin/file: solr.admin.ShowFileRequestHandler
[junit4] 2> 1476621 T3900 oasc.RequestHandlers.initHandlersFromConfig created /admin/fileedit: solr.admin.EditFileRequestHandler
[junit4] 2> 1476622 T3900 oasc.RequestHandlers.initHandlersFromConfig created defaults: solr.StandardRequestHandler
[junit4] 2> 1476622 T3900 oasc.RequestHandlers.initHandlersFromConfig adding lazy requestHandler: solr.StandardRequestHandler
[junit4] 2> 1476622 T3900 oasc.RequestHandlers.initHandlersFromConfig created lazy: solr.StandardRequestHandler
[junit4] 2> 1476622 T3900 oasc.RequestHandlers.initHandlersFromConfig created /update: solr.UpdateRequestHandler
[junit4] 2> 1476623 T3900 oasc.RequestHandlers.initHandlersFromConfig created /terms: org.apache.solr.handler.component.SearchHandler
[junit4] 2> 1476623 T3900 oasc.RequestHandlers.initHandlersFromConfig created spellCheckCompRH: org.apache.solr.handler.component.SearchHandler
[junit4] 2> 1476623 T3900 oasc.RequestHandlers.initHandlersFromConfig created spellCheckCompRH_Direct: org.apache.solr.handler.component.SearchHandler
[junit4] 2> 1476624 T3900 oasc.RequestHandlers.initHandlersFromConfig created spellCheckWithWordbreak: org.apache.solr.handler.component.SearchHandler
[junit4] 2> 1476624 T3900 oasc.RequestHandlers.initHandlersFromConfig created spellCheckWithWordbreak_Direct: org.apache.solr.handler.component.SearchHandler
[junit4] 2> 1476624 T3900 oasc.RequestHandlers.initHandlersFromConfig created spellCheckCompRH1: org.apache.solr.handler.component.SearchHandler
[junit4] 2> 1476624 T3900 oasc.RequestHandlers.initHandlersFromConfig created mltrh: org.apache.solr.handler.component.SearchHandler
[junit4] 2> 1476625 T3900 oasc.RequestHandlers.initHandlersFromConfig created tvrh: org.apache.solr.handler.component.SearchHandler
[junit4] 2> 1476625 T3900 oasc.RequestHandlers.initHandlersFromConfig created /mlt: solr.MoreLikeThisHandler
[junit4] 2> 1476625 T3900 oasc.RequestHandlers.initHandlersFromConfig created /debug/dump: solr.DumpRequestHandler
[junit4] 2> 1476639 T3900 oashl.XMLLoader.init xsltCacheLifetimeSeconds=60
[junit4] 2> 1476640 T3900 oashl.XMLLoader.init xsltCacheLifetimeSeconds=60
[junit4] 2> 1476641 T3900 oashl.XMLLoader.init xsltCacheLifetimeSeconds=60
[junit4] 2> 1476642 T3900 oashl.XMLLoader.init xsltCacheLifetimeSeconds=60
[junit4] 2> 1476644 T3900 oasc.SolrCore.initDeprecatedSupport WARN solrconfig.xml uses deprecated <admin/gettableFiles>, Please update your config to use the ShowFileRequestHandler.
[junit4] 2> 1476645 T3900 oasu.CommitTracker.<init> Hard AutoCommit: disabled
[junit4] 2> 1476646 T3900 oasu.CommitTracker.<init> Soft AutoCommit: disabled
[junit4] 2> 1476646 T3900 oasu.RandomMergePolicy.<init> RandomMergePolicy wrapping class org.apache.lucene.index.LogDocMergePolicy: [LogDocMergePolicy: minMergeSize=1000, mergeFactor=22, maxMergeSize=9223372036854775807, maxMergeSizeForForcedMerge=9223372036854775807, calibrateSizeByDeletes=true, maxMergeDocs=2147483647, maxCFSSegmentSizeMB=8.796093022207999E12, noCFSRatio=0.0]
[junit4] 2> 1476647 T3900 oasc.SolrDeletionPolicy.onInit SolrDeletionPolicy.onInit: commits: num=1
[junit4] 2> commit{dir=RateLimitedDirectoryWrapper(MockDirectoryWrapper(RAMDirectory(id=lucene-28f0a213))),segFN=segments_1,generation=1}
[junit4] 2> 1476647 T3900 oasc.SolrDeletionPolicy.updateCommits newest commit generation = 1
[junit4] 2> 1476647 T3900 oass.SolrIndexSearcher.<init> Opening Searcher@1d96d37b[collection1] main
[junit4] 2> 1476647 T3900 oasr.RestManager.init Initializing RestManager with initArgs: {storageIO=org.apache.solr.rest.ManagedResourceStorage$InMemoryStorageIO}
[junit4] 2> 1476648 T3900 oasr.ManagedResourceStorage.load Reading _rest_managed.json using InMemoryStorage
[junit4] 2> 1476648 T3900 oasr.ManagedResource.reloadFromStorage WARN No stored data found for /rest/managed
[junit4] 2> 1476648 T3900 oasr.ManagedResourceStorage$JsonStorage.store Saved JSON object to path _rest_managed.json using InMemoryStorage
[junit4] 2> 1476648 T3900 oasr.RestManager.init Initializing 0 registered ManagedResources
[junit4] 2> 1476648 T3900 oashc.SpellCheckComponent.inform Initializing spell checkers
[junit4] 2> 1476661 T3900 oass.DirectSolrSpellChecker.init init: {name=direct,classname=DirectSolrSpellChecker,field=lowerfilt,minQueryLength=3}
[junit4] 2> 1476710 T3901 oasc.SolrCore.registerSearcher [collection1] Registered new searcher Searcher@1d96d37b[collection1] main{ExitableDirectoryReader(UninvertingDirectoryReader())}
[junit4] 2> 1476713 T3900 oasc.CoreContainer.registerCore registering core: collection1
[junit4] 2> 1476716 T3899 oas.SolrTestCaseJ4.initCore ####initCore end
[junit4] 2> 1476721 T3899 oas.SolrTestCaseJ4.setUp ###Starting testCallMBeanInfo
[junit4] 2> 1477634 T3899 oas.SolrTestCaseJ4.tearDown ###Ending testCallMBeanInfo
[junit4] 2> NOTE: reproduce with: ant test -Dtestcase=SolrInfoMBeanTest -Dtests.method=testCallMBeanInfo -Dtests.seed=14B5983D1FB1352B -Dtests.multiplier=2 -Dtests.slow=true -Dtests.locale=ms -Dtests.timezone=Asia/Pontianak -Dtests.file.encoding=ISO-8859-1
[junit4] FAILURE 0.93s J0 | SolrInfoMBeanTest.testCallMBeanInfo <<<
[junit4] > Throwable #1: java.lang.AssertionError
[junit4] > at __randomizedtesting.SeedInfo.seed([14B5983D1FB1352B:EBD3150174C94835]:0)
[junit4] > at org.apache.solr.SolrInfoMBeanTest.testCallMBeanInfo(SolrInfoMBeanTest.java:66)
[junit4] > at java.lang.Thread.run(Thread.java:745)
[junit4] 2> 1477643 T3899 oas.SolrTestCaseJ4.deleteCore ###deleteCore
[junit4] 2> 1477643 T3899 oasc.CoreContainer.shutdown Shutting down CoreContainer instance=1371724469
[junit4] 2> 1477643 T3899 oasc.SolrCore.close [collection1] CLOSING SolrCore org.apache.solr.core.SolrCore@5cf986bf
[junit4] 2> 1477654 T3899 oasu.DirectUpdateHandler2.close closing DirectUpdateHandler2{commits=0,autocommits=0,soft autocommits=0,optimizes=0,rollbacks=0,expungeDeletes=0,docsPending=0,adds=0,deletesById=0,deletesByQuery=0,errors=0,cumulative_adds=0,cumulative_deletesById=0,cumulative_deletesByQuery=0,cumulative_errors=0,transaction_logs_total_size=0,transaction_logs_total_number=0}
[junit4] 2> 1477654 T3899 oasu.SolrCoreState.decrefSolrCoreState Closing SolrCoreState
[junit4] 2> 1477654 T3899 oasu.DefaultSolrCoreState.closeIndexWriter SolrCoreState ref count has reached 0 - closing IndexWriter
[junit4] 2> 1477654 T3899 oasu.DefaultSolrCoreState.closeIndexWriter closing IndexWriter with IndexWriterCloser
[junit4] 2> 1477657 T3899 oasc.SolrCore.closeSearcher [collection1] Closing main searcher on request.
[junit4] 2> 1477657 T3899 oasc.CachingDirectoryFactory.close Closing MockDirectoryFactory - 2 directories currently being tracked
[junit4] 2> 1477657 T3899 oasc.CachingDirectoryFactory.closeCacheValue looking to close /usr/home/jenkins/jenkins-slave/workspace/Lucene-Solr-Tests-5.x-Java7/solr/build/solr-core/test/J0/temp/solr.SolrInfoMBeanTest-14B5983D1FB1352B-001/init-core-data-001 [CachedDir<<refCount=0;path=/usr/home/jenkins/jenkins-slave/workspace/Lucene-Solr-Tests-5.x-Java7/solr/build/solr-core/test/J0/temp/solr.SolrInfoMBeanTest-14B5983D1FB1352B-001/init-core-data-001;done=false>>]
[junit4] 2> 1477657 T3899 oasc.CachingDirectoryFactory.close Closing directory: /usr/home/jenkins/jenkins-slave/workspace/Lucene-Solr-Tests-5.x-Java7/solr/build/solr-core/test/J0/temp/solr.SolrInfoMBeanTest-14B5983D1FB1352B-001/init-core-data-001
[junit4] 2> 1477658 T3899 oasc.CachingDirectoryFactory.closeCacheValue looking to close /usr/home/jenkins/jenkins-slave/workspace/Lucene-Solr-Tests-5.x-Java7/solr/build/solr-core/test/J0/temp/solr.SolrInfoMBeanTest-14B5983D1FB1352B-001/init-core-data-001/index [CachedDir<<refCount=0;path=/usr/home/jenkins/jenkins-slave/workspace/Lucene-Solr-Tests-5.x-Java7/solr/build/solr-core/test/J0/temp/solr.SolrInfoMBeanTest-14B5983D1FB1352B-001/init-core-data-001/index;done=false>>]
[junit4] 2> 1477658 T3899 oasc.CachingDirectoryFactory.close Closing directory: /usr/home/jenkins/jenkins-slave/workspace/Lucene-Solr-Tests-5.x-Java7/solr/build/solr-core/test/J0/temp/solr.SolrInfoMBeanTest-14B5983D1FB1352B-001/init-core-data-001/index
[junit4] 2> NOTE: leaving temporary files on disk at: /usr/home/jenkins/jenkins-slave/workspace/Lucene-Solr-Tests-5.x-Java7/solr/build/solr-core/test/J0/temp/solr.SolrInfoMBeanTest-14B5983D1FB1352B-001
[junit4] 2> NOTE: test params are: codec=Asserting(Lucene50): {}, docValues:{}, sim=RandomSimilarityProvider(queryNorm=true,coord=no): {}, locale=ms, timezone=Asia/Pontianak
[junit4] 2> NOTE: FreeBSD 9.1-RELEASE-p3 amd64/Oracle Corporation 1.7.0_65 (64-bit)/cpus=16,threads=1,free=136092864,total=309329920
[junit4] 2> NOTE: All tests run in this JVM: [TestAnalyzedSuggestions, TestShardHandlerFactory, QueryParsingTest, TestSolrQueryParserDefaultOperatorResource, DeleteInactiveReplicaTest, DocumentAnalysisRequestHandlerTest, TestDocSet, HdfsSyncSliceTest, SoftAutoCommitTest, TestManagedSchemaDynamicFieldResource, PolyFieldTest, FieldMutatingUpdateProcessorTest, ChangedSchemaMergeTest, NoCacheHeaderTest, MultiTermTest, LegacyHTMLStripCharFilterTest, TestRemoteStreaming, TestSchemaVersionResource, TestFieldResource, RemoteQueryErrorTest, SuggesterTest, AliasIntegrationTest, WordBreakSolrSpellCheckerTest, TriLevelCompositeIdRoutingTest, DateMathParserTest, TestFiltering, TestPivotHelperCode, TestCloudSchemaless, TestManagedSchemaFieldTypeResource, TestManagedResourceStorage, LeaderElectionTest, DistributedSpellCheckComponentTest, ZkControllerTest, TestSolrIndexConfig, TestSearchPerf, DebugComponentTest, TestCursorMarkWithoutUniqueKey, StatsComponentTest, ShowFileRequestHandlerTest, TestReRankQParserPlugin, TestGroupingSearch, HdfsBasicDistributedZk2Test, MoreLikeThisHandlerTest, TestReplicationHandler, DistributedQueryElevationComponentTest, FileBasedSpellCheckerTest, HighlighterConfigTest, HdfsUnloadDistributedZkTest, TestCollationFieldDocValues, ShardRoutingTest, TestDistribDocBasedVersion, SolrInfoMBeanTest]
[junit4] Completed on J0 in 2.04s, 1 test, 1 failure <<< FAILURES!
[...truncated 657 lines...]
BUILD FAILED
/usr/home/jenkins/jenkins-slave/workspace/Lucene-Solr-Tests-5.x-Java7/build.xml:524: The following error occurred while executing this line:
/usr/home/jenkins/jenkins-slave/workspace/Lucene-Solr-Tests-5.x-Java7/build.xml:472: The following error occurred while executing this line:
/usr/home/jenkins/jenkins-slave/workspace/Lucene-Solr-Tests-5.x-Java7/build.xml:61: The following error occurred while executing this line:
/usr/home/jenkins/jenkins-slave/workspace/Lucene-Solr-Tests-5.x-Java7/extra-targets.xml:39: The following error occurred while executing this line:
/usr/home/jenkins/jenkins-slave/workspace/Lucene-Solr-Tests-5.x-Java7/solr/build.xml:189: The following error occurred while executing this line:
/usr/home/jenkins/jenkins-slave/workspace/Lucene-Solr-Tests-5.x-Java7/solr/common-build.xml:496: The following error occurred while executing this line:
/usr/home/jenkins/jenkins-slave/workspace/Lucene-Solr-Tests-5.x-Java7/lucene/common-build.xml:1360: The following error occurred while executing this line:
/usr/home/jenkins/jenkins-slave/workspace/Lucene-Solr-Tests-5.x-Java7/lucene/common-build.xml:962: There were test failures: 431 suites, 1778 tests, 1 failure, 59 ignored (24 assumptions)
Total time: 54 minutes 16 seconds
Build step 'Invoke Ant' marked build as failure
Archiving artifacts
Sending artifact delta relative to Lucene-Solr-Tests-5.x-Java7 #2144
Archived 5 artifacts
Archive block size is 32768
Received 0 blocks and 159187897 bytes
Compression is 0.0%
Took 27 sec
Recording test results
Email was triggered for: Failure
Sending email for trigger: Failure
[JENKINS] Lucene-Solr-Tests-5.x-Java7 - Build # 2146 - Still
Failing
Posted by Apache Jenkins Server <je...@builds.apache.org>.
Build: https://builds.apache.org/job/Lucene-Solr-Tests-5.x-Java7/2146/
1 tests failed.
FAILED: org.apache.solr.cloud.DeleteLastCustomShardedReplicaTest.testDistribSearch
Error Message:
No live SolrServers available to handle this request:[https://127.0.0.1:21713/kpo/v, https://127.0.0.1:59147/kpo/v, https://127.0.0.1:33500/kpo/v]
Stack Trace:
org.apache.solr.client.solrj.SolrServerException: No live SolrServers available to handle this request:[https://127.0.0.1:21713/kpo/v, https://127.0.0.1:59147/kpo/v, https://127.0.0.1:33500/kpo/v]
at __randomizedtesting.SeedInfo.seed([ED47B979B672F53D:6CA13761C12D9501]:0)
at org.apache.solr.client.solrj.impl.LBHttpSolrServer.request(LBHttpSolrServer.java:322)
at org.apache.solr.client.solrj.impl.CloudSolrServer.sendRequest(CloudSolrServer.java:880)
at org.apache.solr.client.solrj.impl.CloudSolrServer.requestWithRetryOnStaleState(CloudSolrServer.java:658)
at org.apache.solr.client.solrj.impl.CloudSolrServer.request(CloudSolrServer.java:601)
at org.apache.solr.cloud.DeleteLastCustomShardedReplicaTest.removeAndWaitForLastReplicaGone(DeleteLastCustomShardedReplicaTest.java:117)
at org.apache.solr.cloud.DeleteLastCustomShardedReplicaTest.doTest(DeleteLastCustomShardedReplicaTest.java:107)
at org.apache.solr.BaseDistributedSearchTestCase.testDistribSearch(BaseDistributedSearchTestCase.java:869)
at sun.reflect.NativeMethodAccessorImpl.invoke0(Native Method)
at sun.reflect.NativeMethodAccessorImpl.invoke(NativeMethodAccessorImpl.java:57)
at sun.reflect.DelegatingMethodAccessorImpl.invoke(DelegatingMethodAccessorImpl.java:43)
at java.lang.reflect.Method.invoke(Method.java:606)
at com.carrotsearch.randomizedtesting.RandomizedRunner.invoke(RandomizedRunner.java:1618)
at com.carrotsearch.randomizedtesting.RandomizedRunner$6.evaluate(RandomizedRunner.java:827)
at com.carrotsearch.randomizedtesting.RandomizedRunner$7.evaluate(RandomizedRunner.java:863)
at com.carrotsearch.randomizedtesting.RandomizedRunner$8.evaluate(RandomizedRunner.java:877)
at com.carrotsearch.randomizedtesting.rules.SystemPropertiesRestoreRule$1.evaluate(SystemPropertiesRestoreRule.java:53)
at org.apache.lucene.util.TestRuleSetupTeardownChained$1.evaluate(TestRuleSetupTeardownChained.java:50)
at org.apache.lucene.util.AbstractBeforeAfterRule$1.evaluate(AbstractBeforeAfterRule.java:46)
at com.carrotsearch.randomizedtesting.rules.SystemPropertiesInvariantRule$1.evaluate(SystemPropertiesInvariantRule.java:55)
at org.apache.lucene.util.TestRuleThreadAndTestName$1.evaluate(TestRuleThreadAndTestName.java:49)
at org.apache.lucene.util.TestRuleIgnoreAfterMaxFailures$1.evaluate(TestRuleIgnoreAfterMaxFailures.java:65)
at org.apache.lucene.util.TestRuleMarkFailure$1.evaluate(TestRuleMarkFailure.java:48)
at com.carrotsearch.randomizedtesting.rules.StatementAdapter.evaluate(StatementAdapter.java:36)
at com.carrotsearch.randomizedtesting.ThreadLeakControl$StatementRunner.run(ThreadLeakControl.java:365)
at com.carrotsearch.randomizedtesting.ThreadLeakControl.forkTimeoutingTask(ThreadLeakControl.java:798)
at com.carrotsearch.randomizedtesting.ThreadLeakControl$3.evaluate(ThreadLeakControl.java:458)
at com.carrotsearch.randomizedtesting.RandomizedRunner.runSingleTest(RandomizedRunner.java:836)
at com.carrotsearch.randomizedtesting.RandomizedRunner$3.evaluate(RandomizedRunner.java:738)
at com.carrotsearch.randomizedtesting.RandomizedRunner$4.evaluate(RandomizedRunner.java:772)
at com.carrotsearch.randomizedtesting.RandomizedRunner$5.evaluate(RandomizedRunner.java:783)
at com.carrotsearch.randomizedtesting.rules.StatementAdapter.evaluate(StatementAdapter.java:36)
at com.carrotsearch.randomizedtesting.rules.SystemPropertiesRestoreRule$1.evaluate(SystemPropertiesRestoreRule.java:53)
at org.apache.lucene.util.AbstractBeforeAfterRule$1.evaluate(AbstractBeforeAfterRule.java:46)
at org.apache.lucene.util.TestRuleStoreClassName$1.evaluate(TestRuleStoreClassName.java:42)
at com.carrotsearch.randomizedtesting.rules.SystemPropertiesInvariantRule$1.evaluate(SystemPropertiesInvariantRule.java:55)
at com.carrotsearch.randomizedtesting.rules.NoShadowingOrOverridesOnMethodsRule$1.evaluate(NoShadowingOrOverridesOnMethodsRule.java:39)
at com.carrotsearch.randomizedtesting.rules.NoShadowingOrOverridesOnMethodsRule$1.evaluate(NoShadowingOrOverridesOnMethodsRule.java:39)
at com.carrotsearch.randomizedtesting.rules.StatementAdapter.evaluate(StatementAdapter.java:36)
at com.carrotsearch.randomizedtesting.rules.StatementAdapter.evaluate(StatementAdapter.java:36)
at com.carrotsearch.randomizedtesting.rules.StatementAdapter.evaluate(StatementAdapter.java:36)
at org.apache.lucene.util.TestRuleAssertionsRequired$1.evaluate(TestRuleAssertionsRequired.java:43)
at org.apache.lucene.util.TestRuleMarkFailure$1.evaluate(TestRuleMarkFailure.java:48)
at org.apache.lucene.util.TestRuleIgnoreAfterMaxFailures$1.evaluate(TestRuleIgnoreAfterMaxFailures.java:65)
at org.apache.lucene.util.TestRuleIgnoreTestSuites$1.evaluate(TestRuleIgnoreTestSuites.java:55)
at com.carrotsearch.randomizedtesting.rules.StatementAdapter.evaluate(StatementAdapter.java:36)
at com.carrotsearch.randomizedtesting.ThreadLeakControl$StatementRunner.run(ThreadLeakControl.java:365)
at java.lang.Thread.run(Thread.java:745)
Caused by: org.apache.solr.client.solrj.impl.HttpSolrServer$RemoteSolrException: Could not remove replica : customcollreplicadeletion/a/core_node1
at org.apache.solr.client.solrj.impl.HttpSolrServer.executeMethod(HttpSolrServer.java:568)
at org.apache.solr.client.solrj.impl.HttpSolrServer.request(HttpSolrServer.java:215)
at org.apache.solr.client.solrj.impl.HttpSolrServer.request(HttpSolrServer.java:211)
at org.apache.solr.client.solrj.impl.LBHttpSolrServer.doRequest(LBHttpSolrServer.java:343)
at org.apache.solr.client.solrj.impl.LBHttpSolrServer.request(LBHttpSolrServer.java:304)
... 46 more
Build Log:
[...truncated 10731 lines...]
[junit4] Suite: org.apache.solr.cloud.DeleteLastCustomShardedReplicaTest
[junit4] 2> Creating dataDir: /usr/home/jenkins/jenkins-slave/workspace/Lucene-Solr-Tests-5.x-Java7/solr/build/solr-core/test/J2/temp/solr.cloud.DeleteLastCustomShardedReplicaTest-ED47B979B672F53D-001/init-core-data-001
[junit4] 2> 18110 T29 oas.SolrTestCaseJ4.buildSSLConfig Randomized ssl (true) and clientAuth (false)
[junit4] 2> 18111 T29 oas.BaseDistributedSearchTestCase.initHostContext Setting hostContext system property: /kpo/v
[junit4] 2> 18120 T29 oas.SolrTestCaseJ4.setUp ###Starting testDistribSearch
[junit4] 2> 18137 T29 oasc.ZkTestServer.run STARTING ZK TEST SERVER
[junit4] 1> client port:0.0.0.0/0.0.0.0:0
[junit4] 2> 18152 T30 oasc.ZkTestServer$ZKServerMain.runFromConfig Starting server
[junit4] 2> 18452 T29 oasc.ZkTestServer.run start zk server on port:21729
[junit4] 2> 18465 T29 oascc.SolrZkClient.createZkCredentialsToAddAutomatically Using default ZkCredentialsProvider
[junit4] 2> 18787 T29 oascc.ConnectionManager.waitForConnected Waiting for client to connect to ZooKeeper
[junit4] 2> 18858 T31 oazs.NIOServerCnxn.doIO WARN Exception causing close of session 0x0 due to java.io.IOException: ZooKeeperServer not running
[junit4] 2> 20946 T35 oascc.ConnectionManager.process Watcher org.apache.solr.common.cloud.ConnectionManager@55df5de1 name:ZooKeeperConnection Watcher:127.0.0.1:21729 got event WatchedEvent state:SyncConnected type:None path:null path:null type:None
[junit4] 2> 20946 T29 oascc.ConnectionManager.waitForConnected Client is connected to ZooKeeper
[junit4] 2> 20947 T29 oascc.SolrZkClient.createZkACLProvider Using default ZkACLProvider
[junit4] 2> 20960 T29 oascc.SolrZkClient.makePath makePath: /solr
[junit4] 2> 21096 T29 oascc.SolrZkClient.createZkCredentialsToAddAutomatically Using default ZkCredentialsProvider
[junit4] 2> 21097 T29 oascc.ConnectionManager.waitForConnected Waiting for client to connect to ZooKeeper
[junit4] 2> 21099 T38 oascc.ConnectionManager.process Watcher org.apache.solr.common.cloud.ConnectionManager@6b70cd6 name:ZooKeeperConnection Watcher:127.0.0.1:21729/solr got event WatchedEvent state:SyncConnected type:None path:null path:null type:None
[junit4] 2> 21099 T29 oascc.ConnectionManager.waitForConnected Client is connected to ZooKeeper
[junit4] 2> 21100 T29 oascc.SolrZkClient.createZkACLProvider Using default ZkACLProvider
[junit4] 2> 21115 T29 oascc.SolrZkClient.makePath makePath: /collections/collection1
[junit4] 2> 21119 T29 oascc.SolrZkClient.makePath makePath: /collections/collection1/shards
[junit4] 2> 21122 T29 oascc.SolrZkClient.makePath makePath: /collections/control_collection
[junit4] 2> 21125 T29 oascc.SolrZkClient.makePath makePath: /collections/control_collection/shards
[junit4] 2> 21130 T29 oasc.AbstractZkTestCase.putConfig put /usr/home/jenkins/jenkins-slave/workspace/Lucene-Solr-Tests-5.x-Java7/solr/core/src/test-files/solr/collection1/conf/solrconfig-tlog.xml to /configs/conf1/solrconfig.xml
[junit4] 2> 21166 T29 oascc.SolrZkClient.makePath makePath: /configs/conf1/solrconfig.xml
[junit4] 2> 21172 T29 oasc.AbstractZkTestCase.putConfig put /usr/home/jenkins/jenkins-slave/workspace/Lucene-Solr-Tests-5.x-Java7/solr/core/src/test-files/solr/collection1/conf/schema.xml to /configs/conf1/schema.xml
[junit4] 2> 21173 T29 oascc.SolrZkClient.makePath makePath: /configs/conf1/schema.xml
[junit4] 2> 21277 T29 oasc.AbstractZkTestCase.putConfig put /usr/home/jenkins/jenkins-slave/workspace/Lucene-Solr-Tests-5.x-Java7/solr/core/src/test-files/solr/collection1/conf/solrconfig.snippet.randomindexconfig.xml to /configs/conf1/solrconfig.snippet.randomindexconfig.xml
[junit4] 2> 21278 T29 oascc.SolrZkClient.makePath makePath: /configs/conf1/solrconfig.snippet.randomindexconfig.xml
[junit4] 2> 21282 T29 oasc.AbstractZkTestCase.putConfig put /usr/home/jenkins/jenkins-slave/workspace/Lucene-Solr-Tests-5.x-Java7/solr/core/src/test-files/solr/collection1/conf/stopwords.txt to /configs/conf1/stopwords.txt
[junit4] 2> 21283 T29 oascc.SolrZkClient.makePath makePath: /configs/conf1/stopwords.txt
[junit4] 2> 21287 T29 oasc.AbstractZkTestCase.putConfig put /usr/home/jenkins/jenkins-slave/workspace/Lucene-Solr-Tests-5.x-Java7/solr/core/src/test-files/solr/collection1/conf/protwords.txt to /configs/conf1/protwords.txt
[junit4] 2> 21287 T29 oascc.SolrZkClient.makePath makePath: /configs/conf1/protwords.txt
[junit4] 2> 21291 T29 oasc.AbstractZkTestCase.putConfig put /usr/home/jenkins/jenkins-slave/workspace/Lucene-Solr-Tests-5.x-Java7/solr/core/src/test-files/solr/collection1/conf/currency.xml to /configs/conf1/currency.xml
[junit4] 2> 21292 T29 oascc.SolrZkClient.makePath makePath: /configs/conf1/currency.xml
[junit4] 2> 21296 T29 oasc.AbstractZkTestCase.putConfig put /usr/home/jenkins/jenkins-slave/workspace/Lucene-Solr-Tests-5.x-Java7/solr/core/src/test-files/solr/collection1/conf/enumsConfig.xml to /configs/conf1/enumsConfig.xml
[junit4] 2> 21296 T29 oascc.SolrZkClient.makePath makePath: /configs/conf1/enumsConfig.xml
[junit4] 2> 21300 T29 oasc.AbstractZkTestCase.putConfig put /usr/home/jenkins/jenkins-slave/workspace/Lucene-Solr-Tests-5.x-Java7/solr/core/src/test-files/solr/collection1/conf/open-exchange-rates.json to /configs/conf1/open-exchange-rates.json
[junit4] 2> 21301 T29 oascc.SolrZkClient.makePath makePath: /configs/conf1/open-exchange-rates.json
[junit4] 2> 21305 T29 oasc.AbstractZkTestCase.putConfig put /usr/home/jenkins/jenkins-slave/workspace/Lucene-Solr-Tests-5.x-Java7/solr/core/src/test-files/solr/collection1/conf/mapping-ISOLatin1Accent.txt to /configs/conf1/mapping-ISOLatin1Accent.txt
[junit4] 2> 21305 T29 oascc.SolrZkClient.makePath makePath: /configs/conf1/mapping-ISOLatin1Accent.txt
[junit4] 2> 21309 T29 oasc.AbstractZkTestCase.putConfig put /usr/home/jenkins/jenkins-slave/workspace/Lucene-Solr-Tests-5.x-Java7/solr/core/src/test-files/solr/collection1/conf/old_synonyms.txt to /configs/conf1/old_synonyms.txt
[junit4] 2> 21310 T29 oascc.SolrZkClient.makePath makePath: /configs/conf1/old_synonyms.txt
[junit4] 2> 21314 T29 oasc.AbstractZkTestCase.putConfig put /usr/home/jenkins/jenkins-slave/workspace/Lucene-Solr-Tests-5.x-Java7/solr/core/src/test-files/solr/collection1/conf/synonyms.txt to /configs/conf1/synonyms.txt
[junit4] 2> 21315 T29 oascc.SolrZkClient.makePath makePath: /configs/conf1/synonyms.txt
[junit4] 2> 21341 T29 oascc.SolrZkClient.createZkCredentialsToAddAutomatically Using default ZkCredentialsProvider
[junit4] 2> 21342 T29 oascc.ConnectionManager.waitForConnected Waiting for client to connect to ZooKeeper
[junit4] 2> 21344 T40 oascc.ConnectionManager.process Watcher org.apache.solr.common.cloud.ConnectionManager@7a115cd5 name:ZooKeeperConnection Watcher:127.0.0.1:21729/solr got event WatchedEvent state:SyncConnected type:None path:null path:null type:None
[junit4] 2> 21344 T29 oascc.ConnectionManager.waitForConnected Client is connected to ZooKeeper
[junit4] 2> 21345 T29 oascc.SolrZkClient.createZkACLProvider Using default ZkACLProvider
[junit4] 2> 23738 T29 oejs.Server.doStart jetty-8.1.10.v20130312
[junit4] 2> 24220 T29 oejus.SslContextFactory.doStart Enabled Protocols [SSLv2Hello, SSLv3, TLSv1, TLSv1.1, TLSv1.2] of [SSLv2Hello, SSLv3, TLSv1, TLSv1.1, TLSv1.2]
[junit4] 2> 24259 T29 oejs.AbstractConnector.doStart Started SslSocketConnector@127.0.0.1:59147
[junit4] 2> 24508 T29 oass.SolrDispatchFilter.init SolrDispatchFilter.init()
[junit4] 2> 24509 T29 oasc.SolrResourceLoader.locateSolrHome JNDI not configured for solr (NoInitialContextEx)
[junit4] 2> 24509 T29 oasc.SolrResourceLoader.locateSolrHome using system property solr.solr.home: /usr/home/jenkins/jenkins-slave/workspace/Lucene-Solr-Tests-5.x-Java7/solr/build/solr-core/test/J2/temp/solr.cloud.DeleteLastCustomShardedReplicaTest-ED47B979B672F53D-001/tempDir-002
[junit4] 2> 24510 T29 oasc.SolrResourceLoader.<init> new SolrResourceLoader for directory: '/usr/home/jenkins/jenkins-slave/workspace/Lucene-Solr-Tests-5.x-Java7/solr/build/solr-core/test/J2/temp/solr.cloud.DeleteLastCustomShardedReplicaTest-ED47B979B672F53D-001/tempDir-002/'
[junit4] 2> 24575 T29 oasc.ConfigSolr.fromFile Loading container configuration from /usr/home/jenkins/jenkins-slave/workspace/Lucene-Solr-Tests-5.x-Java7/solr/build/solr-core/test/J2/temp/solr.cloud.DeleteLastCustomShardedReplicaTest-ED47B979B672F53D-001/tempDir-002/solr.xml
[junit4] 2> 24733 T29 oasc.CorePropertiesLocator.<init> Config-defined core root directory: /usr/home/jenkins/jenkins-slave/workspace/Lucene-Solr-Tests-5.x-Java7/solr/build/solr-core/test/J2/temp/solr.cloud.DeleteLastCustomShardedReplicaTest-ED47B979B672F53D-001/tempDir-002
[junit4] 2> 24734 T29 oasc.CoreContainer.<init> New CoreContainer 1831455490
[junit4] 2> 24734 T29 oasc.CoreContainer.load Loading cores into CoreContainer [instanceDir=/usr/home/jenkins/jenkins-slave/workspace/Lucene-Solr-Tests-5.x-Java7/solr/build/solr-core/test/J2/temp/solr.cloud.DeleteLastCustomShardedReplicaTest-ED47B979B672F53D-001/tempDir-002/]
[junit4] 2> 24857 T29 oashc.HttpShardHandlerFactory.getParameter Setting socketTimeout to: 90000
[junit4] 2> 24858 T29 oashc.HttpShardHandlerFactory.getParameter Setting urlScheme to:
[junit4] 2> 24858 T29 oashc.HttpShardHandlerFactory.getParameter Setting connTimeout to: 15000
[junit4] 2> 24859 T29 oashc.HttpShardHandlerFactory.getParameter Setting maxConnectionsPerHost to: 20
[junit4] 2> 24859 T29 oashc.HttpShardHandlerFactory.getParameter Setting corePoolSize to: 0
[junit4] 2> 24860 T29 oashc.HttpShardHandlerFactory.getParameter Setting maximumPoolSize to: 2147483647
[junit4] 2> 24860 T29 oashc.HttpShardHandlerFactory.getParameter Setting maxThreadIdleTime to: 5
[junit4] 2> 24861 T29 oashc.HttpShardHandlerFactory.getParameter Setting sizeOfQueue to: -1
[junit4] 2> 24861 T29 oashc.HttpShardHandlerFactory.getParameter Setting fairnessPolicy to: false
[junit4] 2> 24865 T29 oasu.UpdateShardHandler.<init> Creating UpdateShardHandler HTTP client with params: socketTimeout=340000&connTimeout=45000&retry=false
[junit4] 2> 24868 T29 oasl.LogWatcher.createWatcher SLF4J impl is org.slf4j.impl.Log4jLoggerFactory
[junit4] 2> 24868 T29 oasl.LogWatcher.newRegisteredLogWatcher Registering Log Listener [Log4j (org.slf4j.impl.Log4jLoggerFactory)]
[junit4] 2> 24869 T29 oasc.CoreContainer.load Host Name: 127.0.0.1
[junit4] 2> 24869 T29 oasc.ZkContainer.initZooKeeper Zookeeper client=127.0.0.1:21729/solr
[junit4] 2> 24918 T29 oasc.ZkController.checkChrootPath zkHost includes chroot
[junit4] 2> 24919 T29 oascc.SolrZkClient.createZkCredentialsToAddAutomatically Using default ZkCredentialsProvider
[junit4] 2> 24920 T29 oascc.ConnectionManager.waitForConnected Waiting for client to connect to ZooKeeper
[junit4] 2> 24923 T52 oascc.ConnectionManager.process Watcher org.apache.solr.common.cloud.ConnectionManager@1bc39f0f name:ZooKeeperConnection Watcher:127.0.0.1:21729 got event WatchedEvent state:SyncConnected type:None path:null path:null type:None
[junit4] 2> 24923 T29 oascc.ConnectionManager.waitForConnected Client is connected to ZooKeeper
[junit4] 2> 24924 T29 oascc.SolrZkClient.createZkACLProvider Using default ZkACLProvider
[junit4] 2> 24945 T29 oascc.ConnectionManager.waitForConnected Waiting for client to connect to ZooKeeper
[junit4] 2> 24946 T54 oascc.ConnectionManager.process Watcher org.apache.solr.common.cloud.ConnectionManager@55e6703 name:ZooKeeperConnection Watcher:127.0.0.1:21729/solr got event WatchedEvent state:SyncConnected type:None path:null path:null type:None
[junit4] 2> 24947 T29 oascc.ConnectionManager.waitForConnected Client is connected to ZooKeeper
[junit4] 2> 24969 T29 oascc.SolrZkClient.makePath makePath: /overseer/queue
[junit4] 2> 24992 T29 oascc.SolrZkClient.makePath makePath: /overseer/collection-queue-work
[junit4] 2> 25003 T29 oascc.SolrZkClient.makePath makePath: /overseer/collection-map-running
[junit4] 2> 25008 T29 oascc.SolrZkClient.makePath makePath: /overseer/collection-map-completed
[junit4] 2> 25013 T29 oascc.SolrZkClient.makePath makePath: /overseer/collection-map-failure
[junit4] 2> 25077 T29 oascc.SolrZkClient.makePath makePath: /live_nodes
[junit4] 2> 25080 T29 oasc.ZkController.createEphemeralLiveNode Register node as live in ZooKeeper:/live_nodes/127.0.0.1:59147_kpo%2Fv
[junit4] 2> 25092 T29 oascc.SolrZkClient.makePath makePath: /live_nodes/127.0.0.1:59147_kpo%2Fv
[junit4] 2> 25097 T29 oascc.SolrZkClient.makePath makePath: /overseer_elect
[junit4] 2> 25101 T29 oascc.SolrZkClient.makePath makePath: /overseer_elect/election
[junit4] 2> 25105 T29 oasc.Overseer.close Overseer (id=null) closing
[junit4] 2> 25136 T29 oasc.OverseerElectionContext.runLeaderProcess I am going to be the leader 127.0.0.1:59147_kpo%2Fv
[junit4] 2> 25136 T29 oascc.SolrZkClient.makePath makePath: /overseer_elect/leader
[junit4] 2> 25140 T29 oasc.Overseer.start Overseer (id=92549821772791812-127.0.0.1:59147_kpo%2Fv-n_0000000000) starting
[junit4] 2> 25179 T29 oascc.SolrZkClient.makePath makePath: /overseer/queue-work
[junit4] 2> 25227 T29 oasc.OverseerAutoReplicaFailoverThread.<init> Starting OverseerAutoReplicaFailoverThread autoReplicaFailoverWorkLoopDelay=10000 autoReplicaFailoverWaitAfterExpiration=10000 autoReplicaFailoverBadNodeExpiration=60000
[junit4] 2> 25892 T56 oasc.OverseerCollectionProcessor.run Process current queue of collection creations
[junit4] 2> 25893 T29 oascc.SolrZkClient.makePath makePath: /clusterstate.json
[junit4] 2> 25897 T29 oascc.SolrZkClient.makePath makePath: /aliases.json
[junit4] 2> 25899 T29 oascc.ZkStateReader.createClusterStateWatchersAndUpdate Updating cluster state from ZooKeeper...
[junit4] 2> 25943 T55 oasc.Overseer$ClusterStateUpdater.run Starting to work on the main queue
[junit4] 2> 25953 T29 oasc.CorePropertiesLocator.discover Looking for core definitions underneath /usr/home/jenkins/jenkins-slave/workspace/Lucene-Solr-Tests-5.x-Java7/solr/build/solr-core/test/J2/temp/solr.cloud.DeleteLastCustomShardedReplicaTest-ED47B979B672F53D-001/tempDir-002
[junit4] 2> 27062 T29 oasc.CorePropertiesLocator.discoverUnder Found core conf in /usr/home/jenkins/jenkins-slave/workspace/Lucene-Solr-Tests-5.x-Java7/solr/build/solr-core/test/J2/temp/solr.cloud.DeleteLastCustomShardedReplicaTest-ED47B979B672F53D-001/tempDir-002/conf/
[junit4] 2> 27283 T29 oasc.CorePropertiesLocator.discover Found 1 core definitions
[junit4] 2> 27286 T29 oass.SolrDispatchFilter.init user.dir=/usr/home/jenkins/jenkins-slave/workspace/Lucene-Solr-Tests-5.x-Java7/solr/build/solr-core/test/J2
[junit4] 2> 27286 T29 oass.SolrDispatchFilter.init SolrDispatchFilter.init() done
[junit4] 2> 27377 T29 oascc.SolrZkClient.createZkCredentialsToAddAutomatically Using default ZkCredentialsProvider
[junit4] 2> 27378 T29 oascc.ConnectionManager.waitForConnected Waiting for client to connect to ZooKeeper
[junit4] 2> 27381 T60 oascc.ConnectionManager.process Watcher org.apache.solr.common.cloud.ConnectionManager@5ef9ca83 name:ZooKeeperConnection Watcher:127.0.0.1:21729/solr got event WatchedEvent state:SyncConnected type:None path:null path:null type:None
[junit4] 2> 27381 T29 oascc.ConnectionManager.waitForConnected Client is connected to ZooKeeper
[junit4] 2> 27382 T29 oascc.SolrZkClient.createZkACLProvider Using default ZkACLProvider
[junit4] 2> 27384 T29 oascc.ZkStateReader.createClusterStateWatchersAndUpdate Updating cluster state from ZooKeeper...
[junit4] 2> 27393 T29 oasc.ChaosMonkey.monkeyLog monkey: init - expire sessions:false cause connection loss:false
[junit4] 2> 27394 T29 oasc.AbstractFullDistribZkTestBase.createJettys Creating collection1 with stateFormat=2
[junit4] 2> 27395 T29 oascc.SolrZkClient.createZkCredentialsToAddAutomatically Using default ZkCredentialsProvider
[junit4] 2> 27396 T29 oascc.ConnectionManager.waitForConnected Waiting for client to connect to ZooKeeper
[junit4] 2> 27398 T62 oascc.ConnectionManager.process Watcher org.apache.solr.common.cloud.ConnectionManager@323662bd name:ZooKeeperConnection Watcher:127.0.0.1:21729/solr got event WatchedEvent state:SyncConnected type:None path:null path:null type:None
[junit4] 2> 27398 T29 oascc.ConnectionManager.waitForConnected Client is connected to ZooKeeper
[junit4] 2> 27399 T29 oascc.SolrZkClient.createZkACLProvider Using default ZkACLProvider
[junit4] 2> 27437 T63 oasc.DistributedQueue$LatchChildWatcher.process LatchChildWatcher fired on path: /overseer/queue state: SyncConnected type NodeChildrenChanged
[junit4] 2> 27473 T55 oasc.Overseer$ClusterStateUpdater.buildCollection building a new collection: collection1
[junit4] 2> 27473 T55 oasc.Overseer$ClusterStateUpdater.createCollection Create collection collection1 with shards [shard1, shard2]
[junit4] 2> 27529 T55 oasc.Overseer$ClusterStateUpdater.createCollection state version collection1 2
[junit4] 2> 27547 T55 oasc.Overseer$ClusterStateUpdater.updateZkStates going to create_collection /collections/collection1/state.json
[junit4] 2> 27579 T64 oascc.ZkStateReader$2.process A cluster state change: WatchedEvent state:SyncConnected type:NodeDataChanged path:/clusterstate.json, has occurred - updating... (live nodes size: 1)
[junit4] 2> 27579 T63 oascc.ZkStateReader$2.process A cluster state change: WatchedEvent state:SyncConnected type:NodeDataChanged path:/clusterstate.json, has occurred - updating... (live nodes size: 1)
[junit4] 2> 29722 T29 oasc.AbstractFullDistribZkTestBase.createJettys create jetty 1
[junit4] 2> 29724 T29 oejs.Server.doStart jetty-8.1.10.v20130312
[junit4] 2> 29733 T29 oejus.SslContextFactory.doStart Enabled Protocols [SSLv2Hello, SSLv3, TLSv1, TLSv1.1, TLSv1.2] of [SSLv2Hello, SSLv3, TLSv1, TLSv1.1, TLSv1.2]
[junit4] 2> 29737 T29 oejs.AbstractConnector.doStart Started SslSocketConnector@127.0.0.1:33500
[junit4] 2> 29741 T29 oass.SolrDispatchFilter.init SolrDispatchFilter.init()
[junit4] 2> 29742 T29 oasc.SolrResourceLoader.locateSolrHome JNDI not configured for solr (NoInitialContextEx)
[junit4] 2> 29742 T29 oasc.SolrResourceLoader.locateSolrHome using system property solr.solr.home: /usr/home/jenkins/jenkins-slave/workspace/Lucene-Solr-Tests-5.x-Java7/solr/build/solr-core/test/J2/temp/solr.cloud.DeleteLastCustomShardedReplicaTest-ED47B979B672F53D-001/tempDir-003
[junit4] 2> 29743 T29 oasc.SolrResourceLoader.<init> new SolrResourceLoader for directory: '/usr/home/jenkins/jenkins-slave/workspace/Lucene-Solr-Tests-5.x-Java7/solr/build/solr-core/test/J2/temp/solr.cloud.DeleteLastCustomShardedReplicaTest-ED47B979B672F53D-001/tempDir-003/'
[junit4] 2> 29790 T29 oasc.ConfigSolr.fromFile Loading container configuration from /usr/home/jenkins/jenkins-slave/workspace/Lucene-Solr-Tests-5.x-Java7/solr/build/solr-core/test/J2/temp/solr.cloud.DeleteLastCustomShardedReplicaTest-ED47B979B672F53D-001/tempDir-003/solr.xml
[junit4] 2> 29864 T29 oasc.CorePropertiesLocator.<init> Config-defined core root directory: /usr/home/jenkins/jenkins-slave/workspace/Lucene-Solr-Tests-5.x-Java7/solr/build/solr-core/test/J2/temp/solr.cloud.DeleteLastCustomShardedReplicaTest-ED47B979B672F53D-001/tempDir-003
[junit4] 2> 29865 T29 oasc.CoreContainer.<init> New CoreContainer 238713828
[junit4] 2> 29865 T29 oasc.CoreContainer.load Loading cores into CoreContainer [instanceDir=/usr/home/jenkins/jenkins-slave/workspace/Lucene-Solr-Tests-5.x-Java7/solr/build/solr-core/test/J2/temp/solr.cloud.DeleteLastCustomShardedReplicaTest-ED47B979B672F53D-001/tempDir-003/]
[junit4] 2> 29866 T29 oashc.HttpShardHandlerFactory.getParameter Setting socketTimeout to: 90000
[junit4] 2> 29867 T29 oashc.HttpShardHandlerFactory.getParameter Setting urlScheme to:
[junit4] 2> 29867 T29 oashc.HttpShardHandlerFactory.getParameter Setting connTimeout to: 15000
[junit4] 2> 29868 T29 oashc.HttpShardHandlerFactory.getParameter Setting maxConnectionsPerHost to: 20
[junit4] 2> 29868 T29 oashc.HttpShardHandlerFactory.getParameter Setting corePoolSize to: 0
[junit4] 2> 29869 T29 oashc.HttpShardHandlerFactory.getParameter Setting maximumPoolSize to: 2147483647
[junit4] 2> 29869 T29 oashc.HttpShardHandlerFactory.getParameter Setting maxThreadIdleTime to: 5
[junit4] 2> 29870 T29 oashc.HttpShardHandlerFactory.getParameter Setting sizeOfQueue to: -1
[junit4] 2> 29870 T29 oashc.HttpShardHandlerFactory.getParameter Setting fairnessPolicy to: false
[junit4] 2> 29874 T29 oasu.UpdateShardHandler.<init> Creating UpdateShardHandler HTTP client with params: socketTimeout=340000&connTimeout=45000&retry=false
[junit4] 2> 29876 T29 oasl.LogWatcher.createWatcher SLF4J impl is org.slf4j.impl.Log4jLoggerFactory
[junit4] 2> 29877 T29 oasl.LogWatcher.newRegisteredLogWatcher Registering Log Listener [Log4j (org.slf4j.impl.Log4jLoggerFactory)]
[junit4] 2> 29877 T29 oasc.CoreContainer.load Host Name: 127.0.0.1
[junit4] 2> 29878 T29 oasc.ZkContainer.initZooKeeper Zookeeper client=127.0.0.1:21729/solr
[junit4] 2> 29878 T29 oasc.ZkController.checkChrootPath zkHost includes chroot
[junit4] 2> 29879 T29 oascc.SolrZkClient.createZkCredentialsToAddAutomatically Using default ZkCredentialsProvider
[junit4] 2> 29880 T29 oascc.ConnectionManager.waitForConnected Waiting for client to connect to ZooKeeper
[junit4] 2> 29882 T75 oascc.ConnectionManager.process Watcher org.apache.solr.common.cloud.ConnectionManager@567b7e62 name:ZooKeeperConnection Watcher:127.0.0.1:21729 got event WatchedEvent state:SyncConnected type:None path:null path:null type:None
[junit4] 2> 29882 T29 oascc.ConnectionManager.waitForConnected Client is connected to ZooKeeper
[junit4] 2> 29883 T29 oascc.SolrZkClient.createZkACLProvider Using default ZkACLProvider
[junit4] 2> 29885 T29 oascc.ConnectionManager.waitForConnected Waiting for client to connect to ZooKeeper
[junit4] 2> 29887 T77 oascc.ConnectionManager.process Watcher org.apache.solr.common.cloud.ConnectionManager@51038c1a name:ZooKeeperConnection Watcher:127.0.0.1:21729/solr got event WatchedEvent state:SyncConnected type:None path:null path:null type:None
[junit4] 2> 29887 T29 oascc.ConnectionManager.waitForConnected Client is connected to ZooKeeper
[junit4] 2> 29896 T29 oascc.ZkStateReader.createClusterStateWatchersAndUpdate Updating cluster state from ZooKeeper...
[junit4] 2> 30905 T29 oasc.ZkController.createEphemeralLiveNode Register node as live in ZooKeeper:/live_nodes/127.0.0.1:33500_kpo%2Fv
[junit4] 2> 30907 T29 oascc.SolrZkClient.makePath makePath: /live_nodes/127.0.0.1:33500_kpo%2Fv
[junit4] 2> 30913 T29 oasc.Overseer.close Overseer (id=null) closing
[junit4] 2> 30926 T29 oasc.CorePropertiesLocator.discover Looking for core definitions underneath /usr/home/jenkins/jenkins-slave/workspace/Lucene-Solr-Tests-5.x-Java7/solr/build/solr-core/test/J2/temp/solr.cloud.DeleteLastCustomShardedReplicaTest-ED47B979B672F53D-001/tempDir-003
[junit4] 2> 32053 T29 oasc.CorePropertiesLocator.discoverUnder Found core conf in /usr/home/jenkins/jenkins-slave/workspace/Lucene-Solr-Tests-5.x-Java7/solr/build/solr-core/test/J2/temp/solr.cloud.DeleteLastCustomShardedReplicaTest-ED47B979B672F53D-001/tempDir-003/conf/
[junit4] 2> 32238 T29 oasc.CorePropertiesLocator.discover Found 1 core definitions
[junit4] 2> 32240 T29 oass.SolrDispatchFilter.init user.dir=/usr/home/jenkins/jenkins-slave/workspace/Lucene-Solr-Tests-5.x-Java7/solr/build/solr-core/test/J2
[junit4] 2> 32240 T29 oass.SolrDispatchFilter.init SolrDispatchFilter.init() done
[junit4] 2> 33587 T29 oasc.AbstractFullDistribZkTestBase.createJettys create jetty 2
[junit4] 2> 33588 T29 oejs.Server.doStart jetty-8.1.10.v20130312
[junit4] 2> 33597 T29 oejus.SslContextFactory.doStart Enabled Protocols [SSLv2Hello, SSLv3, TLSv1, TLSv1.1, TLSv1.2] of [SSLv2Hello, SSLv3, TLSv1, TLSv1.1, TLSv1.2]
[junit4] 2> 33602 T29 oejs.AbstractConnector.doStart Started SslSocketConnector@127.0.0.1:21713
[junit4] 2> 33605 T29 oass.SolrDispatchFilter.init SolrDispatchFilter.init()
[junit4] 2> 33606 T29 oasc.SolrResourceLoader.locateSolrHome JNDI not configured for solr (NoInitialContextEx)
[junit4] 2> 33606 T29 oasc.SolrResourceLoader.locateSolrHome using system property solr.solr.home: /usr/home/jenkins/jenkins-slave/workspace/Lucene-Solr-Tests-5.x-Java7/solr/build/solr-core/test/J2/temp/solr.cloud.DeleteLastCustomShardedReplicaTest-ED47B979B672F53D-001/tempDir-004
[junit4] 2> 33607 T29 oasc.SolrResourceLoader.<init> new SolrResourceLoader for directory: '/usr/home/jenkins/jenkins-slave/workspace/Lucene-Solr-Tests-5.x-Java7/solr/build/solr-core/test/J2/temp/solr.cloud.DeleteLastCustomShardedReplicaTest-ED47B979B672F53D-001/tempDir-004/'
[junit4] 2> 33658 T29 oasc.ConfigSolr.fromFile Loading container configuration from /usr/home/jenkins/jenkins-slave/workspace/Lucene-Solr-Tests-5.x-Java7/solr/build/solr-core/test/J2/temp/solr.cloud.DeleteLastCustomShardedReplicaTest-ED47B979B672F53D-001/tempDir-004/solr.xml
[junit4] 2> 33723 T29 oasc.CorePropertiesLocator.<init> Config-defined core root directory: /usr/home/jenkins/jenkins-slave/workspace/Lucene-Solr-Tests-5.x-Java7/solr/build/solr-core/test/J2/temp/solr.cloud.DeleteLastCustomShardedReplicaTest-ED47B979B672F53D-001/tempDir-004
[junit4] 2> 33724 T29 oasc.CoreContainer.<init> New CoreContainer 214433150
[junit4] 2> 33724 T29 oasc.CoreContainer.load Loading cores into CoreContainer [instanceDir=/usr/home/jenkins/jenkins-slave/workspace/Lucene-Solr-Tests-5.x-Java7/solr/build/solr-core/test/J2/temp/solr.cloud.DeleteLastCustomShardedReplicaTest-ED47B979B672F53D-001/tempDir-004/]
[junit4] 2> 33726 T29 oashc.HttpShardHandlerFactory.getParameter Setting socketTimeout to: 90000
[junit4] 2> 33726 T29 oashc.HttpShardHandlerFactory.getParameter Setting urlScheme to:
[junit4] 2> 33727 T29 oashc.HttpShardHandlerFactory.getParameter Setting connTimeout to: 15000
[junit4] 2> 33727 T29 oashc.HttpShardHandlerFactory.getParameter Setting maxConnectionsPerHost to: 20
[junit4] 2> 33728 T29 oashc.HttpShardHandlerFactory.getParameter Setting corePoolSize to: 0
[junit4] 2> 33728 T29 oashc.HttpShardHandlerFactory.getParameter Setting maximumPoolSize to: 2147483647
[junit4] 2> 33728 T29 oashc.HttpShardHandlerFactory.getParameter Setting maxThreadIdleTime to: 5
[junit4] 2> 33729 T29 oashc.HttpShardHandlerFactory.getParameter Setting sizeOfQueue to: -1
[junit4] 2> 33729 T29 oashc.HttpShardHandlerFactory.getParameter Setting fairnessPolicy to: false
[junit4] 2> 33733 T29 oasu.UpdateShardHandler.<init> Creating UpdateShardHandler HTTP client with params: socketTimeout=340000&connTimeout=45000&retry=false
[junit4] 2> 33736 T29 oasl.LogWatcher.createWatcher SLF4J impl is org.slf4j.impl.Log4jLoggerFactory
[junit4] 2> 33736 T29 oasl.LogWatcher.newRegisteredLogWatcher Registering Log Listener [Log4j (org.slf4j.impl.Log4jLoggerFactory)]
[junit4] 2> 33737 T29 oasc.CoreContainer.load Host Name: 127.0.0.1
[junit4] 2> 33737 T29 oasc.ZkContainer.initZooKeeper Zookeeper client=127.0.0.1:21729/solr
[junit4] 2> 33738 T29 oasc.ZkController.checkChrootPath zkHost includes chroot
[junit4] 2> 33738 T29 oascc.SolrZkClient.createZkCredentialsToAddAutomatically Using default ZkCredentialsProvider
[junit4] 2> 33739 T29 oascc.ConnectionManager.waitForConnected Waiting for client to connect to ZooKeeper
[junit4] 2> 33742 T90 oascc.ConnectionManager.process Watcher org.apache.solr.common.cloud.ConnectionManager@77b10188 name:ZooKeeperConnection Watcher:127.0.0.1:21729 got event WatchedEvent state:SyncConnected type:None path:null path:null type:None
[junit4] 2> 33743 T29 oascc.ConnectionManager.waitForConnected Client is connected to ZooKeeper
[junit4] 2> 33743 T29 oascc.SolrZkClient.createZkACLProvider Using default ZkACLProvider
[junit4] 2> 33746 T29 oascc.ConnectionManager.waitForConnected Waiting for client to connect to ZooKeeper
[junit4] 2> 33748 T92 oascc.ConnectionManager.process Watcher org.apache.solr.common.cloud.ConnectionManager@462cd2d6 name:ZooKeeperConnection Watcher:127.0.0.1:21729/solr got event WatchedEvent state:SyncConnected type:None path:null path:null type:None
[junit4] 2> 33748 T29 oascc.ConnectionManager.waitForConnected Client is connected to ZooKeeper
[junit4] 2> 33759 T29 oascc.ZkStateReader.createClusterStateWatchersAndUpdate Updating cluster state from ZooKeeper...
[junit4] 2> 34768 T29 oasc.ZkController.createEphemeralLiveNode Register node as live in ZooKeeper:/live_nodes/127.0.0.1:21713_kpo%2Fv
[junit4] 2> 34770 T29 oascc.SolrZkClient.makePath makePath: /live_nodes/127.0.0.1:21713_kpo%2Fv
[junit4] 2> 34776 T29 oasc.Overseer.close Overseer (id=null) closing
[junit4] 2> 34782 T29 oasc.CorePropertiesLocator.discover Looking for core definitions underneath /usr/home/jenkins/jenkins-slave/workspace/Lucene-Solr-Tests-5.x-Java7/solr/build/solr-core/test/J2/temp/solr.cloud.DeleteLastCustomShardedReplicaTest-ED47B979B672F53D-001/tempDir-004
[junit4] 2> 34905 T29 oasc.CorePropertiesLocator.discoverUnder Found core conf in /usr/home/jenkins/jenkins-slave/workspace/Lucene-Solr-Tests-5.x-Java7/solr/build/solr-core/test/J2/temp/solr.cloud.DeleteLastCustomShardedReplicaTest-ED47B979B672F53D-001/tempDir-004/conf/
[junit4] 2> 35507 T29 oasc.CorePropertiesLocator.discover Found 1 core definitions
[junit4] 2> 35509 T29 oass.SolrDispatchFilter.init user.dir=/usr/home/jenkins/jenkins-slave/workspace/Lucene-Solr-Tests-5.x-Java7/solr/build/solr-core/test/J2
[junit4] 2> 35510 T29 oass.SolrDispatchFilter.init SolrDispatchFilter.init() done
[junit4] 2> 35517 T29 oasc.AbstractFullDistribZkTestBase.createCollection Creating collection with stateFormat=2: customcollreplicadeletion
[junit4] 2> 35524 T29 oascc.SolrZkClient.createZkCredentialsToAddAutomatically Using default ZkCredentialsProvider
[junit4] 2> 35525 T29 oascc.ConnectionManager.waitForConnected Waiting for client to connect to ZooKeeper
[junit4] 2> 35528 T96 oascc.ConnectionManager.process Watcher org.apache.solr.common.cloud.ConnectionManager@1ad576e5 name:ZooKeeperConnection Watcher:127.0.0.1:21729/solr got event WatchedEvent state:SyncConnected type:None path:null path:null type:None
[junit4] 2> 35528 T29 oascc.ConnectionManager.waitForConnected Client is connected to ZooKeeper
[junit4] 2> 35529 T29 oascc.SolrZkClient.createZkACLProvider Using default ZkACLProvider
[junit4] 2> 35531 T29 oascc.ZkStateReader.createClusterStateWatchersAndUpdate Updating cluster state from ZooKeeper...
[junit4] 2> 37996 T82 oasha.CollectionsHandler.handleCreateAction Creating Collection : version=2&shards=a,b&replicationFactor=1&numShards=1&stateFormat=2&router.name=implicit&action=CREATE&name=customcollreplicadeletion&maxShardsPerNode=5&wt=javabin
[junit4] 2> 38000 T63 oasc.DistributedQueue$LatchChildWatcher.process LatchChildWatcher fired on path: /overseer/collection-queue-work state: SyncConnected type NodeChildrenChanged
[junit4] 2> 38003 T56 oasc.OverseerCollectionProcessor.run Overseer Collection Processor: Get the message id:/overseer/collection-queue-work/qn-0000000000 message:{
[junit4] 2> "operation":"create",
[junit4] 2> "fromApi":"true",
[junit4] 2> "name":"customcollreplicadeletion",
[junit4] 2> "replicationFactor":"1",
[junit4] 2> "numShards":"1",
[junit4] 2> "maxShardsPerNode":"5",
[junit4] 2> "shards":"a,b",
[junit4] 2> "stateFormat":"2",
[junit4] 2> "router.name":"implicit"}
[junit4] 2> 38017 T98 oasc.OverseerCollectionProcessor.processMessage WARN OverseerCollectionProcessor.processMessage : create , {
[junit4] 2> "operation":"create",
[junit4] 2> "fromApi":"true",
[junit4] 2> "name":"customcollreplicadeletion",
[junit4] 2> "replicationFactor":"1",
[junit4] 2> "numShards":"1",
[junit4] 2> "maxShardsPerNode":"5",
[junit4] 2> "shards":"a,b",
[junit4] 2> "stateFormat":"2",
[junit4] 2> "router.name":"implicit"}
[junit4] 2> 38028 T98 oasc.OverseerCollectionProcessor.createConfNode Only one config set found in zk - using it:conf1
[junit4] 2> 38029 T98 oasc.OverseerCollectionProcessor.createConfNode creating collections conf node /collections/customcollreplicadeletion
[junit4] 2> 38031 T98 oascc.SolrZkClient.makePath makePath: /collections/customcollreplicadeletion
[junit4] 2> 38037 T63 oasc.DistributedQueue$LatchChildWatcher.process LatchChildWatcher fired on path: /overseer/queue state: SyncConnected type NodeChildrenChanged
[junit4] 2> 38044 T55 oasc.Overseer$ClusterStateUpdater.buildCollection building a new collection: customcollreplicadeletion
[junit4] 2> 38045 T55 oasc.Overseer$ClusterStateUpdater.createCollection Create collection customcollreplicadeletion with shards [a, b]
[junit4] 2> 38045 T55 oasc.Overseer$ClusterStateUpdater.createCollection state version customcollreplicadeletion 2
[junit4] 2> 38050 T55 oasc.Overseer$ClusterStateUpdater.updateZkStates going to create_collection /collections/customcollreplicadeletion/state.json
[junit4] 2> 38053 T63 oascc.ZkStateReader$2.process A cluster state change: WatchedEvent state:SyncConnected type:NodeDataChanged path:/clusterstate.json, has occurred - updating... (live nodes size: 3)
[junit4] 2> 38053 T99 oascc.ZkStateReader$2.process A cluster state change: WatchedEvent state:SyncConnected type:NodeDataChanged path:/clusterstate.json, has occurred - updating... (live nodes size: 3)
[junit4] 2> 38053 T64 oascc.ZkStateReader$2.process A cluster state change: WatchedEvent state:SyncConnected type:NodeDataChanged path:/clusterstate.json, has occurred - updating... (live nodes size: 3)
[junit4] 2> 38053 T93 oascc.ZkStateReader$2.process A cluster state change: WatchedEvent state:SyncConnected type:NodeDataChanged path:/clusterstate.json, has occurred - updating... (live nodes size: 3)
[junit4] 2> 38053 T78 oascc.ZkStateReader$2.process A cluster state change: WatchedEvent state:SyncConnected type:NodeDataChanged path:/clusterstate.json, has occurred - updating... (live nodes size: 3)
[junit4] 2> 38138 T98 oasc.OverseerCollectionProcessor.createCollection Creating SolrCores for new collection customcollreplicadeletion, shardNames [a, b] , replicationFactor : 1
[junit4] 2> 38139 T98 oasc.OverseerCollectionProcessor.createCollection Creating shard customcollreplicadeletion_a_replica1 as part of slice a of collection customcollreplicadeletion on 127.0.0.1:59147_kpo%2Fv
[junit4] 2> 38167 T98 oasc.OverseerCollectionProcessor.createCollection Creating shard customcollreplicadeletion_b_replica1 as part of slice b of collection customcollreplicadeletion on 127.0.0.1:21713_kpo%2Fv
[junit4] 2> 38398 T44 oasha.CoreAdminHandler.handleCreateAction core create command qt=/admin/cores&version=2&numShards=2&action=CREATE&collection=customcollreplicadeletion&name=customcollreplicadeletion_a_replica1&collection.configName=conf1&shard=a&wt=javabin
[junit4] 2> 38398 T83 oasha.CoreAdminHandler.handleCreateAction core create command qt=/admin/cores&version=2&numShards=2&action=CREATE&collection=customcollreplicadeletion&name=customcollreplicadeletion_b_replica1&collection.configName=conf1&shard=b&wt=javabin
[junit4] 2> 38416 T44 oasc.ZkController.publish publishing core=customcollreplicadeletion_a_replica1 state=down collection=customcollreplicadeletion
[junit4] 2> 38417 T83 oasc.ZkController.publish publishing core=customcollreplicadeletion_b_replica1 state=down collection=customcollreplicadeletion
[junit4] 2> 38429 T63 oasc.DistributedQueue$LatchChildWatcher.process LatchChildWatcher fired on path: /overseer/queue state: SyncConnected type NodeChildrenChanged
[junit4] 2> 38430 T44 oasc.ZkController.preRegister Registering watch for external collection customcollreplicadeletion
[junit4] 2> 38431 T83 oasc.ZkController.preRegister Registering watch for external collection customcollreplicadeletion
[junit4] 2> 38432 T83 oascc.ZkStateReader.addZkWatch addZkWatch customcollreplicadeletion
[junit4] 2> 38433 T83 oascc.ZkStateReader.addZkWatch Updating collection state at /collections/customcollreplicadeletion/state.json from ZooKeeper...
[junit4] 2> 38444 T55 oasc.Overseer$ClusterStateUpdater.updateState Update state numShards=2 message={
[junit4] 2> "roles":null,
[junit4] 2> "core":"customcollreplicadeletion_a_replica1",
[junit4] 2> "base_url":"https://127.0.0.1:59147/kpo/v",
[junit4] 2> "numShards":"2",
[junit4] 2> "node_name":"127.0.0.1:59147_kpo%2Fv",
[junit4] 2> "operation":"state",
[junit4] 2> "collection":"customcollreplicadeletion",
[junit4] 2> "shard":"a",
[junit4] 2> "state":"down"}
[junit4] 2> 38446 T83 oascc.ZkStateReader.updateWatchedCollection Updating data for customcollreplicadeletion to ver 0
[junit4] 2> 38447 T83 oasc.ZkController.waitForCoreNodeName look for our core node name
[junit4] 2> 38469 T55 oasc.Overseer$ClusterStateUpdater.updateZkStates going to update_collection /collections/customcollreplicadeletion/state.json
[junit4] 2> 38471 T93 oascc.ZkStateReader$7.process A cluster state change: WatchedEvent state:SyncConnected type:NodeDataChanged path:/collections/customcollreplicadeletion/state.json, has occurred - updating...
[junit4] 2> 38473 T93 oascc.ZkStateReader.updateWatchedCollection Updating data for customcollreplicadeletion to ver 1
[junit4] 2> 38474 T44 oascc.ZkStateReader.addZkWatch addZkWatch customcollreplicadeletion
[junit4] 2> 38475 T44 oascc.ZkStateReader.addZkWatch Updating collection state at /collections/customcollreplicadeletion/state.json from ZooKeeper...
[junit4] 2> 38478 T44 oascc.ZkStateReader.updateWatchedCollection Updating data for customcollreplicadeletion to ver 1
[junit4] 2> 38479 T44 oasc.ZkController.waitForCoreNodeName look for our core node name
[junit4] 2> 38480 T44 oasc.ZkController.waitForShardId waiting to find shard id in clusterstate for customcollreplicadeletion_a_replica1
[junit4] 2> 38480 T44 oasc.ZkController.createCollectionZkNode Check for collection zkNode:customcollreplicadeletion
[junit4] 2> 38482 T44 oasc.ZkController.createCollectionZkNode Collection zkNode exists
[junit4] 2> 38482 T44 oascc.ZkStateReader.readConfigName Load collection config from:/collections/customcollreplicadeletion
[junit4] 2> 38484 T44 oascc.ZkStateReader.readConfigName path=/collections/customcollreplicadeletion configName=conf1 specified config exists in ZooKeeper
[junit4] 2> 38485 T55 oascc.ZkStateReader.updateWatchedCollection Updating data for customcollreplicadeletion to ver 1
[junit4] 2> 38485 T44 oasc.SolrResourceLoader.<init> new SolrResourceLoader for directory: '/usr/home/jenkins/jenkins-slave/workspace/Lucene-Solr-Tests-5.x-Java7/solr/build/solr-core/test/J2/temp/solr.cloud.DeleteLastCustomShardedReplicaTest-ED47B979B672F53D-001/tempDir-002/customcollreplicadeletion_a_replica1/'
[junit4] 2> 38486 T55 oasc.Overseer$ClusterStateUpdater.updateState Update state numShards=2 message={
[junit4] 2> "roles":null,
[junit4] 2> "core":"customcollreplicadeletion_b_replica1",
[junit4] 2> "base_url":"https://127.0.0.1:21713/kpo/v",
[junit4] 2> "numShards":"2",
[junit4] 2> "node_name":"127.0.0.1:21713_kpo%2Fv",
[junit4] 2> "operation":"state",
[junit4] 2> "collection":"customcollreplicadeletion",
[junit4] 2> "shard":"b",
[junit4] 2> "state":"down"}
[junit4] 2> 38490 T63 oasc.DistributedQueue$LatchChildWatcher.process LatchChildWatcher fired on path: /overseer/queue state: SyncConnected type NodeChildrenChanged
[junit4] 2> 38492 T55 oasc.Overseer$ClusterStateUpdater.updateZkStates going to update_collection /collections/customcollreplicadeletion/state.json
[junit4] 2> 38493 T63 oascc.ZkStateReader$7.process A cluster state change: WatchedEvent state:SyncConnected type:NodeDataChanged path:/collections/customcollreplicadeletion/state.json, has occurred - updating...
[junit4] 2> 38493 T93 oascc.ZkStateReader$7.process A cluster state change: WatchedEvent state:SyncConnected type:NodeDataChanged path:/collections/customcollreplicadeletion/state.json, has occurred - updating...
[junit4] 2> 38496 T93 oascc.ZkStateReader.updateWatchedCollection Updating data for customcollreplicadeletion to ver 2
[junit4] 2> 38498 T63 oascc.ZkStateReader.updateWatchedCollection Updating data for customcollreplicadeletion to ver 2
[junit4] 2> 38667 T44 oasc.SolrConfig.<init> Using Lucene MatchVersion: 5.0.0
[junit4] 2> 38764 T44 oasc.SolrConfig.<init> Loaded SolrConfig: solrconfig.xml
[junit4] 2> 38766 T44 oass.IndexSchema.readSchema Reading Solr Schema from schema.xml
[junit4] 2> 38913 T44 oass.IndexSchema.readSchema [customcollreplicadeletion_a_replica1] Schema name=test
[junit4] 2> 39447 T83 oasc.ZkController.waitForShardId waiting to find shard id in clusterstate for customcollreplicadeletion_b_replica1
[junit4] 2> 39448 T83 oasc.ZkController.createCollectionZkNode Check for collection zkNode:customcollreplicadeletion
[junit4] 2> 39449 T83 oasc.ZkController.createCollectionZkNode Collection zkNode exists
[junit4] 2> 39450 T83 oascc.ZkStateReader.readConfigName Load collection config from:/collections/customcollreplicadeletion
[junit4] 2> 39451 T83 oascc.ZkStateReader.readConfigName path=/collections/customcollreplicadeletion configName=conf1 specified config exists in ZooKeeper
[junit4] 2> 39452 T83 oasc.SolrResourceLoader.<init> new SolrResourceLoader for directory: '/usr/home/jenkins/jenkins-slave/workspace/Lucene-Solr-Tests-5.x-Java7/solr/build/solr-core/test/J2/temp/solr.cloud.DeleteLastCustomShardedReplicaTest-ED47B979B672F53D-001/tempDir-004/customcollreplicadeletion_b_replica1/'
[junit4] 2> 39660 T83 oasc.SolrConfig.<init> Using Lucene MatchVersion: 5.0.0
[junit4] 2> 39738 T83 oasc.SolrConfig.<init> Loaded SolrConfig: solrconfig.xml
[junit4] 2> 39845 T83 oass.IndexSchema.readSchema Reading Solr Schema from schema.xml
[junit4] 2> 39992 T83 oass.IndexSchema.readSchema [customcollreplicadeletion_b_replica1] Schema name=test
[junit4] 2> 40760 T83 oass.OpenExchangeRatesOrgProvider.init Initialized with rates=open-exchange-rates.json, refreshInterval=1440.
[junit4] 2> 40760 T44 oass.OpenExchangeRatesOrgProvider.init Initialized with rates=open-exchange-rates.json, refreshInterval=1440.
[junit4] 2> 40791 T44 oass.IndexSchema.readSchema default search field in schema is text
[junit4] 2> 40791 T83 oass.IndexSchema.readSchema default search field in schema is text
[junit4] 2> 40795 T44 oass.IndexSchema.readSchema unique key field: id
[junit4] 2> 40796 T83 oass.IndexSchema.readSchema unique key field: id
[junit4] 2> 42024 T44 oass.FileExchangeRateProvider.reload Reloading exchange rates from file currency.xml
[junit4] 2> 42024 T83 oass.FileExchangeRateProvider.reload Reloading exchange rates from file currency.xml
[junit4] 2> 42068 T44 oass.FileExchangeRateProvider.reload Reloading exchange rates from file currency.xml
[junit4] 2> 42068 T83 oass.FileExchangeRateProvider.reload Reloading exchange rates from file currency.xml
[junit4] 2> 42078 T44 oass.OpenExchangeRatesOrgProvider.reload Reloading exchange rates from open-exchange-rates.json
[junit4] 2> 42080 T83 oass.OpenExchangeRatesOrgProvider.reload Reloading exchange rates from open-exchange-rates.json
[junit4] 2> 42091 T44 oass.OpenExchangeRatesOrgProvider$OpenExchangeRates.<init> WARN Unknown key IMPORTANT NOTE
[junit4] 2> 42091 T83 oass.OpenExchangeRatesOrgProvider$OpenExchangeRates.<init> WARN Unknown key IMPORTANT NOTE
[junit4] 2> 42093 T83 oass.OpenExchangeRatesOrgProvider$OpenExchangeRates.<init> WARN Expected key, got STRING
[junit4] 2> 42094 T83 oass.OpenExchangeRatesOrgProvider.reload Reloading exchange rates from open-exchange-rates.json
[junit4] 2> 42095 T44 oass.OpenExchangeRatesOrgProvider$OpenExchangeRates.<init> WARN Expected key, got STRING
[junit4] 2> 42096 T44 oass.OpenExchangeRatesOrgProvider.reload Reloading exchange rates from open-exchange-rates.json
[junit4] 2> 42096 T83 oass.OpenExchangeRatesOrgProvider$OpenExchangeRates.<init> WARN Unknown key IMPORTANT NOTE
[junit4] 2> 42098 T83 oass.OpenExchangeRatesOrgProvider$OpenExchangeRates.<init> WARN Expected key, got STRING
[junit4] 2> 42098 T44 oass.OpenExchangeRatesOrgProvider$OpenExchangeRates.<init> WARN Unknown key IMPORTANT NOTE
[junit4] 2> 42099 T83 oasc.CoreContainer.create Creating SolrCore 'customcollreplicadeletion_b_replica1' using configuration from collection customcollreplicadeletion
[junit4] 2> 42099 T44 oass.OpenExchangeRatesOrgProvider$OpenExchangeRates.<init> WARN Expected key, got STRING
[junit4] 2> 42100 T83 oasc.SolrCore.initDirectoryFactory org.apache.solr.core.MockDirectoryFactory
[junit4] 2> 42101 T44 oasc.CoreContainer.create Creating SolrCore 'customcollreplicadeletion_a_replica1' using configuration from collection customcollreplicadeletion
[junit4] 2> 42102 T83 oasc.SolrCore.<init> [customcollreplicadeletion_b_replica1] Opening new SolrCore at /usr/home/jenkins/jenkins-slave/workspace/Lucene-Solr-Tests-5.x-Java7/solr/build/solr-core/test/J2/temp/solr.cloud.DeleteLastCustomShardedReplicaTest-ED47B979B672F53D-001/tempDir-004/customcollreplicadeletion_b_replica1/, dataDir=/usr/home/jenkins/jenkins-slave/workspace/Lucene-Solr-Tests-5.x-Java7/solr/build/solr-core/test/J2/temp/solr.cloud.DeleteLastCustomShardedReplicaTest-ED47B979B672F53D-001/tempDir-004/customcollreplicadeletion_b_replica1/data/
[junit4] 2> 42102 T44 oasc.SolrCore.initDirectoryFactory org.apache.solr.core.MockDirectoryFactory
[junit4] 2> 42104 T44 oasc.SolrCore.<init> [customcollreplicadeletion_a_replica1] Opening new SolrCore at /usr/home/jenkins/jenkins-slave/workspace/Lucene-Solr-Tests-5.x-Java7/solr/build/solr-core/test/J2/temp/solr.cloud.DeleteLastCustomShardedReplicaTest-ED47B979B672F53D-001/tempDir-002/customcollreplicadeletion_a_replica1/, dataDir=/usr/home/jenkins/jenkins-slave/workspace/Lucene-Solr-Tests-5.x-Java7/solr/build/solr-core/test/J2/temp/solr.cloud.DeleteLastCustomShardedReplicaTest-ED47B979B672F53D-001/tempDir-002/customcollreplicadeletion_a_replica1/data/
[junit4] 2> 42127 T44 oasc.JmxMonitoredMap.<init> JMX monitoring is enabled. Adding Solr mbeans to JMX Server: com.sun.jmx.mbeanserver.JmxMBeanServer@490da5b9
[junit4] 2> 42127 T83 oasc.JmxMonitoredMap.<init> JMX monitoring is enabled. Adding Solr mbeans to JMX Server: com.sun.jmx.mbeanserver.JmxMBeanServer@490da5b9
[junit4] 2> 42373 T44 oasc.CachingDirectoryFactory.get return new directory for /usr/home/jenkins/jenkins-slave/workspace/Lucene-Solr-Tests-5.x-Java7/solr/build/solr-core/test/J2/temp/solr.cloud.DeleteLastCustomShardedReplicaTest-ED47B979B672F53D-001/tempDir-002/customcollreplicadeletion_a_replica1/data
[junit4] 2> 42373 T83 oasc.CachingDirectoryFactory.get return new directory for /usr/home/jenkins/jenkins-slave/workspace/Lucene-Solr-Tests-5.x-Java7/solr/build/solr-core/test/J2/temp/solr.cloud.DeleteLastCustomShardedReplicaTest-ED47B979B672F53D-001/tempDir-004/customcollreplicadeletion_b_replica1/data
[junit4] 2> 42374 T44 oasc.SolrCore.getNewIndexDir New index directory detected: old=null new=/usr/home/jenkins/jenkins-slave/workspace/Lucene-Solr-Tests-5.x-Java7/solr/build/solr-core/test/J2/temp/solr.cloud.DeleteLastCustomShardedReplicaTest-ED47B979B672F53D-001/tempDir-002/customcollreplicadeletion_a_replica1/data/index/
[junit4] 2> 42375 T83 oasc.SolrCore.getNewIndexDir New index directory detected: old=null new=/usr/home/jenkins/jenkins-slave/workspace/Lucene-Solr-Tests-5.x-Java7/solr/build/solr-core/test/J2/temp/solr.cloud.DeleteLastCustomShardedReplicaTest-ED47B979B672F53D-001/tempDir-004/customcollreplicadeletion_b_replica1/data/index/
[junit4] 2> 42375 T44 oasc.SolrCore.initIndex WARN [customcollreplicadeletion_a_replica1] Solr index directory '/usr/home/jenkins/jenkins-slave/workspace/Lucene-Solr-Tests-5.x-Java7/solr/build/solr-core/test/J2/temp/solr.cloud.DeleteLastCustomShardedReplicaTest-ED47B979B672F53D-001/tempDir-002/customcollreplicadeletion_a_replica1/data/index' doesn't exist. Creating new index...
[junit4] 2> 42376 T83 oasc.SolrCore.initIndex WARN [customcollreplicadeletion_b_replica1] Solr index directory '/usr/home/jenkins/jenkins-slave/workspace/Lucene-Solr-Tests-5.x-Java7/solr/build/solr-core/test/J2/temp/solr.cloud.DeleteLastCustomShardedReplicaTest-ED47B979B672F53D-001/tempDir-004/customcollreplicadeletion_b_replica1/data/index' doesn't exist. Creating new index...
[junit4] 2> 42377 T44 oasc.CachingDirectoryFactory.get return new directory for /usr/home/jenkins/jenkins-slave/workspace/Lucene-Solr-Tests-5.x-Java7/solr/build/solr-core/test/J2/temp/solr.cloud.DeleteLastCustomShardedReplicaTest-ED47B979B672F53D-001/tempDir-002/customcollreplicadeletion_a_replica1/data/index
[junit4] 2> 42378 T83 oasc.CachingDirectoryFactory.get return new directory for /usr/home/jenkins/jenkins-slave/workspace/Lucene-Solr-Tests-5.x-Java7/solr/build/solr-core/test/J2/temp/solr.cloud.DeleteLastCustomShardedReplicaTest-ED47B979B672F53D-001/tempDir-004/customcollreplicadeletion_b_replica1/data/index
[junit4] 2> 42378 T44 oasu.RandomMergePolicy.<init> RandomMergePolicy wrapping class org.apache.lucene.index.LogDocMergePolicy: [LogDocMergePolicy: minMergeSize=1000, mergeFactor=48, maxMergeSize=9223372036854775807, maxMergeSizeForForcedMerge=9223372036854775807, calibrateSizeByDeletes=true, maxMergeDocs=2147483647, maxCFSSegmentSizeMB=8.796093022207999E12, noCFSRatio=0.5525251389990121]
[junit4] 2> 42379 T83 oasu.RandomMergePolicy.<init> RandomMergePolicy wrapping class org.apache.lucene.index.LogDocMergePolicy: [LogDocMergePolicy: minMergeSize=1000, mergeFactor=48, maxMergeSize=9223372036854775807, maxMergeSizeForForcedMerge=9223372036854775807, calibrateSizeByDeletes=true, maxMergeDocs=2147483647, maxCFSSegmentSizeMB=8.796093022207999E12, noCFSRatio=0.5525251389990121]
[junit4] 2> 42381 T44 oasc.SolrDeletionPolicy.onCommit SolrDeletionPolicy.onCommit: commits: num=1
[junit4] 2> commit{dir=MockDirectoryWrapper(RAMDirectory(id=lucene-38b1d646)),segFN=segments_1,generation=1}
[junit4] 2> 42381 T83 oasc.SolrDeletionPolicy.onCommit SolrDeletionPolicy.onCommit: commits: num=1
[junit4] 2> commit{dir=MockDirectoryWrapper(RAMDirectory(id=lucene-219664da)),segFN=segments_1,generation=1}
[junit4] 2> 42382 T44 oasc.SolrDeletionPolicy.updateCommits newest commit generation = 1
[junit4] 2> 42383 T83 oasc.SolrDeletionPolicy.updateCommits newest commit generation = 1
[junit4] 2> 42399 T83 oasup.UpdateRequestProcessorChain.init creating updateRequestProcessorChain "nodistrib"
[junit4] 2> 42400 T44 oasup.UpdateRequestProcessorChain.init creating updateRequestProcessorChain "nodistrib"
[junit4] 2> 42695 T83 oasup.UpdateRequestProcessorChain.init creating updateRequestProcessorChain "dedupe"
[junit4] 2> 42696 T44 oasup.UpdateRequestProcessorChain.init creating updateRequestProcessorChain "dedupe"
[junit4] 2> 42715 T83 oasup.UpdateRequestProcessorChain.init inserting DistributedUpdateProcessorFactory into updateRequestProcessorChain "dedupe"
[junit4] 2> 42715 T44 oasup.UpdateRequestProcessorChain.init inserting DistributedUpdateProcessorFactory into updateRequestProcessorChain "dedupe"
[junit4] 2> 42716 T83 oasup.UpdateRequestProcessorChain.init creating updateRequestProcessorChain "stored_sig"
[junit4] 2> 42717 T44 oasup.UpdateRequestProcessorChain.init creating updateRequestProcessorChain "stored_sig"
[junit4] 2> 42718 T83 oasup.UpdateRequestProcessorChain.init inserting DistributedUpdateProcessorFactory into updateRequestProcessorChain "stored_sig"
[junit4] 2> 42718 T44 oasup.UpdateRequestProcessorChain.init inserting DistributedUpdateProcessorFactory into updateRequestProcessorChain "stored_sig"
[junit4] 2> 42719 T83 oasup.UpdateRequestProcessorChain.init creating updateRequestProcessorChain "distrib-dup-test-chain-explicit"
[junit4] 2> 42720 T44 oasup.UpdateRequestProcessorChain.init creating updateRequestProcessorChain "distrib-dup-test-chain-explicit"
[junit4] 2> 43001 T83 oasup.UpdateRequestProcessorChain.init creating updateRequestProcessorChain "distrib-dup-test-chain-implicit"
[junit4] 2> 43002 T44 oasup.UpdateRequestProcessorChain.init creating updateRequestProcessorChain "distrib-dup-test-chain-implicit"
[junit4] 2> 43002 T83 oasup.UpdateRequestProcessorChain.init inserting DistributedUpdateProcessorFactory into updateRequestProcessorChain "distrib-dup-test-chain-implicit"
[junit4] 2> 43003 T44 oasup.UpdateRequestProcessorChain.init inserting DistributedUpdateProcessorFactory into updateRequestProcessorChain "distrib-dup-test-chain-implicit"
[junit4] 2> 43004 T83 oasc.SolrCore.loadUpdateProcessorChains no updateRequestProcessorChain defined as default, creating implicit default
[junit4] 2> 43004 T44 oasc.SolrCore.loadUpdateProcessorChains no updateRequestProcessorChain defined as default, creating implicit default
[junit4] 2> 43021 T83 oasc.RequestHandlers.initHandlersFromConfig created /update/json/docs: org.apache.solr.handler.UpdateRequestHandler
[junit4] 2> 43021 T44 oasc.RequestHandlers.initHandlersFromConfig created /update/json/docs: org.apache.solr.handler.UpdateRequestHandler
[junit4] 2> 43023 T83 oasc.RequestHandlers.initHandlersFromConfig created /update/json: org.apache.solr.handler.UpdateRequestHandler
[junit4] 2> 43024 T44 oasc.RequestHandlers.initHandlersFromConfig created /update/json: org.apache.solr.handler.UpdateRequestHandler
[junit4] 2> 43026 T83 oasc.RequestHandlers.initHandlersFromConfig created /update/csv: org.apache.solr.handler.UpdateRequestHandler
[junit4] 2> 43027 T44 oasc.RequestHandlers.initHandlersFromConfig created /update/csv: org.apache.solr.handler.UpdateRequestHandler
[junit4] 2> 43028 T83 oasc.RequestHandlers.initHandlersFromConfig created standard: solr.StandardRequestHandler
[junit4] 2> 43030 T44 oasc.RequestHandlers.initHandlersFromConfig created standard: solr.StandardRequestHandler
[junit4] 2> 43085 T83 oasc.RequestHandlers.initHandlersFromConfig created /get: solr.RealTimeGetHandler
[junit4] 2> 43085 T44 oasc.RequestHandlers.initHandlersFromConfig created /get: solr.RealTimeGetHandler
[junit4] 2> 43086 T83 oasc.RequestHandlers.initHandlersFromConfig adding lazy requestHandler: solr.ReplicationHandler
[junit4] 2> 43086 T44 oasc.RequestHandlers.initHandlersFromConfig adding lazy requestHandler: solr.ReplicationHandler
[junit4] 2> 43097 T83 oasc.RequestHandlers.initHandlersFromConfig created /replication: solr.ReplicationHandler
[junit4] 2> 43097 T44 oasc.RequestHandlers.initHandlersFromConfig created /replication: solr.ReplicationHandler
[junit4] 2> 43099 T83 oasc.RequestHandlers.initHandlersFromConfig created /update: solr.UpdateRequestHandler
[junit4] 2> 43101 T44 oasc.RequestHandlers.initHandlersFromConfig created /update: solr.UpdateRequestHandler
[junit4] 2> 43112 T83 oasc.RequestHandlers.initHandlersFromConfig created /admin/: org.apache.solr.handler.admin.AdminHandlers
[junit4] 2> 43112 T44 oasc.RequestHandlers.initHandlersFromConfig created /admin/: org.apache.solr.handler.admin.AdminHandlers
[junit4] 2> 43190 T44 oasc.RequestHandlers.initHandlersFromConfig created /admin/file: solr.admin.ShowFileRequestHandler
[junit4] 2> 43190 T83 oasc.RequestHandlers.initHandlersFromConfig created /admin/file: solr.admin.ShowFileRequestHandler
[junit4] 2> 43248 T44 oasc.RequestHandlers.initHandlersFromConfig created /admin/fileedit: solr.admin.EditFileRequestHandler
[junit4] 2> 43248 T83 oasc.RequestHandlers.initHandlersFromConfig created /admin/fileedit: solr.admin.EditFileRequestHandler
[junit4] 2> 43282 T83 oashl.XMLLoader.init xsltCacheLifetimeSeconds=60
[junit4] 2> 43283 T44 oashl.XMLLoader.init xsltCacheLifetimeSeconds=60
[junit4] 2> 43286 T83 oashl.XMLLoader.init xsltCacheLifetimeSeconds=60
[junit4] 2> 43287 T44 oashl.XMLLoader.init xsltCacheLifetimeSeconds=60
[junit4] 2> 43289 T83 oashl.XMLLoader.init xsltCacheLifetimeSeconds=60
[junit4] 2> 43290 T44 oashl.XMLLoader.init xsltCacheLifetimeSeconds=60
[junit4] 2> 43292 T83 oashl.XMLLoader.init xsltCacheLifetimeSeconds=60
[junit4] 2> 43294 T44 oashl.XMLLoader.init xsltCacheLifetimeSeconds=60
[junit4] 2> 43454 T83 oasu.CommitTracker.<init> Hard AutoCommit: disabled
[junit4] 2> 43454 T44 oasu.CommitTracker.<init> Hard AutoCommit: disabled
[junit4] 2> 43455 T83 oasu.CommitTracker.<init> Soft AutoCommit: disabled
[junit4] 2> 43456 T44 oasu.CommitTracker.<init> Soft AutoCommit: disabled
[junit4] 2> 43459 T83 oasu.RandomMergePolicy.<init> RandomMergePolicy wrapping class org.apache.lucene.index.TieredMergePolicy: [TieredMergePolicy: maxMergeAtOnce=10, maxMergeAtOnceExplicit=13, maxMergedSegmentMB=83.1328125, floorSegmentMB=0.4736328125, forceMergeDeletesPctAllowed=19.436075717989556, segmentsPerTier=13.0, maxCFSSegmentSizeMB=8.796093022207999E12, noCFSRatio=1.0
[junit4] 2> 43460 T44 oasu.RandomMergePolicy.<init> RandomMergePolicy wrapping class org.apache.lucene.index.TieredMergePolicy: [TieredMergePolicy: maxMergeAtOnce=10, maxMergeAtOnceExplicit=13, maxMergedSegmentMB=83.1328125, floorSegmentMB=0.4736328125, forceMergeDeletesPctAllowed=19.436075717989556, segmentsPerTier=13.0, maxCFSSegmentSizeMB=8.796093022207999E12, noCFSRatio=1.0
[junit4] 2> 43461 T83 oasc.SolrDeletionPolicy.onInit SolrDeletionPolicy.onInit: commits: num=1
[junit4] 2> commit{dir=MockDirectoryWrapper(RAMDirectory(id=lucene-219664da)),segFN=segments_1,generation=1}
[junit4] 2> 43462 T83 oasc.SolrDeletionPolicy.updateCommits newest commit generation = 1
[junit4] 2> 43462 T44 oasc.SolrDeletionPolicy.onInit SolrDeletionPolicy.onInit: commits: num=1
[junit4] 2> commit{dir=MockDirectoryWrapper(RAMDirectory(id=lucene-38b1d646)),segFN=segments_1,generation=1}
[junit4] 2> 43464 T83 oass.SolrIndexSearcher.<init> Opening Searcher@8d96738[customcollreplicadeletion_b_replica1] main
[junit4] 2> 43464 T44 oasc.SolrDeletionPolicy.updateCommits newest commit generation = 1
[junit4] 2> 43465 T83 oascc.ZkStateReader.readConfigName Load collection config from:/collections/customcollreplicadeletion
[junit4] 2> 43466 T44 oass.SolrIndexSearcher.<init> Opening Searcher@6006d82a[customcollreplicadeletion_a_replica1] main
[junit4] 2> 43468 T44 oascc.ZkStateReader.readConfigName Load collection config from:/collections/customcollreplicadeletion
[junit4] 2> 43470 T44 oascc.ZkStateReader.readConfigName path=/collections/customcollreplicadeletion configName=conf1 specified config exists in ZooKeeper
[junit4] 2> 43470 T83 oascc.ZkStateReader.readConfigName path=/collections/customcollreplicadeletion configName=conf1 specified config exists in ZooKeeper
[junit4] 2> 43471 T44 oasr.ManagedResourceStorage.newStorageIO Setting up ZooKeeper-based storage for the RestManager with znodeBase: /configs/conf1
[junit4] 2> 43471 T83 oasr.ManagedResourceStorage.newStorageIO Setting up ZooKeeper-based storage for the RestManager with znodeBase: /configs/conf1
[junit4] 2> 43497 T44 oasr.ManagedResourceStorage$ZooKeeperStorageIO.configure Configured ZooKeeperStorageIO with znodeBase: /configs/conf1
[junit4] 2> 43497 T83 oasr.ManagedResourceStorage$ZooKeeperStorageIO.configure Configured ZooKeeperStorageIO with znodeBase: /configs/conf1
[junit4] 2> 43498 T44 oasr.RestManager.init Initializing RestManager with initArgs: {}
[junit4] 2> 43499 T83 oasr.RestManager.init Initializing RestManager with initArgs: {}
[junit4] 2> 43500 T44 oasr.ManagedResourceStorage.load Reading _rest_managed.json using ZooKeeperStorageIO:path=/configs/conf1
[junit4] 2> 43501 T83 oasr.ManagedResourceStorage.load Reading _rest_managed.json using ZooKeeperStorageIO:path=/configs/conf1
[junit4] 2> 43502 T44 oasr.ManagedResourceStorage$ZooKeeperStorageIO.openInputStream No data found for znode /configs/conf1/_rest_managed.json
[junit4] 2> 43503 T83 oasr.ManagedResourceStorage$ZooKeeperStorageIO.openInputStream No data found for znode /configs/conf1/_rest_managed.json
[junit4] 2> 43503 T44 oasr.ManagedResourceStorage.load Loaded null at path _rest_managed.json using ZooKeeperStorageIO:path=/configs/conf1
[junit4] 2> 43504 T83 oasr.ManagedResourceStorage.load Loaded null at path _rest_managed.json using ZooKeeperStorageIO:path=/configs/conf1
[junit4] 2> 43505 T44 oascc.SolrZkClient.makePath makePath: /configs/conf1/_rest_managed.json
[junit4] 2> 43506 T83 oascc.SolrZkClient.makePath makePath: /configs/conf1/_rest_managed.json
[junit4] 2> 43510 T44 oasr.ManagedResourceStorage$ZooKeeperStorageIO$1.close Wrote 38 bytes to new znode /configs/conf1/_rest_managed.json
[junit4] 2> 43511 T44 oasr.ManagedResourceStorage$JsonStorage.store Saved JSON object to path _rest_managed.json using ZooKeeperStorageIO:path=/configs/conf1
[junit4] 2> 43511 T44 oasr.RestManager.init Initializing 0 registered ManagedResources
[junit4] 2> 43552 T83 oasr.ManagedResourceStorage$JsonStorage.store Saved JSON object to path _rest_managed.json using ZooKeeperStorageIO:path=/configs/conf1
[junit4] 2> 43553 T83 oasr.RestManager.init Initializing 0 registered ManagedResources
[junit4] 2> 43643 T105 oasc.SolrCore.registerSearcher [customcollreplicadeletion_a_replica1] Registered new searcher Searcher@6006d82a[customcollreplicadeletion_a_replica1] main{ExitableDirectoryReader(UninvertingDirectoryReader())}
[junit4] 2> 43644 T104 oasc.SolrCore.registerSearcher [customcollreplicadeletion_b_replica1] Registered new searcher Searcher@8d96738[customcollreplicadeletion_b_replica1] main{ExitableDirectoryReader(UninvertingDirectoryReader())}
[junit4] 2> 43665 T44 oasc.CoreContainer.registerCore registering core: customcollreplicadeletion_a_replica1
[junit4] 2> 43666 T44 oasc.ZkController.register Register replica - core:customcollreplicadeletion_a_replica1 address:https://127.0.0.1:59147/kpo/v collection:customcollreplicadeletion shard:a
[junit4] 2> 43668 T83 oasc.CoreContainer.registerCore registering core: customcollreplicadeletion_b_replica1
[junit4] 2> 43669 T83 oasc.ZkController.register Register replica - core:customcollreplicadeletion_b_replica1 address:https://127.0.0.1:21713/kpo/v collection:customcollreplicadeletion shard:b
[junit4] 2> 43703 T44 oascc.SolrZkClient.makePath makePath: /collections/customcollreplicadeletion/leader_elect/a/election
[junit4] 2> 43703 T83 oascc.SolrZkClient.makePath makePath: /collections/customcollreplicadeletion/leader_elect/b/election
[junit4] 2> 43712 T44 oasc.ShardLeaderElectionContext.runLeaderProcess Running the leader process for shard a
[junit4] 2> 43712 T83 oasc.ShardLeaderElectionContext.runLeaderProcess Running the leader process for shard b
[junit4] 2> 43715 T63 oasc.DistributedQueue$LatchChildWatcher.process LatchChildWatcher fired on path: /overseer/queue state: SyncConnected type NodeChildrenChanged
[junit4] 2> 43716 T44 oasc.ShardLeaderElectionContext.waitForReplicasToComeUp Enough replicas found to continue.
[junit4] 2> 43716 T83 oasc.ShardLeaderElectionContext.waitForReplicasToComeUp Enough replicas found to continue.
[junit4] 2> 43717 T44 oasc.ShardLeaderElectionContext.runLeaderProcess I may be the new leader - try and sync
[junit4] 2> 43717 T83 oasc.ShardLeaderElectionContext.runLeaderProcess I may be the new leader - try and sync
[junit4] 2> 43720 T55 oascc.ZkStateReader.updateWatchedCollection Updating data for customcollreplicadeletion to ver 2
[junit4] 2> ASYNC NEW_CORE C0 name=customcollreplicadeletion_b_replica1 org.apache.solr.core.SolrCore@42b4ed35 url=https://127.0.0.1:21713/kpo/v/customcollreplicadeletion_b_replica1 node=127.0.0.1:21713_kpo%2Fv C0_STATE=coll:customcollreplicadeletion core:customcollreplicadeletion_b_replica1 props:{core=customcollreplicadeletion_b_replica1, base_url=https://127.0.0.1:21713/kpo/v, node_name=127.0.0.1:21713_kpo%2Fv, state=down}
[junit4] 2> 43726 T83 C0 P21713 oasc.SyncStrategy.sync Sync replicas to https://127.0.0.1:21713/kpo/v/customcollreplicadeletion_b_replica1/
[junit4] 2> 43730 T55 oasc.Overseer$ClusterStateUpdater.updateZkStates going to update_collection /collections/customcollreplicadeletion/state.json
[junit4] 2> ASYNC NEW_CORE C1 name=customcollreplicadeletion_a_replica1 org.apache.solr.core.SolrCore@3a1140cb url=https://127.0.0.1:59147/kpo/v/customcollreplicadeletion_a_replica1 node=127.0.0.1:59147_kpo%2Fv C1_STATE=coll:customcollreplicadeletion core:customcollreplicadeletion_a_replica1 props:{core=customcollreplicadeletion_a_replica1, base_url=https://127.0.0.1:59147/kpo/v, node_name=127.0.0.1:59147_kpo%2Fv, state=down}
[junit4] 2> 43726 T44 C1 P59147 oasc.SyncStrategy.sync Sync replicas to https://127.0.0.1:59147/kpo/v/customcollreplicadeletion_a_replica1/
[junit4] 2> 43735 T93 oascc.ZkStateReader$7.process A cluster state change: WatchedEvent state:SyncConnected type:NodeDataChanged path:/collections/customcollreplicadeletion/state.json, has occurred - updating...
[junit4] 2> 43735 T63 oascc.ZkStateReader$7.process A cluster state change: WatchedEvent state:SyncConnected type:NodeDataChanged path:/collections/customcollreplicadeletion/state.json, has occurred - updating...
[junit4] 2> 43734 T83 C0 P21713 oasc.SyncStrategy.syncReplicas Sync Success - now sync replicas to me
[junit4] 2> 43736 T44 C1 P59147 oasc.SyncStrategy.syncReplicas Sync Success - now sync replicas to me
[junit4] 2> 43738 T63 oascc.ZkStateReader.updateWatchedCollection Updating data for customcollreplicadeletion to ver 3
[junit4] 2> 43738 T83 C0 P21713 oasc.SyncStrategy.syncToMe https://127.0.0.1:21713/kpo/v/customcollreplicadeletion_b_replica1/ has no replicas
[junit4] 2> 43739 T93 oascc.ZkStateReader.updateWatchedCollection Updating data for customcollreplicadeletion to ver 3
[junit4] 2> 43739 T44 C1 P59147 oasc.SyncStrategy.syncToMe https://127.0.0.1:59147/kpo/v/customcollreplicadeletion_a_replica1/ has no replicas
[junit4] 2> 43741 T83 oasc.ShardLeaderElectionContext.runLeaderProcess I am the new leader: https://127.0.0.1:21713/kpo/v/customcollreplicadeletion_b_replica1/ b
[junit4] 2> 43742 T44 oasc.ShardLeaderElectionContext.runLeaderProcess I am the new leader: https://127.0.0.1:59147/kpo/v/customcollreplicadeletion_a_replica1/ a
[junit4] 2> 43744 T55 oascc.ZkStateReader.updateWatchedCollection Updating data for customcollreplicadeletion to ver 3
[junit4] 2> 43748 T63 oasc.DistributedQueue$LatchChildWatcher.process LatchChildWatcher fired on path: /overseer/queue state: SyncConnected type NodeChildrenChanged
[junit4] 2> 43749 T55 oasc.Overseer$ClusterStateUpdater.updateZkStates going to update_collection /collections/customcollreplicadeletion/state.json
[junit4] 2> 43750 T93 oascc.ZkStateReader$7.process A cluster state change: WatchedEvent state:SyncConnected type:NodeDataChanged path:/collections/customcollreplicadeletion/state.json, has occurred - updating...
[junit4] 2> 43750 T63 oascc.ZkStateReader$7.process A cluster state change: WatchedEvent state:SyncConnected type:NodeDataChanged path:/collections/customcollreplicadeletion/state.json, has occurred - updating...
[junit4] 2> 43752 T93 oascc.ZkStateReader.updateWatchedCollection Updating data for customcollreplicadeletion to ver 4
[junit4] 2> 43754 T63 oascc.ZkStateReader.updateWatchedCollection Updating data for customcollreplicadeletion to ver 4
[junit4] 2> 43828 T44 oascc.SolrZkClient.makePath makePath: /collections/customcollreplicadeletion/leaders/a
[junit4] 2> 43828 T83 oascc.SolrZkClient.makePath makePath: /collections/customcollreplicadeletion/leaders/b
[junit4] 2> 43836 T63 oasc.DistributedQueue$LatchChildWatcher.process LatchChildWatcher fired on path: /overseer/queue state: SyncConnected type NodeChildrenChanged
[junit4] 2> 43841 T55 oascc.ZkStateReader.updateWatchedCollection Updating data for customcollreplicadeletion to ver 4
[junit4] 2> 43846 T55 oasc.Overseer$ClusterStateUpdater.updateZkStates going to update_collection /collections/customcollreplicadeletion/state.json
[junit4] 2> 43847 T63 oascc.ZkStateReader$7.process A cluster state change: WatchedEvent state:SyncConnected type:NodeDataChanged path:/collections/customcollreplicadeletion/state.json, has occurred - updating...
[junit4] 2> 43847 T93 oascc.ZkStateReader$7.process A cluster state change: WatchedEvent state:SyncConnected type:NodeDataChanged path:/collections/customcollreplicadeletion/state.json, has occurred - updating...
[junit4] 2> 43850 T93 oascc.ZkStateReader.updateWatchedCollection Updating data for customcollreplicadeletion to ver 5
[junit4] 2> 43851 T63 oascc.ZkStateReader.updateWatchedCollection Updating data for customcollreplicadeletion to ver 5
[junit4] 2> 43855 T55 oascc.ZkStateReader.updateWatchedCollection Updating data for customcollreplicadeletion to ver 5
[junit4] 2> 43858 T63 oasc.DistributedQueue$LatchChildWatcher.process LatchChildWatcher fired on path: /overseer/queue state: SyncConnected type NodeChildrenChanged
[junit4] 2> 43860 T55 oasc.Overseer$ClusterStateUpdater.updateZkStates going to update_collection /collections/customcollreplicadeletion/state.json
[junit4] 2> 43861 T93 oascc.ZkStateReader$7.process A cluster state change: WatchedEvent state:SyncConnected type:NodeDataChanged path:/collections/customcollreplicadeletion/state.json, has occurred - updating...
[junit4] 2> 43861 T63 oascc.ZkStateReader$7.process A cluster state change: WatchedEvent state:SyncConnected type:NodeDataChanged path:/collections/customcollreplicadeletion/state.json, has occurred - updating...
[junit4] 2> 43863 T93 oascc.ZkStateReader.updateWatchedCollection Updating data for customcollreplicadeletion to ver 6
[junit4] 2> 43865 T63 oascc.ZkStateReader.updateWatchedCollection Updating data for customcollreplicadeletion to ver 6
[junit4] 2> 43888 T44 oasc.ZkController.register We are https://127.0.0.1:59147/kpo/v/customcollreplicadeletion_a_replica1/ and leader is https://127.0.0.1:59147/kpo/v/customcollreplicadeletion_a_replica1/
[junit4] 2> 43889 T83 oasc.ZkController.register We are https://127.0.0.1:21713/kpo/v/customcollreplicadeletion_b_replica1/ and leader is https://127.0.0.1:21713/kpo/v/customcollreplicadeletion_b_replica1/
[junit4] 2> 43898 T44 oasc.ZkController.register No LogReplay needed for core=customcollreplicadeletion_a_replica1 baseURL=https://127.0.0.1:59147/kpo/v
[junit4] 2> 43898 T83 oasc.ZkController.register No LogReplay needed for core=customcollreplicadeletion_b_replica1 baseURL=https://127.0.0.1:21713/kpo/v
[junit4] 2> 43899 T44 oasc.ZkController.checkRecovery I am the leader, no recovery necessary
[junit4] 2> 43900 T83 oasc.ZkController.checkRecovery I am the leader, no recovery necessary
[junit4] 2> 43900 T44 oasc.ZkController.publish publishing core=customcollreplicadeletion_a_replica1 state=active collection=customcollreplicadeletion
[junit4] 2> 43901 T83 oasc.ZkController.publish publishing core=customcollreplicadeletion_b_replica1 state=active collection=customcollreplicadeletion
[junit4] 2> 43904 T63 oasc.DistributedQueue$LatchChildWatcher.process LatchChildWatcher fired on path: /overseer/queue state: SyncConnected type NodeChildrenChanged
[junit4] 2> 43908 T44 oascc.ZkStateReader.updateWatchedCollection Updating data for customcollreplicadeletion to ver 6
[junit4] 2> 43908 T83 oascc.ZkStateReader.updateWatchedCollection Updating data for customcollreplicadeletion to ver 6
[junit4] 2> 43912 T55 oascc.ZkStateReader.updateWatchedCollection Updating data for customcollreplicadeletion to ver 6
[junit4] 2> 43913 T55 oasc.Overseer$ClusterStateUpdater.updateState Update state numShards=2 message={
[junit4] 2> "roles":null,
[junit4] 2> "core":"customcollreplicadeletion_a_replica1",
[junit4] 2> "base_url":"https://127.0.0.1:59147/kpo/v",
[junit4] 2> "numShards":"2",
[junit4] 2> "node_name":"127.0.0.1:59147_kpo%2Fv",
[junit4] 2> "operation":"state",
[junit4] 2> "collection":"customcollreplicadeletion",
[junit4] 2> "core_node_name":"core_node1",
[junit4] 2> "shard":"a",
[junit4] 2> "state":"active"}
[junit4] 2> 43918 T83 oass.SolrDispatchFilter.handleAdminRequest [admin] webapp=null path=/admin/cores params={qt=/admin/cores&version=2&numShards=2&action=CREATE&collection=customcollreplicadeletion&name=customcollreplicadeletion_b_replica1&collection.configName=conf1&shard=b&wt=javabin} status=0 QTime=5539
[junit4] 2> 43919 T55 oasc.Overseer$ClusterStateUpdater.updateZkStates going to update_collection /collections/customcollreplicadeletion/state.json
[junit4] 2> 43918 T44 oass.SolrDispatchFilter.handleAdminRequest [admin] webapp=null path=/admin/cores params={qt=/admin/cores&version=2&numShards=2&action=CREATE&collection=customcollreplicadeletion&name=customcollreplicadeletion_a_replica1&collection.configName=conf1&shard=a&wt=javabin} status=0 QTime=5539
[junit4] 2> 43921 T93 oascc.ZkStateReader$7.process A cluster state change: WatchedEvent state:SyncConnected type:NodeDataChanged path:/collections/customcollreplicadeletion/state.json, has occurred - updating...
[junit4] 2> 43921 T63 oascc.ZkStateReader$7.process A cluster state change: WatchedEvent state:SyncConnected type:NodeDataChanged path:/collections/customcollreplicadeletion/state.json, has occurred - updating...
[junit4] 2> 43922 T93 oascc.ZkStateReader.updateWatchedCollection Updating data for customcollreplicadeletion to ver 7
[junit4] 2> 43923 T63 oascc.ZkStateReader.updateWatchedCollection Updating data for customcollreplicadeletion to ver 7
[junit4] 2> 43927 T55 oascc.ZkStateReader.updateWatchedCollection Updating data for customcollreplicadeletion to ver 7
[junit4] 2> 43927 T55 oasc.Overseer$ClusterStateUpdater.updateState Update state numShards=2 message={
[junit4] 2> "roles":null,
[junit4] 2> "core":"customcollreplicadeletion_b_replica1",
[junit4] 2> "base_url":"https://127.0.0.1:21713/kpo/v",
[junit4] 2> "numShards":"2",
[junit4] 2> "node_name":"127.0.0.1:21713_kpo%2Fv",
[junit4] 2> "operation":"state",
[junit4] 2> "collection":"customcollreplicadeletion",
[junit4] 2> "core_node_name":"core_node2",
[junit4] 2> "shard":"b",
[junit4] 2> "state":"active"}
[junit4] 2> 43930 T63 oasc.DistributedQueue$LatchChildWatcher.process LatchChildWatcher fired on path: /overseer/queue state: SyncConnected type NodeChildrenChanged
[junit4] 2> 43931 T55 oasc.Overseer$ClusterStateUpdater.updateZkStates going to update_collection /collections/customcollreplicadeletion/state.json
[junit4] 2> 43932 T93 oascc.ZkStateReader$7.process A cluster state change: WatchedEvent state:SyncConnected type:NodeDataChanged path:/collections/customcollreplicadeletion/state.json, has occurred - updating...
[junit4] 2> 43932 T63 oascc.ZkStateReader$7.process A cluster state change: WatchedEvent state:SyncConnected type:NodeDataChanged path:/collections/customcollreplicadeletion/state.json, has occurred - updating...
[junit4] 2> 43933 T93 oascc.ZkStateReader.updateWatchedCollection Updating data for customcollreplicadeletion to ver 8
[junit4] 2> 43935 T63 oascc.ZkStateReader.updateWatchedCollection Updating data for customcollreplicadeletion to ver 8
[junit4] 2> 44424 T98 oasc.OverseerCollectionProcessor.createCollection Finished create command on all shards for collection: customcollreplicadeletion
[junit4] 2> 44442 T98 oasc.OverseerCollectionProcessor$Runner.run Overseer Collection Processor: Message id:/overseer/collection-queue-work/qn-0000000000 complete, response:{success={null={responseHeader={status=0,QTime=5539},core=customcollreplicadeletion_b_replica1},null={responseHeader={status=0,QTime=5539},core=customcollreplicadeletion_a_replica1}}}
[junit4] 2> 44443 T93 oasc.DistributedQueue$LatchChildWatcher.process LatchChildWatcher fired on path: /overseer/collection-queue-work/qnr-0000000000 state: SyncConnected type NodeDataChanged
[junit4] 2> 44444 T63 oasc.DistributedQueue$LatchChildWatcher.process LatchChildWatcher fired on path: /overseer/collection-queue-work state: SyncConnected type NodeChildrenChanged
[junit4] 2> 44448 T82 oass.SolrDispatchFilter.handleAdminRequest [admin] webapp=null path=/admin/collections params={version=2&shards=a,b&replicationFactor=1&numShards=1&stateFormat=2&router.name=implicit&action=CREATE&name=customcollreplicadeletion&maxShardsPerNode=5&wt=javabin} status=0 QTime=6464
[junit4] 2> 44451 T29 oasc.AbstractDistribZkTestBase.waitForRecoveriesToFinish Wait for recoveries to finish - collection: customcollreplicadeletion failOnTimeout:true timeout (sec):330
[junit4] 2> 44455 T29 oasc.AbstractDistribZkTestBase.waitForRecoveriesToFinish Recoveries finished - collection: customcollreplicadeletion
[junit4] 2> 44460 T29 oascc.SolrZkClient.createZkCredentialsToAddAutomatically Using default ZkCredentialsProvider
[junit4] 2> 44461 T29 oascc.ConnectionManager.waitForConnected Waiting for client to connect to ZooKeeper
[junit4] 2> 44464 T109 oascc.ConnectionManager.process Watcher org.apache.solr.common.cloud.ConnectionManager@411a838b name:ZooKeeperConnection Watcher:127.0.0.1:21729/solr got event WatchedEvent state:SyncConnected type:None path:null path:null type:None
[junit4] 2> 44465 T29 oascc.ConnectionManager.waitForConnected Client is connected to ZooKeeper
[junit4] 2> 44466 T29 oascc.SolrZkClient.createZkACLProvider Using default ZkACLProvider
[junit4] 2> 44467 T29 oascc.ZkStateReader.createClusterStateWatchersAndUpdate Updating cluster state from ZooKeeper...
[junit4] 2> 44480 T82 oasha.CollectionsHandler.handleRemoveReplica Remove replica: version=2&action=deletereplica&collection=customcollreplicadeletion&shard=a&wt=javabin&replica=core_node1
[junit4] 2> 44482 T63 oasc.DistributedQueue$LatchChildWatcher.process LatchChildWatcher fired on path: /overseer/collection-queue-work state: SyncConnected type NodeChildrenChanged
[junit4] 2> 44484 T56 oasc.OverseerCollectionProcessor.run Overseer Collection Processor: Get the message id:/overseer/collection-queue-work/qn-0000000002 message:{
[junit4] 2> "operation":"deletereplica",
[junit4] 2> "collection":"customcollreplicadeletion",
[junit4] 2> "shard":"a",
[junit4] 2> "replica":"core_node1"}
[junit4] 2> 44485 T110 oasc.OverseerCollectionProcessor.processMessage WARN OverseerCollectionProcessor.processMessage : deletereplica , {
[junit4] 2> "operation":"deletereplica",
[junit4] 2> "collection":"customcollreplicadeletion",
[junit4] 2> "shard":"a",
[junit4] 2> "replica":"core_node1"}
[junit4] 2> 44493 T44 oasc.SolrCore.close [customcollreplicadeletion_a_replica1] CLOSING SolrCore org.apache.solr.core.SolrCore@3a1140cb
[junit4] 2> 44559 T44 oasu.DirectUpdateHandler2.close closing DirectUpdateHandler2{commits=0,autocommits=0,soft autocommits=0,optimizes=0,rollbacks=0,expungeDeletes=0,docsPending=0,adds=0,deletesById=0,deletesByQuery=0,errors=0,cumulative_adds=0,cumulative_deletesById=0,cumulative_deletesByQuery=0,cumulative_errors=0,transaction_logs_total_size=0,transaction_logs_total_number=0}
[junit4] 2> 44560 T44 oasu.SolrCoreState.decrefSolrCoreState Closing SolrCoreState
[junit4] 2> 44561 T44 oasu.DefaultSolrCoreState.closeIndexWriter SolrCoreState ref count has reached 0 - closing IndexWriter
[junit4] 2> 44561 T44 oasu.DefaultSolrCoreState.closeIndexWriter closing IndexWriter with IndexWriterCloser
[junit4] 2> 44563 T44 oasc.SolrCore.closeSearcher [customcollreplicadeletion_a_replica1] Closing main searcher on request.
[junit4] 2> 44564 T44 oasc.CachingDirectoryFactory.close Closing MockDirectoryFactory - 2 directories currently being tracked
[junit4] 2> 44564 T44 oasc.CachingDirectoryFactory.closeCacheValue looking to close /usr/home/jenkins/jenkins-slave/workspace/Lucene-Solr-Tests-5.x-Java7/solr/build/solr-core/test/J2/temp/solr.cloud.DeleteLastCustomShardedReplicaTest-ED47B979B672F53D-001/tempDir-002/customcollreplicadeletion_a_replica1/data [CachedDir<<refCount=0;path=/usr/home/jenkins/jenkins-slave/workspace/Lucene-Solr-Tests-5.x-Java7/solr/build/solr-core/test/J2/temp/solr.cloud.DeleteLastCustomShardedReplicaTest-ED47B979B672F53D-001/tempDir-002/customcollreplicadeletion_a_replica1/data;done=false>>]
[junit4] 2> 44565 T44 oasc.CachingDirectoryFactory.closeCacheValue looking to close /usr/home/jenkins/jenkins-slave/workspace/Lucene-Solr-Tests-5.x-Java7/solr/build/solr-core/test/J2/temp/solr.cloud.DeleteLastCustomShardedReplicaTest-ED47B979B672F53D-001/tempDir-002/customcollreplicadeletion_a_replica1/data []
[junit4] 2> 44565 T44 oasc.CachingDirectoryFactory.closeCacheValue looking to close /usr/home/jenkins/jenkins-slave/workspace/Lucene-Solr-Tests-5.x-Java7/solr/build/solr-core/test/J2/temp/solr.cloud.DeleteLastCustomShardedReplicaTest-ED47B979B672F53D-001/tempDir-002/customcollreplicadeletion_a_replica1/data/index [CachedDir<<refCount=0;path=/usr/home/jenkins/jenkins-slave/workspace/Lucene-Solr-Tests-5.x-Java7/solr/build/solr-core/test/J2/temp/solr.cloud.DeleteLastCustomShardedReplicaTest-ED47B979B672F53D-001/tempDir-002/customcollreplicadeletion_a_replica1/data;done=false>>, CachedDir<<refCount=0;path=/usr/home/jenkins/jenkins-slave/workspace/Lucene-Solr-Tests-5.x-Java7/solr/build/solr-core/test/J2/temp/solr.cloud.DeleteLastCustomShardedReplicaTest-ED47B979B672F53D-001/tempDir-002/customcollreplicadeletion_a_replica1/data/index;done=false>>]
[junit4] 2> 44566 T44 oasc.CachingDirectoryFactory.close Closing directory: /usr/home/jenkins/jenkins-slave/workspace/Lucene-Solr-Tests-5.x-Java7/solr/build/solr-core/test/J2/temp/solr.cloud.DeleteLastCustomShardedReplicaTest-ED47B979B672F53D-001/tempDir-002/customcollreplicadeletion_a_replica1/data
[junit4] 2> 44567 T44 oasc.CachingDirectoryFactory.close Closing directory: /usr/home/jenkins/jenkins-slave/workspace/Lucene-Solr-Tests-5.x-Java7/solr/build/solr-core/test/J2/temp/solr.cloud.DeleteLastCustomShardedReplicaTest-ED47B979B672F53D-001/tempDir-002/customcollreplicadeletion_a_replica1/data/index
[junit4] 2> 44567 T44 oasc.CachingDirectoryFactory.close Removing directory after core close: /usr/home/jenkins/jenkins-slave/workspa
[...truncated too long message...]
oasc.CachingDirectoryFactory.closeCacheValue looking to close /usr/home/jenkins/jenkins-slave/workspace/Lucene-Solr-Tests-5.x-Java7/solr/build/solr-core/test/J2/temp/solr.cloud.DeleteLastCustomShardedReplicaTest-ED47B979B672F53D-001/tempDir-004/customcollreplicadeletion_b_replica1/data [CachedDir<<refCount=0;path=/usr/home/jenkins/jenkins-slave/workspace/Lucene-Solr-Tests-5.x-Java7/solr/build/solr-core/test/J2/temp/solr.cloud.DeleteLastCustomShardedReplicaTest-ED47B979B672F53D-001/tempDir-004/customcollreplicadeletion_b_replica1/data;done=false>>]
[junit4] 2> 162033 T29 oasc.CachingDirectoryFactory.close Closing directory: /usr/home/jenkins/jenkins-slave/workspace/Lucene-Solr-Tests-5.x-Java7/solr/build/solr-core/test/J2/temp/solr.cloud.DeleteLastCustomShardedReplicaTest-ED47B979B672F53D-001/tempDir-004/customcollreplicadeletion_b_replica1/data
[junit4] 2> 162034 T29 oasc.CachingDirectoryFactory.closeCacheValue looking to close /usr/home/jenkins/jenkins-slave/workspace/Lucene-Solr-Tests-5.x-Java7/solr/build/solr-core/test/J2/temp/solr.cloud.DeleteLastCustomShardedReplicaTest-ED47B979B672F53D-001/tempDir-004/customcollreplicadeletion_b_replica1/data/index [CachedDir<<refCount=0;path=/usr/home/jenkins/jenkins-slave/workspace/Lucene-Solr-Tests-5.x-Java7/solr/build/solr-core/test/J2/temp/solr.cloud.DeleteLastCustomShardedReplicaTest-ED47B979B672F53D-001/tempDir-004/customcollreplicadeletion_b_replica1/data/index;done=false>>]
[junit4] 2> 162035 T29 oasc.CachingDirectoryFactory.close Closing directory: /usr/home/jenkins/jenkins-slave/workspace/Lucene-Solr-Tests-5.x-Java7/solr/build/solr-core/test/J2/temp/solr.cloud.DeleteLastCustomShardedReplicaTest-ED47B979B672F53D-001/tempDir-004/customcollreplicadeletion_b_replica1/data/index
[junit4] 2> 162037 T29 oasc.Overseer.close Overseer (id=92549821772791818-127.0.0.1:21713_kpo%2Fv-n_0000000002) closing
[junit4] 2> 162039 T127 oasc.Overseer$ClusterStateUpdater.run Overseer Loop exiting : 127.0.0.1:21713_kpo%2Fv
[junit4] 2> 163543 T93 oascc.ZkStateReader$3.process WARN ZooKeeper watch triggered, but Solr cannot talk to ZK
[junit4] 2> 163546 T29 oejsh.ContextHandler.doStop stopped o.e.j.s.ServletContextHandler{/kpo/v,null}
[junit4] 2> 168547 T29 oas.SolrTestCaseJ4.tearDown ###Ending testDistribSearch
[junit4] 2> 168552 T29 oasc.ZkTestServer.send4LetterWord connecting to 127.0.0.1:21729 21729
[junit4] 2> 169725 T30 oasc.ZkTestServer.send4LetterWord connecting to 127.0.0.1:21729 21729
[junit4] 2> 169826 T96 oaz.ClientCnxn$EventThread.processEvent ERROR Error while calling watcher java.util.concurrent.RejectedExecutionException: Task java.util.concurrent.FutureTask@516bedc1 rejected from java.util.concurrent.ThreadPoolExecutor@4c643aa[Terminated, pool size = 0, active threads = 0, queued tasks = 0, completed tasks = 5]
[junit4] 2> at java.util.concurrent.ThreadPoolExecutor$AbortPolicy.rejectedExecution(ThreadPoolExecutor.java:2048)
[junit4] 2> at java.util.concurrent.ThreadPoolExecutor.reject(ThreadPoolExecutor.java:821)
[junit4] 2> at java.util.concurrent.ThreadPoolExecutor.execute(ThreadPoolExecutor.java:1372)
[junit4] 2> at java.util.concurrent.AbstractExecutorService.submit(AbstractExecutorService.java:110)
[junit4] 2> at org.apache.solr.common.cloud.SolrZkClient$3.process(SolrZkClient.java:263)
[junit4] 2> at org.apache.zookeeper.ClientCnxn$EventThread.processEvent(ClientCnxn.java:522)
[junit4] 2> at org.apache.zookeeper.ClientCnxn$EventThread.run(ClientCnxn.java:498)
[junit4] 2>
[junit4] 2> 169827 T96 oaz.ClientCnxn$EventThread.processEvent ERROR Error while calling watcher java.util.concurrent.RejectedExecutionException: Task java.util.concurrent.FutureTask@63a71fc0 rejected from java.util.concurrent.ThreadPoolExecutor@4c643aa[Terminated, pool size = 0, active threads = 0, queued tasks = 0, completed tasks = 5]
[junit4] 2> at java.util.concurrent.ThreadPoolExecutor$AbortPolicy.rejectedExecution(ThreadPoolExecutor.java:2048)
[junit4] 2> at java.util.concurrent.ThreadPoolExecutor.reject(ThreadPoolExecutor.java:821)
[junit4] 2> at java.util.concurrent.ThreadPoolExecutor.execute(ThreadPoolExecutor.java:1372)
[junit4] 2> at java.util.concurrent.AbstractExecutorService.submit(AbstractExecutorService.java:110)
[junit4] 2> at org.apache.solr.common.cloud.SolrZkClient$3.process(SolrZkClient.java:263)
[junit4] 2> at org.apache.zookeeper.ClientCnxn$EventThread.processEvent(ClientCnxn.java:522)
[junit4] 2> at org.apache.zookeeper.ClientCnxn$EventThread.run(ClientCnxn.java:498)
[junit4] 2>
[junit4] 2> 169828 T96 oascc.ConnectionManager.process Watcher org.apache.solr.common.cloud.ConnectionManager@1ad576e5 name:ZooKeeperConnection Watcher:127.0.0.1:21729/solr got event WatchedEvent state:Disconnected type:None path:null path:null type:None
[junit4] 2> 169828 T96 oascc.ConnectionManager.process Client->ZooKeeper status change trigger but we are already closed
[junit4] 2> NOTE: reproduce with: ant test -Dtestcase=DeleteLastCustomShardedReplicaTest -Dtests.method=testDistribSearch -Dtests.seed=ED47B979B672F53D -Dtests.multiplier=2 -Dtests.slow=true -Dtests.locale=de_CH -Dtests.timezone=America/Denver -Dtests.file.encoding=ISO-8859-1
[junit4] ERROR 152s J2 | DeleteLastCustomShardedReplicaTest.testDistribSearch <<<
[junit4] > Throwable #1: org.apache.solr.client.solrj.SolrServerException: No live SolrServers available to handle this request:[https://127.0.0.1:21713/kpo/v, https://127.0.0.1:59147/kpo/v, https://127.0.0.1:33500/kpo/v]
[junit4] > at __randomizedtesting.SeedInfo.seed([ED47B979B672F53D:6CA13761C12D9501]:0)
[junit4] > at org.apache.solr.client.solrj.impl.LBHttpSolrServer.request(LBHttpSolrServer.java:322)
[junit4] > at org.apache.solr.client.solrj.impl.CloudSolrServer.sendRequest(CloudSolrServer.java:880)
[junit4] > at org.apache.solr.client.solrj.impl.CloudSolrServer.requestWithRetryOnStaleState(CloudSolrServer.java:658)
[junit4] > at org.apache.solr.client.solrj.impl.CloudSolrServer.request(CloudSolrServer.java:601)
[junit4] > at org.apache.solr.cloud.DeleteLastCustomShardedReplicaTest.removeAndWaitForLastReplicaGone(DeleteLastCustomShardedReplicaTest.java:117)
[junit4] > at org.apache.solr.cloud.DeleteLastCustomShardedReplicaTest.doTest(DeleteLastCustomShardedReplicaTest.java:107)
[junit4] > at org.apache.solr.BaseDistributedSearchTestCase.testDistribSearch(BaseDistributedSearchTestCase.java:869)
[junit4] > at java.lang.Thread.run(Thread.java:745)
[junit4] > Caused by: org.apache.solr.client.solrj.impl.HttpSolrServer$RemoteSolrException: Could not remove replica : customcollreplicadeletion/a/core_node1
[junit4] > at org.apache.solr.client.solrj.impl.HttpSolrServer.executeMethod(HttpSolrServer.java:568)
[junit4] > at org.apache.solr.client.solrj.impl.HttpSolrServer.request(HttpSolrServer.java:215)
[junit4] > at org.apache.solr.client.solrj.impl.HttpSolrServer.request(HttpSolrServer.java:211)
[junit4] > at org.apache.solr.client.solrj.impl.LBHttpSolrServer.doRequest(LBHttpSolrServer.java:343)
[junit4] > at org.apache.solr.client.solrj.impl.LBHttpSolrServer.request(LBHttpSolrServer.java:304)
[junit4] > ... 46 more
[junit4] 2> 169879 T29 oas.SolrTestCaseJ4.deleteCore ###deleteCore
[junit4] 2> NOTE: leaving temporary files on disk at: /usr/home/jenkins/jenkins-slave/workspace/Lucene-Solr-Tests-5.x-Java7/solr/build/solr-core/test/J2/temp/solr.cloud.DeleteLastCustomShardedReplicaTest-ED47B979B672F53D-001
[junit4] 2> 151775 T28 ccr.ThreadLeakControl.checkThreadLeaks WARNING Will linger awaiting termination of 1 leaked thread(s).
[junit4] 2> NOTE: test params are: codec=Asserting(Lucene50): {}, docValues:{}, sim=RandomSimilarityProvider(queryNorm=true,coord=no): {}, locale=de_CH, timezone=America/Denver
[junit4] 2> NOTE: FreeBSD 9.1-RELEASE-p3 amd64/Oracle Corporation 1.7.0_65 (64-bit)/cpus=16,threads=1,free=53260072,total=130547712
[junit4] 2> NOTE: All tests run in this JVM: [TestDFRSimilarityFactory, PluginInfoTest, TestNonDefinedSimilarityFactory, DeleteLastCustomShardedReplicaTest]
[junit4] Completed on J2 in 152.08s, 1 test, 1 error <<< FAILURES!
[...truncated 1315 lines...]
BUILD FAILED
/usr/home/jenkins/jenkins-slave/workspace/Lucene-Solr-Tests-5.x-Java7/build.xml:524: The following error occurred while executing this line:
/usr/home/jenkins/jenkins-slave/workspace/Lucene-Solr-Tests-5.x-Java7/build.xml:472: The following error occurred while executing this line:
/usr/home/jenkins/jenkins-slave/workspace/Lucene-Solr-Tests-5.x-Java7/build.xml:61: The following error occurred while executing this line:
/usr/home/jenkins/jenkins-slave/workspace/Lucene-Solr-Tests-5.x-Java7/extra-targets.xml:39: The following error occurred while executing this line:
/usr/home/jenkins/jenkins-slave/workspace/Lucene-Solr-Tests-5.x-Java7/solr/build.xml:189: The following error occurred while executing this line:
/usr/home/jenkins/jenkins-slave/workspace/Lucene-Solr-Tests-5.x-Java7/solr/common-build.xml:496: The following error occurred while executing this line:
/usr/home/jenkins/jenkins-slave/workspace/Lucene-Solr-Tests-5.x-Java7/lucene/common-build.xml:1360: The following error occurred while executing this line:
/usr/home/jenkins/jenkins-slave/workspace/Lucene-Solr-Tests-5.x-Java7/lucene/common-build.xml:962: There were test failures: 431 suites, 1778 tests, 1 error, 59 ignored (24 assumptions)
Total time: 53 minutes 49 seconds
Build step 'Invoke Ant' marked build as failure
Archiving artifacts
Sending artifact delta relative to Lucene-Solr-Tests-5.x-Java7 #2144
Archived 5 artifacts
Archive block size is 32768
Received 0 blocks and 163681255 bytes
Compression is 0.0%
Took 29 sec
Recording test results
Email was triggered for: Failure
Sending email for trigger: Failure