You are viewing a plain text version of this content. The canonical link for it is here.
Posted to dev@poi.apache.org by Apache Jenkins Server <je...@builds.apache.org> on 2016/04/10 16:41:24 UTC
Build failed in Jenkins: POI #1234
See <https://builds.apache.org/job/POI/1234/changes>
Changes:
[onealj] bug 52949: prepare for adding DOC/DOCM and PPT/PPTM test cases
[onealj] bug 52949: add junit test for RLEDecompressingInputStream
[onealj] svn propset svn:eol-style native
[nick] Republish javadocs
[nick] Javadoc tweaks
[nick] Make the extractor exactly that, powered by the reader #52949
[nick] Unit test for VBA macro reading #52949
------------------------------------------
Started by an SCM change
[EnvInject] - Loading node environment variables.
Building remotely on ubuntu-6 (docker Ubuntu ubuntu yahoo-not-h2) in workspace <https://builds.apache.org/job/POI/ws/>
Updating http://svn.apache.org/repos/asf/poi/trunk at revision '2016-04-10T14:40:00.169 +0000'
AU test-data/spreadsheet/SimpleMacro.vba
AU test-data/spreadsheet/SimpleMacro.xls
AU test-data/spreadsheet/SimpleMacro.xlsm
AU src/testcases/org/apache/poi/util/TestRLEDecompressingInputStream.java
U src/testcases/org/apache/poi/poifs/AllPOIFSTests.java
A src/testcases/org/apache/poi/poifs/macros
A src/testcases/org/apache/poi/poifs/macros/TestVBAMacroReader.java
U src/java/org/apache/poi/util/IOUtils.java
UU src/java/org/apache/poi/util/RLEDecompressingInputStream.java
U src/java/org/apache/poi/poifs/filesystem/POIFSDocumentPath.java
U src/java/org/apache/poi/poifs/macros/VBAMacroReader.java
U src/java/org/apache/poi/poifs/macros/VBAMacroExtractor.java
U src/java/org/apache/poi/poifs/eventfilesystem/POIFSReader.java
U src/java/org/apache/poi/poifs/eventfilesystem/POIFSReaderEvent.java
Fetching 'https://svn.apache.org/repos/asf/poi/site/forrest.properties' at -1 into '<https://builds.apache.org/job/POI/ws/forrest.properties'>
At revision 1738438
Fetching 'https://svn.apache.org/repos/asf/poi/site/src/documentation' at -1 into '<https://builds.apache.org/job/POI/ws/src/documentation'>
U src/documentation/content/xdocs/status.xml
At revision 1738438
At revision 1738438
no change for http://svn.apache.org/repos/asf/poi/site/forrest.properties since the previous build
[EnvInject] - Executing scripts and injecting environment variables after the SCM step.
[EnvInject] - Injecting as environment variables the properties content
LANG=en_US.UTF-8
[EnvInject] - Variables injected successfully.
[POI] $ /bin/bash -xe /tmp/hudson5956586237352393133.sh
+ svn status
X forrest.properties
X src/documentation
Performing status on external item at 'src/documentation':
+ exit 0
[POI] $ /home/jenkins/tools/ant/latest/bin/ant -Dcoverage.enabled=true clean jenkins
Buildfile: <https://builds.apache.org/job/POI/ws/build.xml>
clean:
[delete] Deleting directory <https://builds.apache.org/job/POI/ws/build>
check-jars:
fetch-jars:
check-ooxml-jars:
fetch-ooxml-jars:
init:
[mkdir] Created dir: <https://builds.apache.org/job/POI/ws/build>
[mkdir] Created dir: <https://builds.apache.org/job/POI/ws/build/classes>
[mkdir] Created dir: <https://builds.apache.org/job/POI/ws/build/test-classes>
[mkdir] Created dir: <https://builds.apache.org/job/POI/ws/build/test-results>
[mkdir] Created dir: <https://builds.apache.org/job/POI/ws/build/scratchpad-classes>
[mkdir] Created dir: <https://builds.apache.org/job/POI/ws/build/scratchpad-test-classes>
[mkdir] Created dir: <https://builds.apache.org/job/POI/ws/build/scratchpad-test-results>
[mkdir] Created dir: <https://builds.apache.org/job/POI/ws/build/geometry-java>
[mkdir] Created dir: <https://builds.apache.org/job/POI/ws/build/ooxml-classes>
[mkdir] Created dir: <https://builds.apache.org/job/POI/ws/build/ooxml-test-classes>
[mkdir] Created dir: <https://builds.apache.org/job/POI/ws/build/ooxml-test-results>
[mkdir] Created dir: <https://builds.apache.org/job/POI/ws/build/excelant-classes>
[mkdir] Created dir: <https://builds.apache.org/job/POI/ws/build/excelant-test-classes>
[mkdir] Created dir: <https://builds.apache.org/job/POI/ws/build/excelant-test-results>
[mkdir] Created dir: <https://builds.apache.org/job/POI/ws/build/examples-classes>
[mkdir] Created dir: <https://builds.apache.org/job/POI/ws/build/integration-test-classes>
[mkdir] Created dir: <https://builds.apache.org/job/POI/1234/artifact/build/integration-test-results>
[mkdir] Created dir: <https://builds.apache.org/job/POI/ws/build/dist>
[mkdir] Created dir: <https://builds.apache.org/job/POI/ws/build/tmp/site/build/site>
[echo] Using Java: 1.6.0_45/1.6.0_45-b06/20.45-b01/Java HotSpot(TM) Server VM from Sun Microsystems Inc. on Linux: 3.13.0-36-lowlatency
compile-main:
[javac] Compiling 1194 source files to <https://builds.apache.org/job/POI/ws/build/classes>
[javac] Note: Some input files use or override a deprecated API.
[javac] Note: Recompile with -Xlint:deprecation for details.
[javac] Note: <https://builds.apache.org/job/POI/ws/src/java/org/apache/poi/hpsf/CustomProperties.java> uses unchecked or unsafe operations.
[javac] Note: Recompile with -Xlint:unchecked for details.
[javac] Compiling 522 source files to <https://builds.apache.org/job/POI/ws/build/test-classes>
[javac] <https://builds.apache.org/job/POI/ws/src/testcases/org/apache/poi/poifs/macros/TestVBAMacroReader.java>:90: 'try' without 'catch' or 'finally'
[javac] try {
[javac] ^
[javac] 1 error
BUILD FAILED
<https://builds.apache.org/job/POI/ws/build.xml>:856: Compile failed; see the compiler error output for details.
Total time: 25 seconds
Build step 'Invoke Ant' marked build as failure
[FINDBUGS] Skipping publisher since build result is FAILURE
[WARNINGS] Skipping publisher since build result is FAILURE
Archiving artifacts
Compressed 66.84 MB of artifacts by 64.8% relative to #1231
Recording test results
ERROR: Step ?Publish JUnit test result report? failed: No test report files were found. Configuration error?
---------------------------------------------------------------------
To unsubscribe, e-mail: dev-unsubscribe@poi.apache.org
For additional commands, e-mail: dev-help@poi.apache.org
Build failed in Jenkins: POI #1237
Posted by Apache Jenkins Server <je...@builds.apache.org>.
See <https://builds.apache.org/job/POI/1237/changes>
Changes:
[onealj] add @NotImplemented annotation to methods that are not implemented
------------------------------------------
[...truncated 2696 lines...]
[javadoc] Loading source files for package org.apache.poi.ss.formula.function...
[javadoc] Loading source files for package org.apache.poi.ss.formula.functions...
[javadoc] Loading source files for package org.apache.poi.ss.formula.ptg...
[javadoc] Loading source files for package org.apache.poi.ss.formula.udf...
[javadoc] Loading source files for package org.apache.poi.ss.usermodel...
[javadoc] Loading source files for package org.apache.poi.ss.usermodel.charts...
[javadoc] Loading source files for package org.apache.poi.ss.util...
[javadoc] Loading source files for package org.apache.poi.ss.util.cellwalk...
[javadoc] Loading source files for package org.apache.poi.util...
[javadoc] Loading source files for package org.apache.poi.wp.usermodel...
[javadoc] Loading source files for package org.apache.poi.hdgf...
[javadoc] Loading source files for package org.apache.poi.hdgf.chunks...
[javadoc] Loading source files for package org.apache.poi.hdgf.dev...
[javadoc] Loading source files for package org.apache.poi.hdgf.exceptions...
[javadoc] Loading source files for package org.apache.poi.hdgf.extractor...
[javadoc] Loading source files for package org.apache.poi.hdgf.pointers...
[javadoc] Loading source files for package org.apache.poi.hdgf.streams...
[javadoc] Loading source files for package org.apache.poi.hmef...
[javadoc] Loading source files for package org.apache.poi.hmef.attribute...
[javadoc] Loading source files for package org.apache.poi.hmef.dev...
[javadoc] Loading source files for package org.apache.poi.hmef.extractor...
[javadoc] Loading source files for package org.apache.poi.hpbf...
[javadoc] Loading source files for package org.apache.poi.hpbf.dev...
[javadoc] Loading source files for package org.apache.poi.hpbf.extractor...
[javadoc] Loading source files for package org.apache.poi.hpbf.model...
[javadoc] Loading source files for package org.apache.poi.hpbf.model.qcbits...
[javadoc] Loading source files for package org.apache.poi.hslf.blip...
[javadoc] Loading source files for package org.apache.poi.hslf.dev...
[javadoc] Loading source files for package org.apache.poi.hslf.exceptions...
[javadoc] Loading source files for package org.apache.poi.hslf.extractor...
[javadoc] Loading source files for package org.apache.poi.hslf.model...
[javadoc] Loading source files for package org.apache.poi.hslf.model.textproperties...
[javadoc] Loading source files for package org.apache.poi.hslf.record...
[javadoc] Loading source files for package org.apache.poi.hslf.usermodel...
[javadoc] Loading source files for package org.apache.poi.hslf.util...
[javadoc] Loading source files for package org.apache.poi.hsmf...
[javadoc] Loading source files for package org.apache.poi.hsmf.datatypes...
[javadoc] Loading source files for package org.apache.poi.hsmf.dev...
[javadoc] Loading source files for package org.apache.poi.hsmf.exceptions...
[javadoc] Loading source files for package org.apache.poi.hsmf.extractor...
[javadoc] Loading source files for package org.apache.poi.hsmf.parsers...
[javadoc] Loading source files for package org.apache.poi.hssf.converter...
[javadoc] Loading source files for package org.apache.poi.hwmf.draw...
[javadoc] Loading source files for package org.apache.poi.hwmf.record...
[javadoc] Loading source files for package org.apache.poi.hwmf.usermodel...
[javadoc] Loading source files for package org.apache.poi.hwpf...
[javadoc] Loading source files for package org.apache.poi.hwpf.converter...
[javadoc] Loading source files for package org.apache.poi.hwpf.dev...
[javadoc] Loading source files for package org.apache.poi.hwpf.extractor...
[javadoc] Loading source files for package org.apache.poi.hwpf.model...
[javadoc] Loading source files for package org.apache.poi.hwpf.model.io...
[javadoc] Loading source files for package org.apache.poi.hwpf.model.types...
[javadoc] Loading source files for package org.apache.poi.hwpf.sprm...
[javadoc] Loading source files for package org.apache.poi.hwpf.usermodel...
[javadoc] Loading source files for package org.apache.poi.extractor...
[javadoc] Loading source files for package org.apache.poi.openxml4j.exceptions...
[javadoc] Loading source files for package org.apache.poi.openxml4j.opc...
[javadoc] Loading source files for package org.apache.poi.openxml4j.opc.internal...
[javadoc] Loading source files for package org.apache.poi.openxml4j.opc.internal.marshallers...
[javadoc] Loading source files for package org.apache.poi.openxml4j.opc.internal.unmarshallers...
[javadoc] Loading source files for package org.apache.poi.openxml4j.util...
[javadoc] Loading source files for package org.apache.poi.poifs.crypt.agile...
[javadoc] Loading source files for package org.apache.poi.poifs.crypt.dsig...
[javadoc] Loading source files for package org.apache.poi.poifs.crypt.dsig.facets...
[javadoc] Loading source files for package org.apache.poi.poifs.crypt.dsig.services...
[javadoc] Loading source files for package org.apache.poi.xdgf.exceptions...
[javadoc] Loading source files for package org.apache.poi.xdgf.extractor...
[javadoc] Loading source files for package org.apache.poi.xdgf.geom...
[javadoc] Loading source files for package org.apache.poi.xdgf.usermodel...
[javadoc] Loading source files for package org.apache.poi.xdgf.usermodel.section...
[javadoc] Loading source files for package org.apache.poi.xdgf.usermodel.section.geometry...
[javadoc] Loading source files for package org.apache.poi.xdgf.usermodel.shape...
[javadoc] Loading source files for package org.apache.poi.xdgf.usermodel.shape.exceptions...
[javadoc] Loading source files for package org.apache.poi.xdgf.util...
[javadoc] Loading source files for package org.apache.poi.xdgf.xml...
[javadoc] Loading source files for package org.apache.poi.xslf.extractor...
[javadoc] Loading source files for package org.apache.poi.xslf.model...
[javadoc] Loading source files for package org.apache.poi.xslf.usermodel...
[javadoc] Loading source files for package org.apache.poi.xslf.util...
[javadoc] Loading source files for package org.apache.poi.xssf...
[javadoc] Loading source files for package org.apache.poi.xssf.dev...
[javadoc] Loading source files for package org.apache.poi.xssf.eventusermodel...
[javadoc] Loading source files for package org.apache.poi.xssf.extractor...
[javadoc] Loading source files for package org.apache.poi.xssf.model...
[javadoc] Loading source files for package org.apache.poi.xssf.streaming...
[javadoc] Loading source files for package org.apache.poi.xssf.usermodel...
[javadoc] Loading source files for package org.apache.poi.xssf.usermodel.charts...
[javadoc] Loading source files for package org.apache.poi.xssf.usermodel.extensions...
[javadoc] Loading source files for package org.apache.poi.xssf.usermodel.helpers...
[javadoc] Loading source files for package org.apache.poi.xssf.util...
[javadoc] Loading source files for package org.apache.poi.xwpf.extractor...
[javadoc] Loading source files for package org.apache.poi.xwpf.model...
[javadoc] Loading source files for package org.apache.poi.xwpf.usermodel...
[javadoc] Constructing Javadoc information...
[javadoc] Standard Doclet version 1.6.0_45
[javadoc] Building tree for all the packages and classes...
[javadoc] <https://builds.apache.org/job/POI/ws/src/java/org/apache/poi/util/RLEDecompressingInputStream.java>:244: warning - @return tag has no arguments.
[javadoc] <https://builds.apache.org/job/POI/ws/src/java/org/apache/poi/util/RLEDecompressingInputStream.java>:234: warning - @return tag has no arguments.
[javadoc] Building index for all the packages and classes...
[javadoc] Building index for all classes...
[javadoc] Generating <https://builds.apache.org/job/POI/ws/build/tmp/site/build/site/apidocs/stylesheet.css...>
[javadoc] 2 warnings
[javadoc] Patched 1 link injection vulnerable javadocs
jar-src:
[jar] Building jar: <https://builds.apache.org/job/POI/ws/build/dist/maven/poi/poi-3.15-beta2-sources.jar>
[jar] Building jar: <https://builds.apache.org/job/POI/ws/build/dist/maven/poi-scratchpad/poi-scratchpad-3.15-beta2-sources.jar>
[jar] Building jar: <https://builds.apache.org/job/POI/ws/build/dist/maven/poi-ooxml/poi-ooxml-3.15-beta2-sources.jar>
[jar] Building jar: <https://builds.apache.org/job/POI/ws/build/dist/maven/poi-examples/poi-examples-3.15-beta2-sources.jar>
[jar] Building jar: <https://builds.apache.org/job/POI/ws/build/dist/maven/poi-excelant/poi-excelant-3.15-beta2-sources.jar>
-do-jar-check-javadocs-package-list:
-do-jar-create-javadocs-package-list:
jar-javadocs:
[echo] Building poi javadocs from <https://builds.apache.org/job/POI/ws/src/java>
[mkdir] Created dir: <https://builds.apache.org/job/POI/ws/build/tmp/maven-javadocs>
[javadoc] Generating Javadoc
[javadoc] Javadoc execution
[javadoc] <https://builds.apache.org/job/POI/ws/src/java/org/apache/poi/util/RLEDecompressingInputStream.java>:244: warning - @return tag has no arguments.
[javadoc] <https://builds.apache.org/job/POI/ws/src/java/org/apache/poi/util/RLEDecompressingInputStream.java>:234: warning - @return tag has no arguments.
[javadoc] 2 warnings
[javadoc] Patched 1 link injection vulnerable javadocs
[jar] Building jar: <https://builds.apache.org/job/POI/ws/build/dist/maven/poi/poi-3.15-beta2-javadoc.jar>
[echo] Building poi-scratchpad javadocs from <https://builds.apache.org/job/POI/ws/src/scratchpad/src>
[delete] Deleting directory <https://builds.apache.org/job/POI/ws/build/tmp/maven-javadocs>
[mkdir] Created dir: <https://builds.apache.org/job/POI/ws/build/tmp/maven-javadocs>
[javadoc] Generating Javadoc
[javadoc] Javadoc execution
[javadoc] Patched 1 link injection vulnerable javadocs
[jar] Building jar: <https://builds.apache.org/job/POI/ws/build/dist/maven/poi-scratchpad/poi-scratchpad-3.15-beta2-javadoc.jar>
[echo] Building poi-ooxml javadocs from <https://builds.apache.org/job/POI/ws/src/ooxml/java>
[delete] Deleting directory <https://builds.apache.org/job/POI/ws/build/tmp/maven-javadocs>
[mkdir] Created dir: <https://builds.apache.org/job/POI/ws/build/tmp/maven-javadocs>
[javadoc] Generating Javadoc
[javadoc] Javadoc execution
[javadoc] Patched 1 link injection vulnerable javadocs
[jar] Building jar: <https://builds.apache.org/job/POI/ws/build/dist/maven/poi-ooxml/poi-ooxml-3.15-beta2-javadoc.jar>
assemble:
[zip] Building zip: <https://builds.apache.org/job/POI/ws/build/dist/poi-bin-3.15-beta2-20160410.zip>
[tar] Building tar: <https://builds.apache.org/job/POI/1237/artifact/build/dist/poi-bin-3.15-beta2-20160410.tar.gz>
[zip] Building zip: <https://builds.apache.org/job/POI/ws/build/dist/poi-src-3.15-beta2-20160410.zip>
[tar] Building tar: <https://builds.apache.org/job/POI/1237/artifact/build/dist/poi-src-3.15-beta2-20160410.tar.gz>
[echo] Creating Maven POMs
maven-poms:
[copy] Copying 6 files to <https://builds.apache.org/job/POI/ws/build/dist/maven>
[echo] Maven POMs are located in <https://builds.apache.org/job/POI/ws/build/dist>
[echo] Use ant dist-nexus to deploy the artifacts in the remote repository
[echo] Distribution located in <https://builds.apache.org/job/POI/ws/build/dist>
[echo] Use "ant dist-checksum" to create md5/sha1 checksums and GPG signatures
findbugs:
[get] Getting: http://prdownloads.sourceforge.net/findbugs/findbugs-noUpdateChecks-2.0.3.zip?download
[get] To: <https://builds.apache.org/job/POI/ws/lib/findbugs-noUpdateChecks-2.0.3.zip>
[get] http://prdownloads.sourceforge.net/findbugs/findbugs-noUpdateChecks-2.0.3.zip?download permanently moved to http://downloads.sourceforge.net/project/findbugs/findbugs/2.0.3/findbugs-noUpdateChecks-2.0.3.zip?download=
[get] http://downloads.sourceforge.net/project/findbugs/findbugs/2.0.3/findbugs-noUpdateChecks-2.0.3.zip?download= moved to http://heanet.dl.sourceforge.net/project/findbugs/findbugs/2.0.3/findbugs-noUpdateChecks-2.0.3.zip
[unzip] Expanding: <https://builds.apache.org/job/POI/ws/lib/findbugs-noUpdateChecks-2.0.3.zip> into <https://builds.apache.org/job/POI/ws/build/findbugs/lib>
[findbugs] Executing findbugs FindBugsTask from ant task
[findbugs] Running FindBugs...
[findbugs] Warnings generated: 105
[findbugs] Calculating exit code...
[findbugs] Setting 'bugs found' flag (1)
[findbugs] Exit code set to: 1
[findbugs] Java Result: 1
[findbugs] Output saved to build/findbugs.html
[findbugs] Executing findbugs FindBugsTask from ant task
[findbugs] Running FindBugs...
[findbugs] Warnings generated: 105
[findbugs] Calculating exit code...
[findbugs] Setting 'bugs found' flag (1)
[findbugs] Exit code set to: 1
[findbugs] Java Result: 1
[findbugs] Output saved to build/findbugs.xml
release-notes:
[copy] Copying 1 file to <https://builds.apache.org/job/POI/ws/build/dist>
rat-check:
[mkdir] Created dir: <https://builds.apache.org/job/POI/ws/build/rat>
[echo]
[echo] *****************************************************
[echo] Summary
[echo] -------
[echo] Generated at: 2016-04-10T23:52:53+00:00
[echo] Notes: 1
[echo] Binaries: 122
[echo] Archives: 0
[echo] Standards: 3468
[echo]
[echo] Apache Licensed: 3468
[echo] Generated Documents: 0
[echo]
[echo] JavaDocs are generated and so license header is optional
[echo] Generated files do not required license headers
[echo]
[echo] 0 Unknown Licenses
[echo]
[echo] *******************************
[echo]
[echo] Unapproved licenses:
[echo]
[echo]
[echo] *******************************
[echo]
[echo] Archives:
[echo]
[echo] *****************************************************
[echo] Files with Apache License headers will be marked AL
[echo] Binary files (which do not require AL headers) will be marked B
[echo] Compressed archives will be marked A
[echo] Notices, licenses etc will be marked N
[echo]
[echo] *****************************************************
forbidden-apis-check:
[forbiddenapis] Reading bundled API signatures: jdk-unsafe-1.6
[forbiddenapis] Reading bundled API signatures: jdk-deprecated-1.6
[forbiddenapis] Reading API signatures: <https://builds.apache.org/job/POI/ws/src/resources/devtools/forbidden-signatures.txt>
[forbiddenapis] WARNING: Class 'java.nio.file.Files' not found on classpath while parsing signature: java.nio.file.Files#createTempDirectory(java.lang.String,java.nio.file.attribute.FileAttribute[]) [signature ignored]
[forbiddenapis] WARNING: Class 'java.nio.file.Files' not found on classpath while parsing signature: java.nio.file.Files#createTempFile(java.lang.String,java.lang.String,java.nio.file.attribute.FileAttribute[]) [signature ignored]
[forbiddenapis] WARNING: Class 'java.nio.file.Files' not found on classpath while parsing signature: java.nio.file.Files#createTempDirectory(java.lang.String,java.nio.file.attribute.FileAttribute[]) [signature ignored]
[forbiddenapis] WARNING: Class 'java.nio.file.Files' not found on classpath while parsing signature: java.nio.file.Files#createTempFile(java.lang.String,java.lang.String,java.nio.file.attribute.FileAttribute[]) [signature ignored]
[forbiddenapis] Loading classes to check...
[forbiddenapis] Scanning classes for violations...
[forbiddenapis] Forbidden method invocation: java.lang.String#getBytes() [Uses default charset]
[forbiddenapis] in org.apache.poi.util.TestRLEDecompressingInputStream (TestRLEDecompressingInputStream.java:145)
[forbiddenapis] Forbidden method invocation: java.io.ByteArrayOutputStream#toString() [Uses default charset]
[forbiddenapis] in org.apache.poi.util.TestRLEDecompressingInputStream (TestRLEDecompressingInputStream.java:164)
[forbiddenapis] Forbidden method invocation: java.lang.String#format(java.lang.String,java.lang.Object[]) [Uses default locale]
[forbiddenapis] in org.apache.poi.util.RLEDecompressingInputStream (RLEDecompressingInputStream.java:77)
[forbiddenapis] Forbidden method invocation: java.lang.String#format(java.lang.String,java.lang.Object[]) [Uses default locale]
[forbiddenapis] in org.apache.poi.util.RLEDecompressingInputStream (RLEDecompressingInputStream.java:162)
[forbiddenapis] Forbidden method invocation: java.lang.String#format(java.lang.String,java.lang.Object[]) [Uses default locale]
[forbiddenapis] in org.apache.poi.util.RLEDecompressingInputStream (RLEDecompressingInputStream.java:167)
[forbiddenapis] Scanned 3781 (and 1636 related) class file(s) for forbidden API invocations (in 11.09s), 5 error(s).
BUILD FAILED
<https://builds.apache.org/job/POI/ws/build.xml>:1824: Check for forbidden API calls failed, see log.
Total time: 78 minutes 30 seconds
Build step 'Invoke Ant' marked build as failure
[FINDBUGS] Skipping publisher since build result is FAILURE
[WARNINGS] Skipping publisher since build result is FAILURE
Archiving artifacts
Compressed 201.98 MB of artifacts by 43.9% relative to #1231
Recording test results
---------------------------------------------------------------------
To unsubscribe, e-mail: dev-unsubscribe@poi.apache.org
For additional commands, e-mail: dev-help@poi.apache.org
Build failed in Jenkins: POI #1236
Posted by Apache Jenkins Server <je...@builds.apache.org>.
See <https://builds.apache.org/job/POI/1236/changes>
Changes:
[onealj] ignore VBA source files in integration test
------------------------------------------
[...truncated 2685 lines...]
[javadoc] Loading source files for package org.apache.poi.ss.formula.function...
[javadoc] Loading source files for package org.apache.poi.ss.formula.functions...
[javadoc] Loading source files for package org.apache.poi.ss.formula.ptg...
[javadoc] Loading source files for package org.apache.poi.ss.formula.udf...
[javadoc] Loading source files for package org.apache.poi.ss.usermodel...
[javadoc] Loading source files for package org.apache.poi.ss.usermodel.charts...
[javadoc] Loading source files for package org.apache.poi.ss.util...
[javadoc] Loading source files for package org.apache.poi.ss.util.cellwalk...
[javadoc] Loading source files for package org.apache.poi.util...
[javadoc] Loading source files for package org.apache.poi.wp.usermodel...
[javadoc] Loading source files for package org.apache.poi.hdgf...
[javadoc] Loading source files for package org.apache.poi.hdgf.chunks...
[javadoc] Loading source files for package org.apache.poi.hdgf.dev...
[javadoc] Loading source files for package org.apache.poi.hdgf.exceptions...
[javadoc] Loading source files for package org.apache.poi.hdgf.extractor...
[javadoc] Loading source files for package org.apache.poi.hdgf.pointers...
[javadoc] Loading source files for package org.apache.poi.hdgf.streams...
[javadoc] Loading source files for package org.apache.poi.hmef...
[javadoc] Loading source files for package org.apache.poi.hmef.attribute...
[javadoc] Loading source files for package org.apache.poi.hmef.dev...
[javadoc] Loading source files for package org.apache.poi.hmef.extractor...
[javadoc] Loading source files for package org.apache.poi.hpbf...
[javadoc] Loading source files for package org.apache.poi.hpbf.dev...
[javadoc] Loading source files for package org.apache.poi.hpbf.extractor...
[javadoc] Loading source files for package org.apache.poi.hpbf.model...
[javadoc] Loading source files for package org.apache.poi.hpbf.model.qcbits...
[javadoc] Loading source files for package org.apache.poi.hslf.blip...
[javadoc] Loading source files for package org.apache.poi.hslf.dev...
[javadoc] Loading source files for package org.apache.poi.hslf.exceptions...
[javadoc] Loading source files for package org.apache.poi.hslf.extractor...
[javadoc] Loading source files for package org.apache.poi.hslf.model...
[javadoc] Loading source files for package org.apache.poi.hslf.model.textproperties...
[javadoc] Loading source files for package org.apache.poi.hslf.record...
[javadoc] Loading source files for package org.apache.poi.hslf.usermodel...
[javadoc] Loading source files for package org.apache.poi.hslf.util...
[javadoc] Loading source files for package org.apache.poi.hsmf...
[javadoc] Loading source files for package org.apache.poi.hsmf.datatypes...
[javadoc] Loading source files for package org.apache.poi.hsmf.dev...
[javadoc] Loading source files for package org.apache.poi.hsmf.exceptions...
[javadoc] Loading source files for package org.apache.poi.hsmf.extractor...
[javadoc] Loading source files for package org.apache.poi.hsmf.parsers...
[javadoc] Loading source files for package org.apache.poi.hssf.converter...
[javadoc] Loading source files for package org.apache.poi.hwmf.draw...
[javadoc] Loading source files for package org.apache.poi.hwmf.record...
[javadoc] Loading source files for package org.apache.poi.hwmf.usermodel...
[javadoc] Loading source files for package org.apache.poi.hwpf...
[javadoc] Loading source files for package org.apache.poi.hwpf.converter...
[javadoc] Loading source files for package org.apache.poi.hwpf.dev...
[javadoc] Loading source files for package org.apache.poi.hwpf.extractor...
[javadoc] Loading source files for package org.apache.poi.hwpf.model...
[javadoc] Loading source files for package org.apache.poi.hwpf.model.io...
[javadoc] Loading source files for package org.apache.poi.hwpf.model.types...
[javadoc] Loading source files for package org.apache.poi.hwpf.sprm...
[javadoc] Loading source files for package org.apache.poi.hwpf.usermodel...
[javadoc] Loading source files for package org.apache.poi.extractor...
[javadoc] Loading source files for package org.apache.poi.openxml4j.exceptions...
[javadoc] Loading source files for package org.apache.poi.openxml4j.opc...
[javadoc] Loading source files for package org.apache.poi.openxml4j.opc.internal...
[javadoc] Loading source files for package org.apache.poi.openxml4j.opc.internal.marshallers...
[javadoc] Loading source files for package org.apache.poi.openxml4j.opc.internal.unmarshallers...
[javadoc] Loading source files for package org.apache.poi.openxml4j.util...
[javadoc] Loading source files for package org.apache.poi.poifs.crypt.agile...
[javadoc] Loading source files for package org.apache.poi.poifs.crypt.dsig...
[javadoc] Loading source files for package org.apache.poi.poifs.crypt.dsig.facets...
[javadoc] Loading source files for package org.apache.poi.poifs.crypt.dsig.services...
[javadoc] Loading source files for package org.apache.poi.xdgf.exceptions...
[javadoc] Loading source files for package org.apache.poi.xdgf.extractor...
[javadoc] Loading source files for package org.apache.poi.xdgf.geom...
[javadoc] Loading source files for package org.apache.poi.xdgf.usermodel...
[javadoc] Loading source files for package org.apache.poi.xdgf.usermodel.section...
[javadoc] Loading source files for package org.apache.poi.xdgf.usermodel.section.geometry...
[javadoc] Loading source files for package org.apache.poi.xdgf.usermodel.shape...
[javadoc] Loading source files for package org.apache.poi.xdgf.usermodel.shape.exceptions...
[javadoc] Loading source files for package org.apache.poi.xdgf.util...
[javadoc] Loading source files for package org.apache.poi.xdgf.xml...
[javadoc] Loading source files for package org.apache.poi.xslf.extractor...
[javadoc] Loading source files for package org.apache.poi.xslf.model...
[javadoc] Loading source files for package org.apache.poi.xslf.usermodel...
[javadoc] Loading source files for package org.apache.poi.xslf.util...
[javadoc] Loading source files for package org.apache.poi.xssf...
[javadoc] Loading source files for package org.apache.poi.xssf.dev...
[javadoc] Loading source files for package org.apache.poi.xssf.eventusermodel...
[javadoc] Loading source files for package org.apache.poi.xssf.extractor...
[javadoc] Loading source files for package org.apache.poi.xssf.model...
[javadoc] Loading source files for package org.apache.poi.xssf.streaming...
[javadoc] Loading source files for package org.apache.poi.xssf.usermodel...
[javadoc] Loading source files for package org.apache.poi.xssf.usermodel.charts...
[javadoc] Loading source files for package org.apache.poi.xssf.usermodel.extensions...
[javadoc] Loading source files for package org.apache.poi.xssf.usermodel.helpers...
[javadoc] Loading source files for package org.apache.poi.xssf.util...
[javadoc] Loading source files for package org.apache.poi.xwpf.extractor...
[javadoc] Loading source files for package org.apache.poi.xwpf.model...
[javadoc] Loading source files for package org.apache.poi.xwpf.usermodel...
[javadoc] Constructing Javadoc information...
[javadoc] Standard Doclet version 1.6.0_45
[javadoc] Building tree for all the packages and classes...
[javadoc] <https://builds.apache.org/job/POI/ws/src/java/org/apache/poi/util/RLEDecompressingInputStream.java>:244: warning - @return tag has no arguments.
[javadoc] <https://builds.apache.org/job/POI/ws/src/java/org/apache/poi/util/RLEDecompressingInputStream.java>:234: warning - @return tag has no arguments.
[javadoc] Building index for all the packages and classes...
[javadoc] Building index for all classes...
[javadoc] Generating <https://builds.apache.org/job/POI/ws/build/tmp/site/build/site/apidocs/stylesheet.css...>
[javadoc] 2 warnings
[javadoc] Patched 1 link injection vulnerable javadocs
jar-src:
[jar] Building jar: <https://builds.apache.org/job/POI/ws/build/dist/maven/poi/poi-3.15-beta2-sources.jar>
[jar] Building jar: <https://builds.apache.org/job/POI/ws/build/dist/maven/poi-scratchpad/poi-scratchpad-3.15-beta2-sources.jar>
[jar] Building jar: <https://builds.apache.org/job/POI/ws/build/dist/maven/poi-ooxml/poi-ooxml-3.15-beta2-sources.jar>
[jar] Building jar: <https://builds.apache.org/job/POI/ws/build/dist/maven/poi-examples/poi-examples-3.15-beta2-sources.jar>
[jar] Building jar: <https://builds.apache.org/job/POI/ws/build/dist/maven/poi-excelant/poi-excelant-3.15-beta2-sources.jar>
-do-jar-check-javadocs-package-list:
-do-jar-create-javadocs-package-list:
jar-javadocs:
[echo] Building poi javadocs from <https://builds.apache.org/job/POI/ws/src/java>
[mkdir] Created dir: <https://builds.apache.org/job/POI/ws/build/tmp/maven-javadocs>
[javadoc] Generating Javadoc
[javadoc] Javadoc execution
[javadoc] <https://builds.apache.org/job/POI/ws/src/java/org/apache/poi/util/RLEDecompressingInputStream.java>:244: warning - @return tag has no arguments.
[javadoc] <https://builds.apache.org/job/POI/ws/src/java/org/apache/poi/util/RLEDecompressingInputStream.java>:234: warning - @return tag has no arguments.
[javadoc] 2 warnings
[javadoc] Patched 1 link injection vulnerable javadocs
[jar] Building jar: <https://builds.apache.org/job/POI/ws/build/dist/maven/poi/poi-3.15-beta2-javadoc.jar>
[echo] Building poi-scratchpad javadocs from <https://builds.apache.org/job/POI/ws/src/scratchpad/src>
[delete] Deleting directory <https://builds.apache.org/job/POI/ws/build/tmp/maven-javadocs>
[mkdir] Created dir: <https://builds.apache.org/job/POI/ws/build/tmp/maven-javadocs>
[javadoc] Generating Javadoc
[javadoc] Javadoc execution
[javadoc] Patched 1 link injection vulnerable javadocs
[jar] Building jar: <https://builds.apache.org/job/POI/ws/build/dist/maven/poi-scratchpad/poi-scratchpad-3.15-beta2-javadoc.jar>
[echo] Building poi-ooxml javadocs from <https://builds.apache.org/job/POI/ws/src/ooxml/java>
[delete] Deleting directory <https://builds.apache.org/job/POI/ws/build/tmp/maven-javadocs>
[mkdir] Created dir: <https://builds.apache.org/job/POI/ws/build/tmp/maven-javadocs>
[javadoc] Generating Javadoc
[javadoc] Javadoc execution
[javadoc] Patched 1 link injection vulnerable javadocs
[jar] Building jar: <https://builds.apache.org/job/POI/ws/build/dist/maven/poi-ooxml/poi-ooxml-3.15-beta2-javadoc.jar>
assemble:
[zip] Building zip: <https://builds.apache.org/job/POI/ws/build/dist/poi-bin-3.15-beta2-20160410.zip>
[tar] Building tar: <https://builds.apache.org/job/POI/1236/artifact/build/dist/poi-bin-3.15-beta2-20160410.tar.gz>
[zip] Building zip: <https://builds.apache.org/job/POI/ws/build/dist/poi-src-3.15-beta2-20160410.zip>
[tar] Building tar: <https://builds.apache.org/job/POI/1236/artifact/build/dist/poi-src-3.15-beta2-20160410.tar.gz>
[echo] Creating Maven POMs
maven-poms:
[copy] Copying 6 files to <https://builds.apache.org/job/POI/ws/build/dist/maven>
[echo] Maven POMs are located in <https://builds.apache.org/job/POI/ws/build/dist>
[echo] Use ant dist-nexus to deploy the artifacts in the remote repository
[echo] Distribution located in <https://builds.apache.org/job/POI/ws/build/dist>
[echo] Use "ant dist-checksum" to create md5/sha1 checksums and GPG signatures
findbugs:
[get] Getting: http://prdownloads.sourceforge.net/findbugs/findbugs-noUpdateChecks-2.0.3.zip?download
[get] To: <https://builds.apache.org/job/POI/ws/lib/findbugs-noUpdateChecks-2.0.3.zip>
[get] http://prdownloads.sourceforge.net/findbugs/findbugs-noUpdateChecks-2.0.3.zip?download permanently moved to http://downloads.sourceforge.net/project/findbugs/findbugs/2.0.3/findbugs-noUpdateChecks-2.0.3.zip?download=
[get] http://downloads.sourceforge.net/project/findbugs/findbugs/2.0.3/findbugs-noUpdateChecks-2.0.3.zip?download= moved to http://ufpr.dl.sourceforge.net/project/findbugs/findbugs/2.0.3/findbugs-noUpdateChecks-2.0.3.zip
[unzip] Expanding: <https://builds.apache.org/job/POI/ws/lib/findbugs-noUpdateChecks-2.0.3.zip> into <https://builds.apache.org/job/POI/ws/build/findbugs/lib>
[findbugs] Executing findbugs FindBugsTask from ant task
[findbugs] Running FindBugs...
[findbugs] Warnings generated: 105
[findbugs] Calculating exit code...
[findbugs] Setting 'bugs found' flag (1)
[findbugs] Exit code set to: 1
[findbugs] Java Result: 1
[findbugs] Output saved to build/findbugs.html
[findbugs] Executing findbugs FindBugsTask from ant task
[findbugs] Running FindBugs...
[findbugs] Warnings generated: 105
[findbugs] Calculating exit code...
[findbugs] Setting 'bugs found' flag (1)
[findbugs] Exit code set to: 1
[findbugs] Java Result: 1
[findbugs] Output saved to build/findbugs.xml
release-notes:
[copy] Copying 1 file to <https://builds.apache.org/job/POI/ws/build/dist>
rat-check:
[mkdir] Created dir: <https://builds.apache.org/job/POI/ws/build/rat>
[echo]
[echo] *****************************************************
[echo] Summary
[echo] -------
[echo] Generated at: 2016-04-10T22:04:38+00:00
[echo] Notes: 1
[echo] Binaries: 122
[echo] Archives: 0
[echo] Standards: 3468
[echo]
[echo] Apache Licensed: 3468
[echo] Generated Documents: 0
[echo]
[echo] JavaDocs are generated and so license header is optional
[echo] Generated files do not required license headers
[echo]
[echo] 0 Unknown Licenses
[echo]
[echo] *******************************
[echo]
[echo] Unapproved licenses:
[echo]
[echo]
[echo] *******************************
[echo]
[echo] Archives:
[echo]
[echo] *****************************************************
[echo] Files with Apache License headers will be marked AL
[echo] Binary files (which do not require AL headers) will be marked B
[echo] Compressed archives will be marked A
[echo] Notices, licenses etc will be marked N
[echo]
[echo] *****************************************************
forbidden-apis-check:
[forbiddenapis] Reading bundled API signatures: jdk-unsafe-1.6
[forbiddenapis] Reading bundled API signatures: jdk-deprecated-1.6
[forbiddenapis] Reading API signatures: <https://builds.apache.org/job/POI/ws/src/resources/devtools/forbidden-signatures.txt>
[forbiddenapis] WARNING: Class 'java.nio.file.Files' not found on classpath while parsing signature: java.nio.file.Files#createTempDirectory(java.lang.String,java.nio.file.attribute.FileAttribute[]) [signature ignored]
[forbiddenapis] WARNING: Class 'java.nio.file.Files' not found on classpath while parsing signature: java.nio.file.Files#createTempFile(java.lang.String,java.lang.String,java.nio.file.attribute.FileAttribute[]) [signature ignored]
[forbiddenapis] WARNING: Class 'java.nio.file.Files' not found on classpath while parsing signature: java.nio.file.Files#createTempDirectory(java.lang.String,java.nio.file.attribute.FileAttribute[]) [signature ignored]
[forbiddenapis] WARNING: Class 'java.nio.file.Files' not found on classpath while parsing signature: java.nio.file.Files#createTempFile(java.lang.String,java.lang.String,java.nio.file.attribute.FileAttribute[]) [signature ignored]
[forbiddenapis] Loading classes to check...
[forbiddenapis] Scanning classes for violations...
[forbiddenapis] Forbidden method invocation: java.lang.String#getBytes() [Uses default charset]
[forbiddenapis] in org.apache.poi.util.TestRLEDecompressingInputStream (TestRLEDecompressingInputStream.java:145)
[forbiddenapis] Forbidden method invocation: java.io.ByteArrayOutputStream#toString() [Uses default charset]
[forbiddenapis] in org.apache.poi.util.TestRLEDecompressingInputStream (TestRLEDecompressingInputStream.java:164)
[forbiddenapis] Forbidden method invocation: java.lang.String#format(java.lang.String,java.lang.Object[]) [Uses default locale]
[forbiddenapis] in org.apache.poi.util.RLEDecompressingInputStream (RLEDecompressingInputStream.java:77)
[forbiddenapis] Forbidden method invocation: java.lang.String#format(java.lang.String,java.lang.Object[]) [Uses default locale]
[forbiddenapis] in org.apache.poi.util.RLEDecompressingInputStream (RLEDecompressingInputStream.java:162)
[forbiddenapis] Forbidden method invocation: java.lang.String#format(java.lang.String,java.lang.Object[]) [Uses default locale]
[forbiddenapis] in org.apache.poi.util.RLEDecompressingInputStream (RLEDecompressingInputStream.java:167)
[forbiddenapis] Scanned 3781 (and 1636 related) class file(s) for forbidden API invocations (in 14.71s), 5 error(s).
BUILD FAILED
<https://builds.apache.org/job/POI/ws/build.xml>:1824: Check for forbidden API calls failed, see log.
Total time: 90 minutes 12 seconds
Build step 'Invoke Ant' marked build as failure
[FINDBUGS] Skipping publisher since build result is FAILURE
[WARNINGS] Skipping publisher since build result is FAILURE
Archiving artifacts
Compressed 201.98 MB of artifacts by 45.0% relative to #1231
Recording test results
---------------------------------------------------------------------
To unsubscribe, e-mail: dev-unsubscribe@poi.apache.org
For additional commands, e-mail: dev-help@poi.apache.org
Build failed in Jenkins: POI #1235
Posted by Apache Jenkins Server <je...@builds.apache.org>.
See <https://builds.apache.org/job/POI/1235/changes>
Changes:
[onealj] bug 52949: parameterize fromNPOIFS also
------------------------------------------
[...truncated 2399 lines...]
[junit] Tests run: 7, Failures: 0, Errors: 0, Skipped: 0, Time elapsed: 1.595 sec
[junit] Running org.apache.poi.xssf.extractor.TestXSSFExportToXML
[junit] Tests run: 15, Failures: 0, Errors: 0, Skipped: 0, Time elapsed: 0.984 sec
[junit] Running org.apache.poi.xssf.extractor.TestXSSFImportFromXML
[junit] Tests run: 5, Failures: 0, Errors: 0, Skipped: 0, Time elapsed: 0.432 sec
[junit] Running org.apache.poi.xssf.io.TestLoadSaveXSSF
[junit] Tests run: 3, Failures: 0, Errors: 0, Skipped: 0, Time elapsed: 0.068 sec
[junit] Running org.apache.poi.xssf.model.TestCalculationChain
[junit] Tests run: 1, Failures: 0, Errors: 0, Skipped: 0, Time elapsed: 0.95 sec
[junit] Running org.apache.poi.xssf.model.TestCommentsTable
[junit] Tests run: 7, Failures: 0, Errors: 0, Skipped: 0, Time elapsed: 0.304 sec
[junit] Running org.apache.poi.xssf.model.TestExternalLinksTable
[junit] Tests run: 4, Failures: 0, Errors: 0, Skipped: 0, Time elapsed: 0.201 sec
[junit] Running org.apache.poi.xssf.model.TestMapInfo
[junit] Tests run: 1, Failures: 0, Errors: 0, Skipped: 0, Time elapsed: 0.063 sec
[junit] Running org.apache.poi.xssf.model.TestSharedStringsTable
[junit] Tests run: 3, Failures: 0, Errors: 0, Skipped: 0, Time elapsed: 0.236 sec
[junit] Running org.apache.poi.xssf.model.TestStylesTable
[junit] Tests run: 11, Failures: 0, Errors: 0, Skipped: 0, Time elapsed: 0.462 sec
[junit] Running org.apache.poi.xssf.model.TestThemesTable
[junit] Tests run: 3, Failures: 0, Errors: 0, Skipped: 0, Time elapsed: 0.142 sec
[junit] Running org.apache.poi.xssf.streaming.TestAutoSizeColumnTracker
[junit] Tests run: 7, Failures: 0, Errors: 0, Skipped: 0, Time elapsed: 0.114 sec
[junit] Running org.apache.poi.xssf.streaming.TestOutlining
[junit] Tests run: 6, Failures: 0, Errors: 0, Skipped: 0, Time elapsed: 0.081 sec
[junit] Running org.apache.poi.xssf.streaming.TestSXSSFCell
[junit] Tests run: 30, Failures: 0, Errors: 0, Skipped: 0, Time elapsed: 1.193 sec
[junit] Running org.apache.poi.xssf.streaming.TestSXSSFDataValidation
[junit] Tests run: 2, Failures: 0, Errors: 0, Skipped: 0, Time elapsed: 0.556 sec
[junit] Running org.apache.poi.xssf.streaming.TestSXSSFFormulaEvaluation
[junit] Tests run: 5, Failures: 0, Errors: 0, Skipped: 0, Time elapsed: 0.193 sec
[junit] Running org.apache.poi.xssf.streaming.TestSXSSFHyperlink
[junit] Tests run: 2, Failures: 0, Errors: 0, Skipped: 0, Time elapsed: 0.066 sec
[junit] Running org.apache.poi.xssf.streaming.TestSXSSFRow
[junit] Tests run: 3, Failures: 0, Errors: 0, Skipped: 0, Time elapsed: 0.406 sec
[junit] Running org.apache.poi.xssf.streaming.TestSXSSFSheet
[junit] Tests run: 45, Failures: 0, Errors: 0, Skipped: 0, Time elapsed: 2.509 sec
[junit] Running org.apache.poi.xssf.streaming.TestSXSSFSheetAutoSizeColumn
[junit] Tests run: 26, Failures: 0, Errors: 0, Skipped: 0, Time elapsed: 0.431 sec
[junit] Running org.apache.poi.xssf.streaming.TestSXSSFWorkbook
[junit] Tests run: 33, Failures: 0, Errors: 0, Skipped: 4, Time elapsed: 2.752 sec
[junit] Running org.apache.poi.xssf.usermodel.TestFormulaEvaluatorOnXSSF
[junit] Tests run: 369, Failures: 0, Errors: 0, Skipped: 90, Time elapsed: 3.565 sec
[junit] Running org.apache.poi.xssf.usermodel.TestMissingWorkbookOnXSSF
[junit] Tests run: 3, Failures: 0, Errors: 0, Skipped: 0, Time elapsed: 0.339 sec
[junit] Running org.apache.poi.xssf.usermodel.TestMultiSheetFormulaEvaluatorOnXSSF
[junit] Tests run: 2, Failures: 0, Errors: 0, Skipped: 0, Time elapsed: 0.012 sec
[junit] Running org.apache.poi.xssf.usermodel.TestSXSSFBugs
[junit] Tests run: 32, Failures: 0, Errors: 0, Skipped: 7, Time elapsed: 10.924 sec
[junit] Running org.apache.poi.xssf.usermodel.TestSheetHiding
[junit] Tests run: 5, Failures: 0, Errors: 0, Skipped: 0, Time elapsed: 0.221 sec
[junit] Running org.apache.poi.xssf.usermodel.TestXSSFBugs
[junit] Tests run: 122, Failures: 0, Errors: 0, Skipped: 6, Time elapsed: 30.535 sec
[junit] Running org.apache.poi.xssf.usermodel.TestXSSFCell
[junit] Tests run: 49, Failures: 0, Errors: 0, Skipped: 0, Time elapsed: 2.624 sec
[junit] Running org.apache.poi.xssf.usermodel.TestXSSFCellStyle
[junit] Tests run: 42, Failures: 0, Errors: 0, Skipped: 0, Time elapsed: 0.658 sec
[junit] Running org.apache.poi.xssf.usermodel.TestXSSFChart
[junit] Tests run: 3, Failures: 0, Errors: 0, Skipped: 0, Time elapsed: 0.396 sec
[junit] Running org.apache.poi.xssf.usermodel.TestXSSFChartSheet
[junit] Tests run: 3, Failures: 0, Errors: 0, Skipped: 0, Time elapsed: 0.043 sec
[junit] Running org.apache.poi.xssf.usermodel.TestXSSFColGrouping
[junit] Tests run: 6, Failures: 0, Errors: 0, Skipped: 0, Time elapsed: 0.139 sec
[junit] Running org.apache.poi.xssf.usermodel.TestXSSFColor
[junit] Tests run: 3, Failures: 0, Errors: 0, Skipped: 0, Time elapsed: 0.075 sec
[junit] Running org.apache.poi.xssf.usermodel.TestXSSFComment
[junit] Tests run: 14, Failures: 0, Errors: 0, Skipped: 1, Time elapsed: 0.388 sec
[junit] Running org.apache.poi.xssf.usermodel.TestXSSFConditionalFormatting
[junit] Tests run: 18, Failures: 0, Errors: 0, Skipped: 0, Time elapsed: 0.245 sec
[junit] Running org.apache.poi.xssf.usermodel.TestXSSFDataFormat
[junit] Tests run: 7, Failures: 0, Errors: 0, Skipped: 0, Time elapsed: 0.114 sec
[junit] Running org.apache.poi.xssf.usermodel.TestXSSFDataValidation
[junit] Tests run: 6, Failures: 0, Errors: 0, Skipped: 0, Time elapsed: 0.646 sec
[junit] Running org.apache.poi.xssf.usermodel.TestXSSFDialogSheet
[junit] Tests run: 14, Failures: 0, Errors: 0, Skipped: 0, Time elapsed: 0.111 sec
[junit] Running org.apache.poi.xssf.usermodel.TestXSSFDrawing
[junit] Tests run: 18, Failures: 0, Errors: 0, Skipped: 0, Time elapsed: 1.072 sec
[junit] Running org.apache.poi.xssf.usermodel.TestXSSFExternalFunctions
[junit] Tests run: 2, Failures: 0, Errors: 0, Skipped: 0, Time elapsed: 0.017 sec
[junit] Running org.apache.poi.xssf.usermodel.TestXSSFFont
[junit] Tests run: 21, Failures: 0, Errors: 0, Skipped: 0, Time elapsed: 0.207 sec
[junit] Running org.apache.poi.xssf.usermodel.TestXSSFFormulaEvaluation
[junit] Tests run: 25, Failures: 0, Errors: 0, Skipped: 1, Time elapsed: 1.993 sec
[junit] Running org.apache.poi.xssf.usermodel.TestXSSFFormulaParser
[junit] Tests run: 11, Failures: 0, Errors: 0, Skipped: 0, Time elapsed: 0.199 sec
[junit] Running org.apache.poi.xssf.usermodel.TestXSSFHeaderFooter
[junit] Tests run: 2, Failures: 0, Errors: 0, Skipped: 0, Time elapsed: 0.008 sec
[junit] Running org.apache.poi.xssf.usermodel.TestXSSFHyperlink
[junit] Tests run: 10, Failures: 0, Errors: 0, Skipped: 0, Time elapsed: 0.297 sec
[junit] Running org.apache.poi.xssf.usermodel.TestXSSFName
[junit] Tests run: 21, Failures: 0, Errors: 0, Skipped: 0, Time elapsed: 0.268 sec
[junit] Running org.apache.poi.xssf.usermodel.TestXSSFPicture
[junit] Tests run: 6, Failures: 0, Errors: 0, Skipped: 0, Time elapsed: 0.093 sec
[junit] Running org.apache.poi.xssf.usermodel.TestXSSFPictureData
[junit] Tests run: 3, Failures: 0, Errors: 0, Skipped: 0, Time elapsed: 0.244 sec
[junit] Running org.apache.poi.xssf.usermodel.TestXSSFPivotTable
[junit] Tests run: 13, Failures: 0, Errors: 0, Skipped: 0, Time elapsed: 0.376 sec
[junit] Running org.apache.poi.xssf.usermodel.TestXSSFPrintSetup
[junit] Tests run: 18, Failures: 0, Errors: 0, Skipped: 0, Time elapsed: 0.163 sec
[junit] Running org.apache.poi.xssf.usermodel.TestXSSFRichTextString
[junit] Tests run: 17, Failures: 0, Errors: 0, Skipped: 0, Time elapsed: 0.234 sec
[junit] Running org.apache.poi.xssf.usermodel.TestXSSFRow
[junit] Tests run: 3, Failures: 0, Errors: 0, Skipped: 0, Time elapsed: 3.66 sec
[junit] Running org.apache.poi.xssf.usermodel.TestXSSFSheet
[junit] Tests run: 84, Failures: 0, Errors: 0, Skipped: 0, Time elapsed: 8.874 sec
[junit] Running org.apache.poi.xssf.usermodel.TestXSSFSheetAutosizeColumn
[junit] Tests run: 7, Failures: 0, Errors: 0, Skipped: 0, Time elapsed: 0.249 sec
[junit] Running org.apache.poi.xssf.usermodel.TestXSSFSheetMergeRegions
[junit] Tests run: 1, Failures: 0, Errors: 0, Skipped: 0, Time elapsed: 4.85 sec
[junit] Running org.apache.poi.xssf.usermodel.TestXSSFSheetRowGrouping
[junit] Tests run: 6, Failures: 0, Errors: 0, Skipped: 0, Time elapsed: 0.346 sec
[junit] Running org.apache.poi.xssf.usermodel.TestXSSFSheetShiftRows
[junit] Tests run: 23, Failures: 0, Errors: 0, Skipped: 1, Time elapsed: 35.846 sec
[junit] Running org.apache.poi.xssf.usermodel.TestXSSFSheetUpdateArrayFormulas
[junit] Tests run: 16, Failures: 0, Errors: 0, Skipped: 0, Time elapsed: 0.196 sec
[junit] Running org.apache.poi.xssf.usermodel.TestXSSFSimpleShape
[junit] Tests run: 1, Failures: 0, Errors: 0, Skipped: 0, Time elapsed: 0.015 sec
[junit] Running org.apache.poi.xssf.usermodel.TestXSSFTable
[junit] Tests run: 2, Failures: 0, Errors: 0, Skipped: 0, Time elapsed: 0.079 sec
[junit] Running org.apache.poi.xssf.usermodel.TestXSSFTextParagraph
[junit] Tests run: 1, Failures: 0, Errors: 0, Skipped: 0, Time elapsed: 0.018 sec
[junit] Running org.apache.poi.xssf.usermodel.TestXSSFTextRun
[junit] Tests run: 1, Failures: 0, Errors: 0, Skipped: 0, Time elapsed: 0.018 sec
[junit] Running org.apache.poi.xssf.usermodel.TestXSSFVMLDrawing
[junit] Tests run: 3, Failures: 0, Errors: 0, Skipped: 0, Time elapsed: 0.024 sec
[junit] Running org.apache.poi.xssf.usermodel.TestXSSFWorkbook
[junit] Tests run: 56, Failures: 0, Errors: 0, Skipped: 0, Time elapsed: 2.264 sec
[junit] Running org.apache.poi.xssf.usermodel.charts.TestXSSFCategoryAxis
[junit] Tests run: 1, Failures: 0, Errors: 0, Skipped: 0, Time elapsed: 0.085 sec
[junit] Running org.apache.poi.xssf.usermodel.charts.TestXSSFChartAxis
[junit] Tests run: 8, Failures: 0, Errors: 0, Skipped: 0, Time elapsed: 0.064 sec
[junit] Running org.apache.poi.xssf.usermodel.charts.TestXSSFChartLegend
[junit] Tests run: 3, Failures: 0, Errors: 0, Skipped: 0, Time elapsed: 0.025 sec
[junit] Running org.apache.poi.xssf.usermodel.charts.TestXSSFChartTitle
[junit] Tests run: 3, Failures: 0, Errors: 0, Skipped: 0, Time elapsed: 0.051 sec
[junit] Running org.apache.poi.xssf.usermodel.charts.TestXSSFLineChartData
[junit] Tests run: 1, Failures: 0, Errors: 0, Skipped: 0, Time elapsed: 0.01 sec
[junit] Running org.apache.poi.xssf.usermodel.charts.TestXSSFManualLayout
[junit] Tests run: 2, Failures: 0, Errors: 0, Skipped: 0, Time elapsed: 0.025 sec
[junit] Running org.apache.poi.xssf.usermodel.charts.TestXSSFScatterChartData
[junit] Tests run: 1, Failures: 0, Errors: 0, Skipped: 0, Time elapsed: 0.049 sec
[junit] Running org.apache.poi.xssf.usermodel.charts.TestXSSFValueAxis
[junit] Tests run: 1, Failures: 0, Errors: 0, Skipped: 0, Time elapsed: 0.007 sec
[junit] Running org.apache.poi.xssf.usermodel.extensions.TestXSSFBorder
[junit] Tests run: 1, Failures: 0, Errors: 0, Skipped: 0, Time elapsed: 0.003 sec
[junit] Running org.apache.poi.xssf.usermodel.extensions.TestXSSFCellFill
[junit] Tests run: 5, Failures: 0, Errors: 0, Skipped: 0, Time elapsed: 0.043 sec
[junit] Running org.apache.poi.xssf.usermodel.extensions.TestXSSFSheetComments
[junit] Tests run: 1, Failures: 0, Errors: 0, Skipped: 0, Time elapsed: 0.002 sec
[junit] Running org.apache.poi.xssf.usermodel.helpers.TestColumnHelper
[junit] Tests run: 15, Failures: 0, Errors: 0, Skipped: 0, Time elapsed: 0.354 sec
[junit] Running org.apache.poi.xssf.usermodel.helpers.TestHeaderFooterHelper
[junit] Tests run: 2, Failures: 0, Errors: 0, Skipped: 0, Time elapsed: 0.012 sec
[junit] Running org.apache.poi.xssf.util.TestCTColComparator
[junit] Tests run: 2, Failures: 0, Errors: 0, Skipped: 0, Time elapsed: 0.012 sec
[junit] Running org.apache.poi.xssf.util.TestEvilUnclosedBRFixingInputStream
[junit] Tests run: 3, Failures: 0, Errors: 0, Skipped: 0, Time elapsed: 0.032 sec
[junit] Running org.apache.poi.xssf.util.TestNumericRanges
[junit] Tests run: 2, Failures: 0, Errors: 0, Skipped: 0, Time elapsed: 0.026 sec
[junit] Running org.apache.poi.xwpf.TestAllExtendedProperties
[junit] Tests run: 1, Failures: 0, Errors: 0, Skipped: 0, Time elapsed: 0.072 sec
[junit] Running org.apache.poi.xwpf.TestDocumentProtection
[junit] Tests run: 10, Failures: 0, Errors: 0, Skipped: 0, Time elapsed: 2.396 sec
[junit] Running org.apache.poi.xwpf.TestPackageCorePropertiesGetKeywords
[junit] Tests run: 1, Failures: 0, Errors: 0, Skipped: 0, Time elapsed: 0.045 sec
[junit] Running org.apache.poi.xwpf.TestXWPFBugs
[junit] Tests run: 3, Failures: 0, Errors: 0, Skipped: 1, Time elapsed: 0.504 sec
[junit] Running org.apache.poi.xwpf.extractor.TestExternalEntities
[junit] Tests run: 1, Failures: 0, Errors: 0, Skipped: 0, Time elapsed: 0.014 sec
[junit] Running org.apache.poi.xwpf.extractor.TestXWPFWordExtractor
[junit] Tests run: 18, Failures: 0, Errors: 0, Skipped: 0, Time elapsed: 1.191 sec
[junit] Running org.apache.poi.xwpf.model.TestXWPFDecorators
[junit] Tests run: 2, Failures: 0, Errors: 0, Skipped: 0, Time elapsed: 0.175 sec
[junit] Running org.apache.poi.xwpf.model.TestXWPFHeaderFooterPolicy
[junit] Tests run: 3, Failures: 0, Errors: 0, Skipped: 0, Time elapsed: 0.322 sec
[junit] Running org.apache.poi.xwpf.usermodel.TestChangeTracking
[junit] Tests run: 3, Failures: 0, Errors: 0, Skipped: 0, Time elapsed: 0.069 sec
[junit] Running org.apache.poi.xwpf.usermodel.TestXWPFBugs
[junit] Tests run: 8, Failures: 0, Errors: 0, Skipped: 0, Time elapsed: 0.134 sec
[junit] Running org.apache.poi.xwpf.usermodel.TestXWPFDocument
[junit] Tests run: 19, Failures: 0, Errors: 0, Skipped: 0, Time elapsed: 0.532 sec
[junit] Running org.apache.poi.xwpf.usermodel.TestXWPFFootnotes
[junit] Tests run: 2, Failures: 0, Errors: 0, Skipped: 0, Time elapsed: 0.035 sec
[junit] Running org.apache.poi.xwpf.usermodel.TestXWPFHeader
[junit] Tests run: 8, Failures: 0, Errors: 0, Skipped: 0, Time elapsed: 0.247 sec
[junit] Running org.apache.poi.xwpf.usermodel.TestXWPFHeadings
[junit] Tests run: 1, Failures: 0, Errors: 0, Skipped: 0, Time elapsed: 0.12 sec
[junit] Running org.apache.poi.xwpf.usermodel.TestXWPFNumbering
[junit] Tests run: 6, Failures: 0, Errors: 0, Skipped: 0, Time elapsed: 0.124 sec
[junit] Running org.apache.poi.xwpf.usermodel.TestXWPFParagraph
[junit] Tests run: 21, Failures: 0, Errors: 0, Skipped: 0, Time elapsed: 0.33 sec
[junit] Running org.apache.poi.xwpf.usermodel.TestXWPFPictureData
[junit] Tests run: 5, Failures: 0, Errors: 0, Skipped: 0, Time elapsed: 0.32 sec
[junit] Running org.apache.poi.xwpf.usermodel.TestXWPFRun
[junit] Tests run: 21, Failures: 0, Errors: 0, Skipped: 0, Time elapsed: 0.315 sec
[junit] Running org.apache.poi.xwpf.usermodel.TestXWPFSDT
[junit] Tests run: 4, Failures: 0, Errors: 0, Skipped: 0, Time elapsed: 0.148 sec
[junit] Running org.apache.poi.xwpf.usermodel.TestXWPFSmartTag
[junit] Tests run: 1, Failures: 0, Errors: 0, Skipped: 0, Time elapsed: 0.011 sec
[junit] Running org.apache.poi.xwpf.usermodel.TestXWPFStyles
[junit] Tests run: 8, Failures: 0, Errors: 0, Skipped: 0, Time elapsed: 0.125 sec
[junit] Running org.apache.poi.xwpf.usermodel.TestXWPFTable
[junit] Tests run: 12, Failures: 0, Errors: 0, Skipped: 0, Time elapsed: 0.106 sec
[junit] Running org.apache.poi.xwpf.usermodel.TestXWPFTableCell
[junit] Tests run: 4, Failures: 0, Errors: 0, Skipped: 0, Time elapsed: 0.06 sec
[junit] Running org.apache.poi.xwpf.usermodel.TestXWPFTableRow
[junit] Tests run: 3, Failures: 0, Errors: 0, Skipped: 0, Time elapsed: 0.017 sec
[jacoco:coverage] Enhancing junit with coverage
[junit] Running org.apache.poi.poifs.crypt.TestSignatureInfo
[junit] Tests run: 12, Failures: 0, Errors: 0, Skipped: 1, Time elapsed: 20.057 sec
testcoveragereport:
[mkdir] Created dir: <https://builds.apache.org/job/POI/1235/artifact/build/coverage>
[jacoco:report] Loading execution data file <https://builds.apache.org/job/POI/ws/build/jacoco-excelant.exec>
[jacoco:report] Loading execution data file <https://builds.apache.org/job/POI/ws/build/jacoco-main.exec>
[jacoco:report] Loading execution data file <https://builds.apache.org/job/POI/ws/build/jacoco-ooxml-lite-xmlsec.exec>
[jacoco:report] Loading execution data file <https://builds.apache.org/job/POI/ws/build/jacoco-ooxml-lite.exec>
[jacoco:report] Loading execution data file <https://builds.apache.org/job/POI/ws/build/jacoco-ooxml-xmlsec.exec>
[jacoco:report] Loading execution data file <https://builds.apache.org/job/POI/ws/build/jacoco-ooxml.exec>
[jacoco:report] Loading execution data file <https://builds.apache.org/job/POI/ws/build/jacoco-scratchpad.exec>
[jacoco:report] Writing bundle 'Main' with 1474 classes
[jacoco:report] Writing bundle 'Scratchpad' with 608 classes
[jacoco:report] Writing bundle 'OOXML' with 555 classes
[jacoco:report] Writing bundle 'Excelant' with 13 classes
[echo] Coverage results are available at build/coverage/index.html, build/coverage/coverage.xml
test-all:
compile-integration:
[javac] Compiling 21 source files to <https://builds.apache.org/job/POI/ws/build/integration-test-classes>
-test-integration-check:
test-integration:
[jacoco:coverage] Enhancing junit with coverage
[junit] Handling 1118 files
[junit] Running org.apache.poi.TestAllFiles
[junit] Tests run: 1495, Failures: 1, Errors: 0, Skipped: 0, Time elapsed: 2,095.962 sec
BUILD FAILED
<https://builds.apache.org/job/POI/ws/build.xml>:1306: Test org.apache.poi.TestAllFiles failed
Total time: 61 minutes 31 seconds
Build step 'Invoke Ant' marked build as failure
[FINDBUGS] Skipping publisher since build result is FAILURE
[WARNINGS] Skipping publisher since build result is FAILURE
Archiving artifacts
Compressed 116.70 MB of artifacts by 77.8% relative to #1231
Recording test results
---------------------------------------------------------------------
To unsubscribe, e-mail: dev-unsubscribe@poi.apache.org
For additional commands, e-mail: dev-help@poi.apache.org