You are viewing a plain text version of this content. The canonical link for it is here.
Posted to solr-dev@lucene.apache.org by Apache Hudson Server <hu...@hudson.zones.apache.org> on 2009/03/14 09:22:21 UTC
Build failed in Hudson: Solr-trunk #742
See http://hudson.zones.apache.org/hudson/job/Solr-trunk/742/
------------------------------------------
[...truncated 1932 lines...]
[junit] Running org.apache.solr.SolrInfoMBeanTest
[junit] Tests run: 1, Failures: 0, Errors: 0, Time elapsed: 1.22 sec
[junit] Running org.apache.solr.TestDistributedSearch
[junit] Tests run: 1, Failures: 0, Errors: 0, Time elapsed: 45.846 sec
[junit] Running org.apache.solr.TestTrie
[junit] <response>
[junit] <lst name="responseHeader"><int name="status">0</int><int name="QTime">2</int></lst><result name="response" numFound="6" start="0"><doc><float name="id">0.0</float><date name="tdate">2009-03-14T00:00:00Z</date></doc><doc><float name="id">1.0</float><date name="tdate">2009-03-15T00:00:00Z</date></doc><doc><float name="id">2.0</float><date name="tdate">2009-03-16T00:00:00Z</date></doc><doc><float name="id">3.0</float><date name="tdate">2009-03-17T00:00:00Z</date></doc><doc><float name="id">4.0</float><date name="tdate">2009-03-18T00:00:00Z</date></doc><doc><float name="id">5.0</float><date name="tdate">2009-03-19T00:00:00Z</date></doc></result>
[junit] </response>
[junit] )
[junit] Tests run: 7, Failures: 1, Errors: 0, Time elapsed: 7.433 sec
[junit] Test org.apache.solr.TestTrie FAILED
[junit] Running org.apache.solr.analysis.DoubleMetaphoneFilterFactoryTest
[junit] Tests run: 2, Failures: 0, Errors: 0, Time elapsed: 0.741 sec
[junit] Running org.apache.solr.analysis.DoubleMetaphoneFilterTest
[junit] Tests run: 6, Failures: 0, Errors: 0, Time elapsed: 0.459 sec
[junit] Running org.apache.solr.analysis.EnglishPorterFilterFactoryTest
[junit] Tests run: 2, Failures: 0, Errors: 0, Time elapsed: 1.387 sec
[junit] Running org.apache.solr.analysis.HTMLStripReaderTest
[junit] Tests run: 9, Failures: 0, Errors: 0, Time elapsed: 1.232 sec
[junit] Running org.apache.solr.analysis.LengthFilterTest
[junit] Tests run: 1, Failures: 0, Errors: 0, Time elapsed: 1.611 sec
[junit] Running org.apache.solr.analysis.SnowballPorterFilterFactoryTest
[junit] Tests run: 2, Failures: 0, Errors: 0, Time elapsed: 3.58 sec
[junit] Running org.apache.solr.analysis.TestBufferedTokenStream
[junit] Tests run: 2, Failures: 0, Errors: 0, Time elapsed: 1.656 sec
[junit] Running org.apache.solr.analysis.TestCapitalizationFilter
[junit] Tests run: 2, Failures: 0, Errors: 0, Time elapsed: 2.235 sec
[junit] Running org.apache.solr.analysis.TestCharFilter
[junit] Tests run: 4, Failures: 0, Errors: 0, Time elapsed: 0.38 sec
[junit] Running org.apache.solr.analysis.TestHyphenatedWordsFilter
[junit] Tests run: 1, Failures: 0, Errors: 0, Time elapsed: 1.654 sec
[junit] Running org.apache.solr.analysis.TestKeepWordFilter
[junit] Tests run: 1, Failures: 0, Errors: 0, Time elapsed: 1.951 sec
[junit] Running org.apache.solr.analysis.TestMappingCharFilter
[junit] Tests run: 11, Failures: 0, Errors: 0, Time elapsed: 0.531 sec
[junit] Running org.apache.solr.analysis.TestMappingCharFilterFactory
[junit] Tests run: 1, Failures: 0, Errors: 0, Time elapsed: 0.609 sec
[junit] Running org.apache.solr.analysis.TestPatternReplaceFilter
[junit] Tests run: 5, Failures: 0, Errors: 0, Time elapsed: 2.076 sec
[junit] Running org.apache.solr.analysis.TestPatternTokenizerFactory
[junit] Tests run: 1, Failures: 0, Errors: 0, Time elapsed: 1.339 sec
[junit] Running org.apache.solr.analysis.TestPhoneticFilter
[junit] Tests run: 2, Failures: 0, Errors: 0, Time elapsed: 1.453 sec
[junit] Running org.apache.solr.analysis.TestRemoveDuplicatesTokenFilter
[junit] Tests run: 3, Failures: 0, Errors: 0, Time elapsed: 1.502 sec
[junit] Running org.apache.solr.analysis.TestSynonymFilter
[junit] Tests run: 7, Failures: 0, Errors: 0, Time elapsed: 2.234 sec
[junit] Running org.apache.solr.analysis.TestSynonymMap
[junit] Tests run: 5, Failures: 0, Errors: 0, Time elapsed: 2.521 sec
[junit] Running org.apache.solr.analysis.TestTrimFilter
[junit] Tests run: 1, Failures: 0, Errors: 0, Time elapsed: 1.322 sec
[junit] Running org.apache.solr.analysis.TestWordDelimiterFilter
[junit] Tests run: 11, Failures: 0, Errors: 0, Time elapsed: 15.31 sec
[junit] Running org.apache.solr.client.solrj.SolrExceptionTest
[junit] Tests run: 1, Failures: 0, Errors: 0, Time elapsed: 0.92 sec
[junit] Running org.apache.solr.client.solrj.SolrQueryTest
[junit] Tests run: 5, Failures: 0, Errors: 0, Time elapsed: 0.42 sec
[junit] Running org.apache.solr.client.solrj.beans.TestDocumentObjectBinder
[junit] Tests run: 3, Failures: 0, Errors: 0, Time elapsed: 0.723 sec
[junit] Running org.apache.solr.client.solrj.embedded.JettyWebappTest
[junit] Tests run: 1, Failures: 0, Errors: 0, Time elapsed: 8.963 sec
[junit] Running org.apache.solr.client.solrj.embedded.LargeVolumeBinaryJettyTest
[junit] Tests run: 1, Failures: 0, Errors: 0, Time elapsed: 7.227 sec
[junit] Running org.apache.solr.client.solrj.embedded.LargeVolumeEmbeddedTest
[junit] Tests run: 1, Failures: 0, Errors: 0, Time elapsed: 4.602 sec
[junit] Running org.apache.solr.client.solrj.embedded.LargeVolumeJettyTest
[junit] Tests run: 1, Failures: 0, Errors: 0, Time elapsed: 7.527 sec
[junit] Running org.apache.solr.client.solrj.embedded.MultiCoreEmbeddedTest
[junit] Tests run: 1, Failures: 0, Errors: 0, Time elapsed: 3.576 sec
[junit] Running org.apache.solr.client.solrj.embedded.MultiCoreExampleJettyTest
[junit] Tests run: 1, Failures: 0, Errors: 0, Time elapsed: 4.004 sec
[junit] Running org.apache.solr.client.solrj.embedded.SolrExampleEmbeddedTest
[junit] Tests run: 8, Failures: 0, Errors: 0, Time elapsed: 10.386 sec
[junit] Running org.apache.solr.client.solrj.embedded.SolrExampleJettyTest
[junit] Tests run: 9, Failures: 0, Errors: 0, Time elapsed: 20.91 sec
[junit] Running org.apache.solr.client.solrj.embedded.SolrExampleStreamingTest
[junit] Tests run: 8, Failures: 0, Errors: 0, Time elapsed: 15.346 sec
[junit] Running org.apache.solr.client.solrj.embedded.TestSolrProperties
[junit] Tests run: 1, Failures: 0, Errors: 0, Time elapsed: 2.636 sec
[junit] Running org.apache.solr.client.solrj.request.TestUpdateRequestCodec
[junit] Tests run: 1, Failures: 0, Errors: 0, Time elapsed: 0.428 sec
[junit] Running org.apache.solr.client.solrj.response.QueryResponseTest
[junit] Tests run: 1, Failures: 0, Errors: 0, Time elapsed: 0.568 sec
[junit] Running org.apache.solr.client.solrj.response.TestSpellCheckResponse
[junit] Tests run: 2, Failures: 0, Errors: 0, Time elapsed: 5.402 sec
[junit] Running org.apache.solr.client.solrj.util.ClientUtilsTest
[junit] Tests run: 1, Failures: 0, Errors: 0, Time elapsed: 0.383 sec
[junit] Running org.apache.solr.common.SolrDocumentTest
[junit] Tests run: 5, Failures: 0, Errors: 0, Time elapsed: 0.457 sec
[junit] Running org.apache.solr.common.params.ModifiableSolrParamsTest
[junit] Tests run: 5, Failures: 0, Errors: 0, Time elapsed: 0.505 sec
[junit] Running org.apache.solr.common.params.SolrParamTest
[junit] Tests run: 1, Failures: 0, Errors: 0, Time elapsed: 0.445 sec
[junit] Running org.apache.solr.common.util.ContentStreamTest
[junit] Tests run: 3, Failures: 0, Errors: 0, Time elapsed: 0.561 sec
[junit] Running org.apache.solr.common.util.IteratorChainTest
[junit] Tests run: 7, Failures: 0, Errors: 0, Time elapsed: 0.388 sec
[junit] Running org.apache.solr.common.util.NamedListTest
[junit] Tests run: 1, Failures: 0, Errors: 0, Time elapsed: 0.598 sec
[junit] Running org.apache.solr.common.util.TestFastInputStream
[junit] Tests run: 1, Failures: 0, Errors: 0, Time elapsed: 0.56 sec
[junit] Running org.apache.solr.common.util.TestHash
[junit] Tests run: 2, Failures: 0, Errors: 0, Time elapsed: 0.53 sec
[junit] Running org.apache.solr.common.util.TestNamedListCodec
[junit] Tests run: 4, Failures: 0, Errors: 0, Time elapsed: 1.889 sec
[junit] Running org.apache.solr.common.util.TestXMLEscaping
[junit] Tests run: 7, Failures: 0, Errors: 0, Time elapsed: 0.451 sec
[junit] Running org.apache.solr.core.AlternateDirectoryTest
[junit] Tests run: 1, Failures: 0, Errors: 0, Time elapsed: 3.389 sec
[junit] Running org.apache.solr.core.RequestHandlersTest
[junit] Tests run: 2, Failures: 0, Errors: 0, Time elapsed: 3.919 sec
[junit] Running org.apache.solr.core.ResourceLoaderTest
[junit] Tests run: 2, Failures: 0, Errors: 0, Time elapsed: 0.474 sec
[junit] Running org.apache.solr.core.SOLR749Test
[junit] Tests run: 1, Failures: 0, Errors: 0, Time elapsed: 2.545 sec
[junit] Running org.apache.solr.core.SolrCoreTest
[junit] Tests run: 4, Failures: 0, Errors: 0, Time elapsed: 12.506 sec
[junit] Running org.apache.solr.core.TestArbitraryIndexDir
[junit] Tests run: 1, Failures: 0, Errors: 0, Time elapsed: 3.493 sec
[junit] Running org.apache.solr.core.TestBadConfig
[junit] Tests run: 1, Failures: 0, Errors: 0, Time elapsed: 0.784 sec
[junit] Running org.apache.solr.core.TestConfig
[junit] Tests run: 3, Failures: 0, Errors: 0, Time elapsed: 5.888 sec
[junit] Running org.apache.solr.core.TestJmxIntegration
[junit] Tests run: 2, Failures: 0, Errors: 0, Time elapsed: 8.882 sec
[junit] Running org.apache.solr.core.TestJmxMonitoredMap
[junit] Tests run: 1, Failures: 0, Errors: 0, Time elapsed: 1.57 sec
[junit] Running org.apache.solr.core.TestQuerySenderListener
[junit] Tests run: 1, Failures: 0, Errors: 0, Time elapsed: 3.481 sec
[junit] Running org.apache.solr.core.TestSolrDeletionPolicy1
[junit] Tests run: 3, Failures: 0, Errors: 0, Time elapsed: 11.443 sec
[junit] Running org.apache.solr.core.TestSolrDeletionPolicy2
[junit] Tests run: 1, Failures: 0, Errors: 0, Time elapsed: 3.473 sec
[junit] Running org.apache.solr.handler.AnalysisRequestHandlerTest
[junit] Tests run: 1, Failures: 0, Errors: 0, Time elapsed: 3.587 sec
[junit] Running org.apache.solr.handler.MoreLikeThisHandlerTest
[junit] Tests run: 1, Failures: 0, Errors: 0, Time elapsed: 3.862 sec
[junit] Running org.apache.solr.handler.SpellCheckerRequestHandlerTest
[junit] Tests run: 5, Failures: 0, Errors: 0, Time elapsed: 5.877 sec
[junit] Running org.apache.solr.handler.StandardRequestHandlerTest
[junit] Tests run: 1, Failures: 0, Errors: 0, Time elapsed: 4.508 sec
[junit] Running org.apache.solr.handler.TestCSVLoader
[junit] Tests run: 4, Failures: 0, Errors: 0, Time elapsed: 11.832 sec
[junit] Running org.apache.solr.handler.TestReplicationHandler
[junit] Tests run: 5, Failures: 0, Errors: 0, Time elapsed: 61.17 sec
[junit] Running org.apache.solr.handler.XmlUpdateRequestHandlerTest
[junit] Tests run: 1, Failures: 0, Errors: 0, Time elapsed: 3.918 sec
[junit] Running org.apache.solr.handler.admin.SystemInfoHandlerTest
[junit] Tests run: 1, Failures: 0, Errors: 0, Time elapsed: 0.423 sec
[junit] Running org.apache.solr.handler.component.QueryElevationComponentTest
[junit] Tests run: 3, Failures: 0, Errors: 0, Time elapsed: 5.329 sec
[junit] Running org.apache.solr.handler.component.SearchHandlerTest
[junit] Tests run: 1, Failures: 0, Errors: 0, Time elapsed: 3.083 sec
[junit] Running org.apache.solr.handler.component.SpellCheckComponentTest
[junit] Tests run: 8, Failures: 0, Errors: 0, Time elapsed: 10.14 sec
[junit] Running org.apache.solr.handler.component.TermVectorComponentTest
[junit] Tests run: 4, Failures: 0, Errors: 0, Time elapsed: 7.08 sec
[junit] Running org.apache.solr.handler.component.TermsComponentTest
[junit] Tests run: 9, Failures: 0, Errors: 0, Time elapsed: 10.434 sec
[junit] Running org.apache.solr.highlight.HighlighterConfigTest
[junit] Tests run: 1, Failures: 0, Errors: 0, Time elapsed: 2.9 sec
[junit] Running org.apache.solr.highlight.HighlighterTest
[junit] Tests run: 20, Failures: 0, Errors: 0, Time elapsed: 18.658 sec
[junit] Running org.apache.solr.request.JSONWriterTest
[junit] Tests run: 3, Failures: 0, Errors: 0, Time elapsed: 5.742 sec
[junit] Running org.apache.solr.request.SimpleFacetsLegacySortTest
[junit] Tests run: 1, Failures: 0, Errors: 0, Time elapsed: 4.225 sec
[junit] Running org.apache.solr.request.SimpleFacetsTest
[junit] Tests run: 6, Failures: 0, Errors: 0, Time elapsed: 11.418 sec
[junit] Running org.apache.solr.request.TestBinaryResponseWriter
[junit] Tests run: 1, Failures: 0, Errors: 0, Time elapsed: 3.696 sec
[junit] Running org.apache.solr.request.TestFaceting
[junit] Tests run: 3, Failures: 0, Errors: 0, Time elapsed: 15.245 sec
[junit] Running org.apache.solr.request.TestWriterPerf
[junit] Tests run: 1, Failures: 0, Errors: 0, Time elapsed: 2.845 sec
[junit] Running org.apache.solr.schema.BadIndexSchemaTest
[junit] Tests run: 1, Failures: 0, Errors: 0, Time elapsed: 1.841 sec
[junit] Running org.apache.solr.schema.CopyFieldTest
[junit] Tests run: 6, Failures: 0, Errors: 0, Time elapsed: 6.304 sec
[junit] Running org.apache.solr.schema.DateFieldTest
[junit] Tests run: 6, Failures: 0, Errors: 0, Time elapsed: 0.447 sec
[junit] Running org.apache.solr.schema.IndexSchemaTest
[junit] Tests run: 3, Failures: 0, Errors: 0, Time elapsed: 4.725 sec
[junit] Running org.apache.solr.schema.LegacyDateFieldTest
[junit] Tests run: 4, Failures: 0, Errors: 0, Time elapsed: 0.402 sec
[junit] Running org.apache.solr.schema.NotRequiredUniqueKeyTest
[junit] Tests run: 1, Failures: 0, Errors: 0, Time elapsed: 1.835 sec
[junit] Running org.apache.solr.schema.RequiredFieldsTest
[junit] Tests run: 3, Failures: 0, Errors: 0, Time elapsed: 4.733 sec
[junit] Running org.apache.solr.schema.UUIDFieldTest
[junit] Tests run: 1, Failures: 0, Errors: 0, Time elapsed: 0.705 sec
[junit] Running org.apache.solr.search.TestDocSet
[junit] Tests run: 1, Failures: 0, Errors: 0, Time elapsed: 0.844 sec
[junit] Running org.apache.solr.search.TestFastLRUCache
[junit] Tests run: 2, Failures: 0, Errors: 0, Time elapsed: 0.398 sec
[junit] Running org.apache.solr.search.TestQueryTypes
[junit] Tests run: 1, Failures: 0, Errors: 0, Time elapsed: 2.896 sec
[junit] Running org.apache.solr.search.TestQueryUtils
[junit] Tests run: 1, Failures: 0, Errors: 0, Time elapsed: 3.199 sec
[junit] Running org.apache.solr.search.function.TestFunctionQuery
[junit] Tests run: 2, Failures: 0, Errors: 0, Time elapsed: 5.027 sec
[junit] Running org.apache.solr.servlet.CacheHeaderTest
[junit] Tests run: 5, Failures: 0, Errors: 0, Time elapsed: 10.803 sec
[junit] Running org.apache.solr.servlet.DirectSolrConnectionTest
[junit] Tests run: 2, Failures: 0, Errors: 0, Time elapsed: 2.307 sec
[junit] Running org.apache.solr.servlet.NoCacheHeaderTest
[junit] Tests run: 3, Failures: 0, Errors: 0, Time elapsed: 7.528 sec
[junit] Running org.apache.solr.servlet.SolrRequestParserTest
[junit] Tests run: 4, Failures: 0, Errors: 0, Time elapsed: 6.117 sec
[junit] Running org.apache.solr.spelling.FileBasedSpellCheckerTest
[junit] Tests run: 3, Failures: 0, Errors: 0, Time elapsed: 5.338 sec
[junit] Running org.apache.solr.spelling.IndexBasedSpellCheckerTest
[junit] Tests run: 4, Failures: 0, Errors: 0, Time elapsed: 5.911 sec
[junit] Running org.apache.solr.spelling.SpellingQueryConverterTest
[junit] Tests run: 1, Failures: 0, Errors: 0, Time elapsed: 2.569 sec
[junit] Running org.apache.solr.update.AutoCommitTest
[junit] Tests run: 1, Failures: 0, Errors: 0, Time elapsed: 6.493 sec
[junit] Running org.apache.solr.update.DirectUpdateHandlerOptimizeTest
[junit] Tests run: 1, Failures: 0, Errors: 0, Time elapsed: 3.492 sec
[junit] Running org.apache.solr.update.DirectUpdateHandlerTest
[junit] Tests run: 6, Failures: 0, Errors: 0, Time elapsed: 7.119 sec
[junit] Running org.apache.solr.update.DocumentBuilderTest
[junit] Tests run: 2, Failures: 0, Errors: 0, Time elapsed: 3.689 sec
[junit] Running org.apache.solr.update.processor.SignatureUpdateProcessorFactoryTest
[junit] Tests run: 2, Failures: 0, Errors: 0, Time elapsed: 5.761 sec
[junit] Running org.apache.solr.update.processor.UpdateRequestProcessorFactoryTest
[junit] Tests run: 1, Failures: 0, Errors: 0, Time elapsed: 2.57 sec
[junit] Running org.apache.solr.util.ArraysUtilsTest
[junit] Tests run: 1, Failures: 0, Errors: 0, Time elapsed: 0.4 sec
[junit] Running org.apache.solr.util.DateMathParserTest
[junit] Tests run: 7, Failures: 0, Errors: 0, Time elapsed: 0.479 sec
[junit] Running org.apache.solr.util.SolrPluginUtilsTest
[junit] Tests run: 6, Failures: 0, Errors: 0, Time elapsed: 6.899 sec
[junit] Running org.apache.solr.util.TestCharArrayMap
[junit] Tests run: 2, Failures: 0, Errors: 0, Time elapsed: 0.62 sec
[junit] Running org.apache.solr.util.TestNumberUtils
[junit] Tests run: 1, Failures: 0, Errors: 0, Time elapsed: 1.559 sec
[junit] Running org.apache.solr.util.TestOpenBitSet
[junit] Tests run: 3, Failures: 0, Errors: 0, Time elapsed: 1.318 sec
[junit] Running org.apache.solr.util.TestUtils
[junit] Tests run: 3, Failures: 0, Errors: 0, Time elapsed: 0.403 sec
BUILD FAILED
http://hudson.zones.apache.org/hudson/job/Solr-trunk/ws/trunk/build.xml :374: Tests failed!
Total time: 13 minutes 39 seconds
Publishing Javadoc
Recording test results
Publishing Clover coverage report...
Hudson build is back to normal: Solr-trunk #744
Posted by Apache Hudson Server <hu...@hudson.zones.apache.org>.
See http://hudson.zones.apache.org/hudson/job/Solr-trunk/744/changes
Build failed in Hudson: Solr-trunk #743
Posted by Apache Hudson Server <hu...@hudson.zones.apache.org>.
See http://hudson.zones.apache.org/hudson/job/Solr-trunk/743/
------------------------------------------
[...truncated 1932 lines...]
[junit] Running org.apache.solr.SolrInfoMBeanTest
[junit] Tests run: 1, Failures: 0, Errors: 0, Time elapsed: 2.76 sec
[junit] Running org.apache.solr.TestDistributedSearch
[junit] Tests run: 1, Failures: 0, Errors: 0, Time elapsed: 57.148 sec
[junit] Running org.apache.solr.TestTrie
[junit] <response>
[junit] <lst name="responseHeader"><int name="status">0</int><int name="QTime">2</int></lst><result name="response" numFound="6" start="0"><doc><float name="id">0.0</float><date name="tdate">2009-03-15T00:00:00Z</date></doc><doc><float name="id">1.0</float><date name="tdate">2009-03-16T00:00:00Z</date></doc><doc><float name="id">2.0</float><date name="tdate">2009-03-17T00:00:00Z</date></doc><doc><float name="id">3.0</float><date name="tdate">2009-03-18T00:00:00Z</date></doc><doc><float name="id">4.0</float><date name="tdate">2009-03-19T00:00:00Z</date></doc><doc><float name="id">5.0</float><date name="tdate">2009-03-20T00:00:00Z</date></doc></result>
[junit] </response>
[junit] )
[junit] Tests run: 7, Failures: 1, Errors: 0, Time elapsed: 8.641 sec
[junit] Test org.apache.solr.TestTrie FAILED
[junit] Running org.apache.solr.analysis.DoubleMetaphoneFilterFactoryTest
[junit] Tests run: 2, Failures: 0, Errors: 0, Time elapsed: 0.552 sec
[junit] Running org.apache.solr.analysis.DoubleMetaphoneFilterTest
[junit] Tests run: 6, Failures: 0, Errors: 0, Time elapsed: 0.518 sec
[junit] Running org.apache.solr.analysis.EnglishPorterFilterFactoryTest
[junit] Tests run: 2, Failures: 0, Errors: 0, Time elapsed: 1.567 sec
[junit] Running org.apache.solr.analysis.HTMLStripReaderTest
[junit] Tests run: 9, Failures: 0, Errors: 0, Time elapsed: 1.128 sec
[junit] Running org.apache.solr.analysis.LengthFilterTest
[junit] Tests run: 1, Failures: 0, Errors: 0, Time elapsed: 1.379 sec
[junit] Running org.apache.solr.analysis.SnowballPorterFilterFactoryTest
[junit] Tests run: 2, Failures: 0, Errors: 0, Time elapsed: 1.639 sec
[junit] Running org.apache.solr.analysis.TestBufferedTokenStream
[junit] Tests run: 2, Failures: 0, Errors: 0, Time elapsed: 1.386 sec
[junit] Running org.apache.solr.analysis.TestCapitalizationFilter
[junit] Tests run: 2, Failures: 0, Errors: 0, Time elapsed: 1.597 sec
[junit] Running org.apache.solr.analysis.TestCharFilter
[junit] Tests run: 4, Failures: 0, Errors: 0, Time elapsed: 0.5 sec
[junit] Running org.apache.solr.analysis.TestHyphenatedWordsFilter
[junit] Tests run: 1, Failures: 0, Errors: 0, Time elapsed: 1.08 sec
[junit] Running org.apache.solr.analysis.TestKeepWordFilter
[junit] Tests run: 1, Failures: 0, Errors: 0, Time elapsed: 1.433 sec
[junit] Running org.apache.solr.analysis.TestMappingCharFilter
[junit] Tests run: 11, Failures: 0, Errors: 0, Time elapsed: 0.475 sec
[junit] Running org.apache.solr.analysis.TestMappingCharFilterFactory
[junit] Tests run: 1, Failures: 0, Errors: 0, Time elapsed: 0.442 sec
[junit] Running org.apache.solr.analysis.TestPatternReplaceFilter
[junit] Tests run: 5, Failures: 0, Errors: 0, Time elapsed: 2.058 sec
[junit] Running org.apache.solr.analysis.TestPatternTokenizerFactory
[junit] Tests run: 1, Failures: 0, Errors: 0, Time elapsed: 1.74 sec
[junit] Running org.apache.solr.analysis.TestPhoneticFilter
[junit] Tests run: 2, Failures: 0, Errors: 0, Time elapsed: 1.761 sec
[junit] Running org.apache.solr.analysis.TestRemoveDuplicatesTokenFilter
[junit] Tests run: 3, Failures: 0, Errors: 0, Time elapsed: 2.307 sec
[junit] Running org.apache.solr.analysis.TestSynonymFilter
[junit] Tests run: 7, Failures: 0, Errors: 0, Time elapsed: 3.048 sec
[junit] Running org.apache.solr.analysis.TestSynonymMap
[junit] Tests run: 5, Failures: 0, Errors: 0, Time elapsed: 2.219 sec
[junit] Running org.apache.solr.analysis.TestTrimFilter
[junit] Tests run: 1, Failures: 0, Errors: 0, Time elapsed: 1.3 sec
[junit] Running org.apache.solr.analysis.TestWordDelimiterFilter
[junit] Tests run: 11, Failures: 0, Errors: 0, Time elapsed: 14.189 sec
[junit] Running org.apache.solr.client.solrj.SolrExceptionTest
[junit] Tests run: 1, Failures: 0, Errors: 0, Time elapsed: 0.591 sec
[junit] Running org.apache.solr.client.solrj.SolrQueryTest
[junit] Tests run: 5, Failures: 0, Errors: 0, Time elapsed: 0.441 sec
[junit] Running org.apache.solr.client.solrj.beans.TestDocumentObjectBinder
[junit] Tests run: 3, Failures: 0, Errors: 0, Time elapsed: 0.75 sec
[junit] Running org.apache.solr.client.solrj.embedded.JettyWebappTest
[junit] Tests run: 1, Failures: 0, Errors: 0, Time elapsed: 9.911 sec
[junit] Running org.apache.solr.client.solrj.embedded.LargeVolumeBinaryJettyTest
[junit] Tests run: 1, Failures: 0, Errors: 0, Time elapsed: 7.623 sec
[junit] Running org.apache.solr.client.solrj.embedded.LargeVolumeEmbeddedTest
[junit] Tests run: 1, Failures: 0, Errors: 0, Time elapsed: 5.352 sec
[junit] Running org.apache.solr.client.solrj.embedded.LargeVolumeJettyTest
[junit] Tests run: 1, Failures: 0, Errors: 0, Time elapsed: 9.308 sec
[junit] Running org.apache.solr.client.solrj.embedded.MultiCoreEmbeddedTest
[junit] Tests run: 1, Failures: 0, Errors: 0, Time elapsed: 5.47 sec
[junit] Running org.apache.solr.client.solrj.embedded.MultiCoreExampleJettyTest
[junit] Tests run: 1, Failures: 0, Errors: 0, Time elapsed: 5.65 sec
[junit] Running org.apache.solr.client.solrj.embedded.SolrExampleEmbeddedTest
[junit] Tests run: 8, Failures: 0, Errors: 0, Time elapsed: 11.518 sec
[junit] Running org.apache.solr.client.solrj.embedded.SolrExampleJettyTest
[junit] Tests run: 9, Failures: 0, Errors: 0, Time elapsed: 23.579 sec
[junit] Running org.apache.solr.client.solrj.embedded.SolrExampleStreamingTest
[junit] Tests run: 8, Failures: 0, Errors: 0, Time elapsed: 21.265 sec
[junit] Running org.apache.solr.client.solrj.embedded.TestSolrProperties
[junit] Tests run: 1, Failures: 0, Errors: 0, Time elapsed: 5.395 sec
[junit] Running org.apache.solr.client.solrj.request.TestUpdateRequestCodec
[junit] Tests run: 1, Failures: 0, Errors: 0, Time elapsed: 0.47 sec
[junit] Running org.apache.solr.client.solrj.response.QueryResponseTest
[junit] Tests run: 1, Failures: 0, Errors: 0, Time elapsed: 0.772 sec
[junit] Running org.apache.solr.client.solrj.response.TestSpellCheckResponse
[junit] Tests run: 2, Failures: 0, Errors: 0, Time elapsed: 8.231 sec
[junit] Running org.apache.solr.client.solrj.util.ClientUtilsTest
[junit] Tests run: 1, Failures: 0, Errors: 0, Time elapsed: 0.577 sec
[junit] Running org.apache.solr.common.SolrDocumentTest
[junit] Tests run: 5, Failures: 0, Errors: 0, Time elapsed: 0.568 sec
[junit] Running org.apache.solr.common.params.ModifiableSolrParamsTest
[junit] Tests run: 5, Failures: 0, Errors: 0, Time elapsed: 0.488 sec
[junit] Running org.apache.solr.common.params.SolrParamTest
[junit] Tests run: 1, Failures: 0, Errors: 0, Time elapsed: 0.437 sec
[junit] Running org.apache.solr.common.util.ContentStreamTest
[junit] Tests run: 3, Failures: 0, Errors: 0, Time elapsed: 0.627 sec
[junit] Running org.apache.solr.common.util.IteratorChainTest
[junit] Tests run: 7, Failures: 0, Errors: 0, Time elapsed: 0.512 sec
[junit] Running org.apache.solr.common.util.NamedListTest
[junit] Tests run: 1, Failures: 0, Errors: 0, Time elapsed: 0.399 sec
[junit] Running org.apache.solr.common.util.TestFastInputStream
[junit] Tests run: 1, Failures: 0, Errors: 0, Time elapsed: 0.452 sec
[junit] Running org.apache.solr.common.util.TestHash
[junit] Tests run: 2, Failures: 0, Errors: 0, Time elapsed: 0.651 sec
[junit] Running org.apache.solr.common.util.TestNamedListCodec
[junit] Tests run: 4, Failures: 0, Errors: 0, Time elapsed: 1.99 sec
[junit] Running org.apache.solr.common.util.TestXMLEscaping
[junit] Tests run: 7, Failures: 0, Errors: 0, Time elapsed: 0.4 sec
[junit] Running org.apache.solr.core.AlternateDirectoryTest
[junit] Tests run: 1, Failures: 0, Errors: 0, Time elapsed: 2.661 sec
[junit] Running org.apache.solr.core.RequestHandlersTest
[junit] Tests run: 2, Failures: 0, Errors: 0, Time elapsed: 5.697 sec
[junit] Running org.apache.solr.core.ResourceLoaderTest
[junit] Tests run: 2, Failures: 0, Errors: 0, Time elapsed: 0.49 sec
[junit] Running org.apache.solr.core.SOLR749Test
[junit] Tests run: 1, Failures: 0, Errors: 0, Time elapsed: 2.896 sec
[junit] Running org.apache.solr.core.SolrCoreTest
[junit] Tests run: 4, Failures: 0, Errors: 0, Time elapsed: 14.311 sec
[junit] Running org.apache.solr.core.TestArbitraryIndexDir
[junit] Tests run: 1, Failures: 0, Errors: 0, Time elapsed: 3.738 sec
[junit] Running org.apache.solr.core.TestBadConfig
[junit] Tests run: 1, Failures: 0, Errors: 0, Time elapsed: 0.536 sec
[junit] Running org.apache.solr.core.TestConfig
[junit] Tests run: 3, Failures: 0, Errors: 0, Time elapsed: 5.94 sec
[junit] Running org.apache.solr.core.TestJmxIntegration
[junit] Tests run: 2, Failures: 0, Errors: 0, Time elapsed: 4.158 sec
[junit] Running org.apache.solr.core.TestJmxMonitoredMap
[junit] Tests run: 1, Failures: 0, Errors: 0, Time elapsed: 1.204 sec
[junit] Running org.apache.solr.core.TestQuerySenderListener
[junit] Tests run: 1, Failures: 0, Errors: 0, Time elapsed: 2.435 sec
[junit] Running org.apache.solr.core.TestSolrDeletionPolicy1
[junit] Tests run: 3, Failures: 0, Errors: 0, Time elapsed: 10.146 sec
[junit] Running org.apache.solr.core.TestSolrDeletionPolicy2
[junit] Tests run: 1, Failures: 0, Errors: 0, Time elapsed: 2.829 sec
[junit] Running org.apache.solr.handler.AnalysisRequestHandlerTest
[junit] Tests run: 1, Failures: 0, Errors: 0, Time elapsed: 2.665 sec
[junit] Running org.apache.solr.handler.MoreLikeThisHandlerTest
[junit] Tests run: 1, Failures: 0, Errors: 0, Time elapsed: 3.315 sec
[junit] Running org.apache.solr.handler.SpellCheckerRequestHandlerTest
[junit] Tests run: 5, Failures: 0, Errors: 0, Time elapsed: 4.805 sec
[junit] Running org.apache.solr.handler.StandardRequestHandlerTest
[junit] Tests run: 1, Failures: 0, Errors: 0, Time elapsed: 4.808 sec
[junit] Running org.apache.solr.handler.TestCSVLoader
[junit] Tests run: 4, Failures: 0, Errors: 0, Time elapsed: 11.171 sec
[junit] Running org.apache.solr.handler.TestReplicationHandler
[junit] Tests run: 5, Failures: 0, Errors: 0, Time elapsed: 63.85 sec
[junit] Running org.apache.solr.handler.XmlUpdateRequestHandlerTest
[junit] Tests run: 1, Failures: 0, Errors: 0, Time elapsed: 3.464 sec
[junit] Running org.apache.solr.handler.admin.SystemInfoHandlerTest
[junit] Tests run: 1, Failures: 0, Errors: 0, Time elapsed: 0.581 sec
[junit] Running org.apache.solr.handler.component.QueryElevationComponentTest
[junit] Tests run: 3, Failures: 0, Errors: 0, Time elapsed: 7.164 sec
[junit] Running org.apache.solr.handler.component.SearchHandlerTest
[junit] Tests run: 1, Failures: 0, Errors: 0, Time elapsed: 3.703 sec
[junit] Running org.apache.solr.handler.component.SpellCheckComponentTest
[junit] Tests run: 8, Failures: 0, Errors: 0, Time elapsed: 12.181 sec
[junit] Running org.apache.solr.handler.component.TermVectorComponentTest
[junit] Tests run: 4, Failures: 0, Errors: 0, Time elapsed: 7.494 sec
[junit] Running org.apache.solr.handler.component.TermsComponentTest
[junit] Tests run: 9, Failures: 0, Errors: 0, Time elapsed: 14.064 sec
[junit] Running org.apache.solr.highlight.HighlighterConfigTest
[junit] Tests run: 1, Failures: 0, Errors: 0, Time elapsed: 4.042 sec
[junit] Running org.apache.solr.highlight.HighlighterTest
[junit] Tests run: 20, Failures: 0, Errors: 0, Time elapsed: 18.878 sec
[junit] Running org.apache.solr.request.JSONWriterTest
[junit] Tests run: 3, Failures: 0, Errors: 0, Time elapsed: 6.205 sec
[junit] Running org.apache.solr.request.SimpleFacetsLegacySortTest
[junit] Tests run: 1, Failures: 0, Errors: 0, Time elapsed: 3.91 sec
[junit] Running org.apache.solr.request.SimpleFacetsTest
[junit] Tests run: 6, Failures: 0, Errors: 0, Time elapsed: 12.23 sec
[junit] Running org.apache.solr.request.TestBinaryResponseWriter
[junit] Tests run: 1, Failures: 0, Errors: 0, Time elapsed: 3.585 sec
[junit] Running org.apache.solr.request.TestFaceting
[junit] Tests run: 3, Failures: 0, Errors: 0, Time elapsed: 22.341 sec
[junit] Running org.apache.solr.request.TestWriterPerf
[junit] Tests run: 1, Failures: 0, Errors: 0, Time elapsed: 3.056 sec
[junit] Running org.apache.solr.schema.BadIndexSchemaTest
[junit] Tests run: 1, Failures: 0, Errors: 0, Time elapsed: 3.944 sec
[junit] Running org.apache.solr.schema.CopyFieldTest
[junit] Tests run: 6, Failures: 0, Errors: 0, Time elapsed: 11.177 sec
[junit] Running org.apache.solr.schema.DateFieldTest
[junit] Tests run: 6, Failures: 0, Errors: 0, Time elapsed: 0.564 sec
[junit] Running org.apache.solr.schema.IndexSchemaTest
[junit] Tests run: 3, Failures: 0, Errors: 0, Time elapsed: 7.795 sec
[junit] Running org.apache.solr.schema.LegacyDateFieldTest
[junit] Tests run: 4, Failures: 0, Errors: 0, Time elapsed: 0.448 sec
[junit] Running org.apache.solr.schema.NotRequiredUniqueKeyTest
[junit] Tests run: 1, Failures: 0, Errors: 0, Time elapsed: 2.543 sec
[junit] Running org.apache.solr.schema.RequiredFieldsTest
[junit] Tests run: 3, Failures: 0, Errors: 0, Time elapsed: 6.949 sec
[junit] Running org.apache.solr.schema.UUIDFieldTest
[junit] Tests run: 1, Failures: 0, Errors: 0, Time elapsed: 1.055 sec
[junit] Running org.apache.solr.search.TestDocSet
[junit] Tests run: 1, Failures: 0, Errors: 0, Time elapsed: 0.964 sec
[junit] Running org.apache.solr.search.TestFastLRUCache
[junit] Tests run: 2, Failures: 0, Errors: 0, Time elapsed: 0.423 sec
[junit] Running org.apache.solr.search.TestQueryTypes
[junit] Tests run: 1, Failures: 0, Errors: 0, Time elapsed: 3.719 sec
[junit] Running org.apache.solr.search.TestQueryUtils
[junit] Tests run: 1, Failures: 0, Errors: 0, Time elapsed: 4.014 sec
[junit] Running org.apache.solr.search.function.TestFunctionQuery
[junit] Tests run: 2, Failures: 0, Errors: 0, Time elapsed: 8.277 sec
[junit] Running org.apache.solr.servlet.CacheHeaderTest
[junit] Tests run: 5, Failures: 0, Errors: 0, Time elapsed: 12.046 sec
[junit] Running org.apache.solr.servlet.DirectSolrConnectionTest
[junit] Tests run: 2, Failures: 0, Errors: 0, Time elapsed: 2.339 sec
[junit] Running org.apache.solr.servlet.NoCacheHeaderTest
[junit] Tests run: 3, Failures: 0, Errors: 0, Time elapsed: 8.415 sec
[junit] Running org.apache.solr.servlet.SolrRequestParserTest
[junit] Tests run: 4, Failures: 0, Errors: 0, Time elapsed: 6.499 sec
[junit] Running org.apache.solr.spelling.FileBasedSpellCheckerTest
[junit] Tests run: 3, Failures: 0, Errors: 0, Time elapsed: 4.992 sec
[junit] Running org.apache.solr.spelling.IndexBasedSpellCheckerTest
[junit] Tests run: 4, Failures: 0, Errors: 0, Time elapsed: 6.217 sec
[junit] Running org.apache.solr.spelling.SpellingQueryConverterTest
[junit] Tests run: 1, Failures: 0, Errors: 0, Time elapsed: 2.96 sec
[junit] Running org.apache.solr.update.AutoCommitTest
[junit] Tests run: 1, Failures: 0, Errors: 0, Time elapsed: 6.206 sec
[junit] Running org.apache.solr.update.DirectUpdateHandlerOptimizeTest
[junit] Tests run: 1, Failures: 0, Errors: 0, Time elapsed: 3.446 sec
[junit] Running org.apache.solr.update.DirectUpdateHandlerTest
[junit] Tests run: 6, Failures: 0, Errors: 0, Time elapsed: 7.342 sec
[junit] Running org.apache.solr.update.DocumentBuilderTest
[junit] Tests run: 2, Failures: 0, Errors: 0, Time elapsed: 3.817 sec
[junit] Running org.apache.solr.update.processor.SignatureUpdateProcessorFactoryTest
[junit] Tests run: 2, Failures: 0, Errors: 0, Time elapsed: 5.436 sec
[junit] Running org.apache.solr.update.processor.UpdateRequestProcessorFactoryTest
[junit] Tests run: 1, Failures: 0, Errors: 0, Time elapsed: 2.381 sec
[junit] Running org.apache.solr.util.ArraysUtilsTest
[junit] Tests run: 1, Failures: 0, Errors: 0, Time elapsed: 0.386 sec
[junit] Running org.apache.solr.util.DateMathParserTest
[junit] Tests run: 7, Failures: 0, Errors: 0, Time elapsed: 0.473 sec
[junit] Running org.apache.solr.util.SolrPluginUtilsTest
[junit] Tests run: 6, Failures: 0, Errors: 0, Time elapsed: 6.73 sec
[junit] Running org.apache.solr.util.TestCharArrayMap
[junit] Tests run: 2, Failures: 0, Errors: 0, Time elapsed: 0.573 sec
[junit] Running org.apache.solr.util.TestNumberUtils
[junit] Tests run: 1, Failures: 0, Errors: 0, Time elapsed: 1.584 sec
[junit] Running org.apache.solr.util.TestOpenBitSet
[junit] Tests run: 3, Failures: 0, Errors: 0, Time elapsed: 1.281 sec
[junit] Running org.apache.solr.util.TestUtils
[junit] Tests run: 3, Failures: 0, Errors: 0, Time elapsed: 0.395 sec
BUILD FAILED
http://hudson.zones.apache.org/hudson/job/Solr-trunk/ws/trunk/build.xml :374: Tests failed!
Total time: 15 minutes 12 seconds
Publishing Javadoc
Recording test results
Publishing Clover coverage report...