You are viewing a plain text version of this content. The canonical link for it is here.
Posted to dev@lucene.apache.org by Policeman Jenkins Server <je...@thetaphi.de> on 2013/06/11 18:15:06 UTC

[JENKINS] Lucene-Solr-4.x-MacOSX (64bit/jdk1.6.0) - Build # 537 - Still Failing!

Build: http://jenkins.thetaphi.de/job/Lucene-Solr-4.x-MacOSX/537/
Java: 64bit/jdk1.6.0 -XX:-UseCompressedOops -XX:+UseSerialGC

2 tests failed.
FAILED:  org.apache.solr.client.solrj.embedded.TestSolrProperties.testProperties

Error Message:
Test abandoned because suite timeout was reached.

Stack Trace:
java.lang.Exception: Test abandoned because suite timeout was reached.
	at __randomizedtesting.SeedInfo.seed([9AD7FA0840C60AC0]:0)


FAILED:  junit.framework.TestSuite.org.apache.solr.client.solrj.embedded.TestSolrProperties

Error Message:
Suite timeout exceeded (>= 7200000 msec).

Stack Trace:
java.lang.Exception: Suite timeout exceeded (>= 7200000 msec).
	at __randomizedtesting.SeedInfo.seed([9AD7FA0840C60AC0]:0)




Build Log:
[...truncated 9962 lines...]
[junit4:junit4] Suite: org.apache.solr.client.solrj.embedded.TestSolrProperties
[junit4:junit4]   1> 123927 [TEST-TestSolrProperties.testProperties-seed#[9AD7FA0840C60AC0]] INFO  org.apache.solr.core.CoreContainer  ? New CoreContainer 247355015
[junit4:junit4]   1> 123928 [TEST-TestSolrProperties.testProperties-seed#[9AD7FA0840C60AC0]] INFO  org.apache.solr.core.CoreContainer  ? Loading CoreContainer using Solr Home: '/Users/jenkins/jenkins-slave/workspace/Lucene-Solr-4.x-MacOSX/solr/solrj/src/test-files/solrj/solr/shared'
[junit4:junit4]   1> 123929 [TEST-TestSolrProperties.testProperties-seed#[9AD7FA0840C60AC0]] INFO  org.apache.solr.core.SolrResourceLoader  ? new SolrResourceLoader for directory: '/Users/jenkins/jenkins-slave/workspace/Lucene-Solr-4.x-MacOSX/solr/solrj/src/test-files/solrj/solr/shared/'
[junit4:junit4]   1> 124319 [TEST-TestSolrProperties.testProperties-seed#[9AD7FA0840C60AC0]] INFO  org.apache.solr.handler.component.HttpShardHandlerFactory  ? Setting socketTimeout to: 0
[junit4:junit4]   1> 124322 [TEST-TestSolrProperties.testProperties-seed#[9AD7FA0840C60AC0]] INFO  org.apache.solr.handler.component.HttpShardHandlerFactory  ? Setting urlScheme to: http://
[junit4:junit4]   1> 124323 [TEST-TestSolrProperties.testProperties-seed#[9AD7FA0840C60AC0]] INFO  org.apache.solr.handler.component.HttpShardHandlerFactory  ? Setting connTimeout to: 0
[junit4:junit4]   1> 124324 [TEST-TestSolrProperties.testProperties-seed#[9AD7FA0840C60AC0]] INFO  org.apache.solr.handler.component.HttpShardHandlerFactory  ? Setting maxConnectionsPerHost to: 20
[junit4:junit4]   1> 124325 [TEST-TestSolrProperties.testProperties-seed#[9AD7FA0840C60AC0]] INFO  org.apache.solr.handler.component.HttpShardHandlerFactory  ? Setting corePoolSize to: 0
[junit4:junit4]   1> 124326 [TEST-TestSolrProperties.testProperties-seed#[9AD7FA0840C60AC0]] INFO  org.apache.solr.handler.component.HttpShardHandlerFactory  ? Setting maximumPoolSize to: 2147483647
[junit4:junit4]   1> 124327 [TEST-TestSolrProperties.testProperties-seed#[9AD7FA0840C60AC0]] INFO  org.apache.solr.handler.component.HttpShardHandlerFactory  ? Setting maxThreadIdleTime to: 5
[junit4:junit4]   1> 124328 [TEST-TestSolrProperties.testProperties-seed#[9AD7FA0840C60AC0]] INFO  org.apache.solr.handler.component.HttpShardHandlerFactory  ? Setting sizeOfQueue to: -1
[junit4:junit4]   1> 124329 [TEST-TestSolrProperties.testProperties-seed#[9AD7FA0840C60AC0]] INFO  org.apache.solr.handler.component.HttpShardHandlerFactory  ? Setting fairnessPolicy to: false
[junit4:junit4]   1> 124330 [TEST-TestSolrProperties.testProperties-seed#[9AD7FA0840C60AC0]] INFO  org.apache.solr.client.solrj.impl.HttpClientUtil  ? Creating new http client, config:maxConnectionsPerHost=20&maxConnections=10000&socketTimeout=0&connTimeout=0&retry=false
[junit4:junit4]   1> 124431 [TEST-TestSolrProperties.testProperties-seed#[9AD7FA0840C60AC0]] INFO  org.apache.solr.logging.LogWatcher  ? Registering Log Listener
[junit4:junit4]   1> 124515 [coreLoadExecutor-76-thread-1] INFO  org.apache.solr.core.CoreContainer  ? Creating SolrCore 'collection1' using instanceDir: /Users/jenkins/jenkins-slave/workspace/Lucene-Solr-4.x-MacOSX/solr/solrj/src/test-files/solrj/solr/shared/.
[junit4:junit4]   1> 124528 [coreLoadExecutor-76-thread-1] INFO  org.apache.solr.core.SolrResourceLoader  ? new SolrResourceLoader for directory: '/Users/jenkins/jenkins-slave/workspace/Lucene-Solr-4.x-MacOSX/solr/solrj/src/test-files/solrj/solr/shared/./'
[junit4:junit4]   1> 124537 [coreLoadExecutor-76-thread-3] INFO  org.apache.solr.core.CoreContainer  ? Creating SolrCore 'core1' using instanceDir: /Users/jenkins/jenkins-slave/workspace/Lucene-Solr-4.x-MacOSX/solr/solrj/src/test-files/solrj/solr/shared/.
[junit4:junit4]   1> 124541 [coreLoadExecutor-76-thread-2] INFO  org.apache.solr.core.CoreContainer  ? Creating SolrCore 'core0' using instanceDir: /Users/jenkins/jenkins-slave/workspace/Lucene-Solr-4.x-MacOSX/solr/solrj/src/test-files/solrj/solr/shared/.
[junit4:junit4]   1> 124562 [coreLoadExecutor-76-thread-2] INFO  org.apache.solr.core.SolrResourceLoader  ? new SolrResourceLoader for directory: '/Users/jenkins/jenkins-slave/workspace/Lucene-Solr-4.x-MacOSX/solr/solrj/src/test-files/solrj/solr/shared/./'
[junit4:junit4]   1> 124549 [coreLoadExecutor-76-thread-3] INFO  org.apache.solr.core.SolrResourceLoader  ? new SolrResourceLoader for directory: '/Users/jenkins/jenkins-slave/workspace/Lucene-Solr-4.x-MacOSX/solr/solrj/src/test-files/solrj/solr/shared/./'
[junit4:junit4]   1> 124946 [coreLoadExecutor-76-thread-1] INFO  org.apache.solr.core.SolrConfig  ? Using Lucene MatchVersion: LUCENE_44
[junit4:junit4]   1> 125057 [coreLoadExecutor-76-thread-3] INFO  org.apache.solr.core.SolrConfig  ? Using Lucene MatchVersion: LUCENE_44
[junit4:junit4]   1> 125082 [coreLoadExecutor-76-thread-2] INFO  org.apache.solr.core.SolrConfig  ? Using Lucene MatchVersion: LUCENE_44
[junit4:junit4]   1> 125443 [coreLoadExecutor-76-thread-1] INFO  org.apache.solr.core.Config  ? Loaded SolrConfig: solrconfig.xml
[junit4:junit4]   1> 125444 [coreLoadExecutor-76-thread-1] INFO  org.apache.solr.schema.IndexSchema  ? Reading Solr Schema from schema.xml
[junit4:junit4]   1> 125478 [coreLoadExecutor-76-thread-1] INFO  org.apache.solr.schema.IndexSchema  ? [collection1] Schema name=example core 
[junit4:junit4]   1> 125511 [coreLoadExecutor-76-thread-3] INFO  org.apache.solr.core.Config  ? Loaded SolrConfig: solrconfig.xml
[junit4:junit4]   1> 125513 [coreLoadExecutor-76-thread-3] INFO  org.apache.solr.schema.IndexSchema  ? Reading Solr Schema from schema.xml
[junit4:junit4]   1> 125547 [coreLoadExecutor-76-thread-3] INFO  org.apache.solr.schema.IndexSchema  ? [core1] Schema name=example core FR
[junit4:junit4]   1> 125652 [coreLoadExecutor-76-thread-2] INFO  org.apache.solr.core.Config  ? Loaded SolrConfig: solrconfig.xml
[junit4:junit4]   1> 125653 [coreLoadExecutor-76-thread-2] INFO  org.apache.solr.schema.IndexSchema  ? Reading Solr Schema from schema.xml
[junit4:junit4]   1> 125672 [coreLoadExecutor-76-thread-2] INFO  org.apache.solr.schema.IndexSchema  ? [core0] Schema name=example core EN
[junit4:junit4]   1> 125872 [coreLoadExecutor-76-thread-3] INFO  org.apache.solr.schema.IndexSchema  ? default search field in schema is name
[junit4:junit4]   1> 125877 [coreLoadExecutor-76-thread-3] INFO  org.apache.solr.schema.IndexSchema  ? query parser default operator is OR
[junit4:junit4]   1> 125885 [coreLoadExecutor-76-thread-3] INFO  org.apache.solr.schema.IndexSchema  ? unique key field: id
[junit4:junit4]   1> 125901 [coreLoadExecutor-76-thread-3] INFO  org.apache.solr.core.SolrCore  ? org.apache.solr.core.MockDirectoryFactory
[junit4:junit4]   1> 125902 [coreLoadExecutor-76-thread-3] INFO  org.apache.solr.core.SolrCore  ? [core1] Opening new SolrCore at /Users/jenkins/jenkins-slave/workspace/Lucene-Solr-4.x-MacOSX/solr/solrj/src/test-files/solrj/solr/shared/./, dataDir=/Users/jenkins/jenkins-slave/workspace/Lucene-Solr-4.x-MacOSX/solr/build/solr-solrj/test/J0/./solrtest-TestSolrProperties-1370959821259/data2/
[junit4:junit4]   1> 125903 [coreLoadExecutor-76-thread-3] INFO  org.apache.solr.core.SolrCore  ? JMX monitoring not detected for core: core1
[junit4:junit4]   1> 125904 [coreLoadExecutor-76-thread-3] INFO  org.apache.solr.core.SolrCore  ? org.apache.solr.core.MockDirectoryFactory
[junit4:junit4]   1> 125915 [coreLoadExecutor-76-thread-3] INFO  org.apache.solr.core.CachingDirectoryFactory  ? return new directory for /Users/jenkins/jenkins-slave/workspace/Lucene-Solr-4.x-MacOSX/solr/build/solr-solrj/test/J0/./solrtest-TestSolrProperties-1370959821259/data2
[junit4:junit4]   1> 125917 [coreLoadExecutor-76-thread-3] INFO  org.apache.solr.core.SolrCore  ? New index directory detected: old=null new=/Users/jenkins/jenkins-slave/workspace/Lucene-Solr-4.x-MacOSX/solr/build/solr-solrj/test/J0/./solrtest-TestSolrProperties-1370959821259/data2/index/
[junit4:junit4]   1> 125918 [coreLoadExecutor-76-thread-3] WARN  org.apache.solr.core.SolrCore  ? [core1] Solr index directory '/Users/jenkins/jenkins-slave/workspace/Lucene-Solr-4.x-MacOSX/solr/build/solr-solrj/test/J0/./solrtest-TestSolrProperties-1370959821259/data2/index' doesn't exist. Creating new index...
[junit4:junit4]   1> 125941 [coreLoadExecutor-76-thread-3] INFO  org.apache.solr.core.CachingDirectoryFactory  ? return new directory for /Users/jenkins/jenkins-slave/workspace/Lucene-Solr-4.x-MacOSX/solr/build/solr-solrj/test/J0/./solrtest-TestSolrProperties-1370959821259/data2/index
[junit4:junit4]   1> 125979 [coreLoadExecutor-76-thread-1] INFO  org.apache.solr.schema.IndexSchema  ? default search field in schema is name
[junit4:junit4]   1> 125988 [coreLoadExecutor-76-thread-1] INFO  org.apache.solr.schema.IndexSchema  ? query parser default operator is OR
[junit4:junit4]   1> 126003 [coreLoadExecutor-76-thread-1] INFO  org.apache.solr.schema.IndexSchema  ? unique key field: id
[junit4:junit4]   1> 126009 [coreLoadExecutor-76-thread-3] INFO  org.apache.solr.core.SolrCore  ? SolrDeletionPolicy.onCommit: commits: num=1
[junit4:junit4]   1> 	commit{dir=MockDirWrapper(org.apache.lucene.store.RAMDirectory@2d33d68a lockFactory=org.apache.lucene.store.NativeFSLockFactory@63e35108),segFN=segments_1,generation=1}
[junit4:junit4]   1> 126020 [coreLoadExecutor-76-thread-3] INFO  org.apache.solr.core.SolrCore  ? newest commit generation = 1
[junit4:junit4]   1> 126026 [coreLoadExecutor-76-thread-1] INFO  org.apache.solr.core.SolrCore  ? org.apache.solr.core.MockDirectoryFactory
[junit4:junit4]   1> 126027 [coreLoadExecutor-76-thread-1] INFO  org.apache.solr.core.SolrCore  ? [collection1] Opening new SolrCore at /Users/jenkins/jenkins-slave/workspace/Lucene-Solr-4.x-MacOSX/solr/solrj/src/test-files/solrj/solr/shared/./, dataDir=/Users/jenkins/jenkins-slave/workspace/Lucene-Solr-4.x-MacOSX/solr/build/solr-solrj/test/J0/./solrtest-TestSolrProperties-1370959821259/data/-1.3/
[junit4:junit4]   1> 126028 [coreLoadExecutor-76-thread-1] INFO  org.apache.solr.core.SolrCore  ? JMX monitoring not detected for core: collection1
[junit4:junit4]   1> 126029 [coreLoadExecutor-76-thread-1] INFO  org.apache.solr.core.SolrCore  ? org.apache.solr.core.MockDirectoryFactory
[junit4:junit4]   1> 126032 [coreLoadExecutor-76-thread-1] INFO  org.apache.solr.core.CachingDirectoryFactory  ? return new directory for /Users/jenkins/jenkins-slave/workspace/Lucene-Solr-4.x-MacOSX/solr/build/solr-solrj/test/J0/./solrtest-TestSolrProperties-1370959821259/data/-1.3
[junit4:junit4]   1> 126033 [coreLoadExecutor-76-thread-1] INFO  org.apache.solr.core.SolrCore  ? New index directory detected: old=null new=/Users/jenkins/jenkins-slave/workspace/Lucene-Solr-4.x-MacOSX/solr/build/solr-solrj/test/J0/./solrtest-TestSolrProperties-1370959821259/data/-1.3/index/
[junit4:junit4]   1> 126035 [coreLoadExecutor-76-thread-1] WARN  org.apache.solr.core.SolrCore  ? [collection1] Solr index directory '/Users/jenkins/jenkins-slave/workspace/Lucene-Solr-4.x-MacOSX/solr/build/solr-solrj/test/J0/./solrtest-TestSolrProperties-1370959821259/data/-1.3/index' doesn't exist. Creating new index...
[junit4:junit4]   1> 126039 [coreLoadExecutor-76-thread-1] INFO  org.apache.solr.core.CachingDirectoryFactory  ? return new directory for /Users/jenkins/jenkins-slave/workspace/Lucene-Solr-4.x-MacOSX/solr/build/solr-solrj/test/J0/./solrtest-TestSolrProperties-1370959821259/data/-1.3/index
[junit4:junit4]   1> 126039 [coreLoadExecutor-76-thread-3] INFO  org.apache.solr.core.RequestHandlers  ? created standard: solr.StandardRequestHandler
[junit4:junit4]   1> 126046 [coreLoadExecutor-76-thread-3] INFO  org.apache.solr.core.RequestHandlers  ? created /update: solr.UpdateRequestHandler
[junit4:junit4]   1> 126047 [coreLoadExecutor-76-thread-3] INFO  org.apache.solr.core.RequestHandlers  ? created /admin/: org.apache.solr.handler.admin.AdminHandlers
[junit4:junit4]   1> 126047 [coreLoadExecutor-76-thread-2] INFO  org.apache.solr.schema.IndexSchema  ? default search field in schema is name
[junit4:junit4]   1> 126055 [coreLoadExecutor-76-thread-2] INFO  org.apache.solr.schema.IndexSchema  ? query parser default operator is OR
[junit4:junit4]   1> 126057 [coreLoadExecutor-76-thread-1] INFO  org.apache.solr.core.SolrCore  ? SolrDeletionPolicy.onCommit: commits: num=1
[junit4:junit4]   1> 	commit{dir=MockDirWrapper(org.apache.lucene.store.RAMDirectory@7539f0bb lockFactory=org.apache.lucene.store.NativeFSLockFactory@5a1b5e32),segFN=segments_1,generation=1}
[junit4:junit4]   1> 126060 [coreLoadExecutor-76-thread-1] INFO  org.apache.solr.core.SolrCore  ? newest commit generation = 1
[junit4:junit4]   1> 126066 [coreLoadExecutor-76-thread-1] INFO  org.apache.solr.core.RequestHandlers  ? created standard: solr.StandardRequestHandler
[junit4:junit4]   1> 126068 [coreLoadExecutor-76-thread-1] INFO  org.apache.solr.core.RequestHandlers  ? created /update: solr.UpdateRequestHandler
[junit4:junit4]   1> 126069 [coreLoadExecutor-76-thread-1] INFO  org.apache.solr.core.RequestHandlers  ? created /admin/: org.apache.solr.handler.admin.AdminHandlers
[junit4:junit4]   1> 126086 [coreLoadExecutor-76-thread-1] INFO  org.apache.solr.handler.loader.XMLLoader  ? xsltCacheLifetimeSeconds=60
[junit4:junit4]   1> 126096 [coreLoadExecutor-76-thread-2] INFO  org.apache.solr.schema.IndexSchema  ? unique key field: id
[junit4:junit4]   1> 126120 [coreLoadExecutor-76-thread-1] INFO  org.apache.solr.search.SolrIndexSearcher  ? Opening Searcher@64383ed6 main
[junit4:junit4]   1> 126126 [coreLoadExecutor-76-thread-1] INFO  org.apache.solr.update.UpdateHandler  ? Clearing tlog files, tlogDir=/Users/jenkins/jenkins-slave/workspace/Lucene-Solr-4.x-MacOSX/solr/build/solr-solrj/test/J0/./solrtest-TestSolrProperties-1370959821259/data/-1.3/tlog
[junit4:junit4]   1> 126128 [coreLoadExecutor-76-thread-2] INFO  org.apache.solr.core.SolrCore  ? org.apache.solr.core.MockDirectoryFactory
[junit4:junit4]   1> 126129 [coreLoadExecutor-76-thread-2] INFO  org.apache.solr.core.SolrCore  ? [core0] Opening new SolrCore at /Users/jenkins/jenkins-slave/workspace/Lucene-Solr-4.x-MacOSX/solr/solrj/src/test-files/solrj/solr/shared/./, dataDir=/Users/jenkins/jenkins-slave/workspace/Lucene-Solr-4.x-MacOSX/solr/build/solr-solrj/test/J0/./solrtest-TestSolrProperties-1370959821259/data1/
[junit4:junit4]   1> 126130 [coreLoadExecutor-76-thread-2] INFO  org.apache.solr.core.SolrCore  ? JMX monitoring not detected for core: core0
[junit4:junit4]   1> 126123 [coreLoadExecutor-76-thread-3] INFO  org.apache.solr.handler.loader.XMLLoader  ? xsltCacheLifetimeSeconds=60
[junit4:junit4]   1> 126132 [coreLoadExecutor-76-thread-2] INFO  org.apache.solr.core.SolrCore  ? org.apache.solr.core.MockDirectoryFactory
[junit4:junit4]   1> 126129 [coreLoadExecutor-76-thread-1] INFO  org.apache.solr.core.SolrCore  ? Hard AutoCommit: disabled
[junit4:junit4]   1> 126137 [coreLoadExecutor-76-thread-1] INFO  org.apache.solr.core.SolrCore  ? Soft AutoCommit: disabled
[junit4:junit4]   1> 126139 [coreLoadExecutor-76-thread-1] INFO  org.apache.solr.core.CoreContainer  ? registering core: collection1
[junit4:junit4]   1> 126140 [coreLoadExecutor-76-thread-2] INFO  org.apache.solr.core.CachingDirectoryFactory  ? return new directory for /Users/jenkins/jenkins-slave/workspace/Lucene-Solr-4.x-MacOSX/solr/build/solr-solrj/test/J0/./solrtest-TestSolrProperties-1370959821259/data1
[junit4:junit4]   1> 126143 [coreLoadExecutor-76-thread-2] INFO  org.apache.solr.core.SolrCore  ? New index directory detected: old=null new=/Users/jenkins/jenkins-slave/workspace/Lucene-Solr-4.x-MacOSX/solr/build/solr-solrj/test/J0/./solrtest-TestSolrProperties-1370959821259/data1/index/
[junit4:junit4]   1> 126139 [searcherExecutor-78-thread-1] INFO  org.apache.solr.core.SolrCore  ? [collection1] Registered new searcher Searcher@64383ed6 main{StandardDirectoryReader(segments_1:1)}
[junit4:junit4]   1> 126146 [coreLoadExecutor-76-thread-3] INFO  org.apache.solr.search.SolrIndexSearcher  ? Opening Searcher@b0e2096 main
[junit4:junit4]   1> 126145 [coreLoadExecutor-76-thread-2] WARN  org.apache.solr.core.SolrCore  ? [core0] Solr index directory '/Users/jenkins/jenkins-slave/workspace/Lucene-Solr-4.x-MacOSX/solr/build/solr-solrj/test/J0/./solrtest-TestSolrProperties-1370959821259/data1/index' doesn't exist. Creating new index...
[junit4:junit4]   1> 126148 [coreLoadExecutor-76-thread-3] INFO  org.apache.solr.update.UpdateHandler  ? Clearing tlog files, tlogDir=/Users/jenkins/jenkins-slave/workspace/Lucene-Solr-4.x-MacOSX/solr/build/solr-solrj/test/J0/./solrtest-TestSolrProperties-1370959821259/data2/tlog
[junit4:junit4]   1> 126152 [coreLoadExecutor-76-thread-3] INFO  org.apache.solr.core.SolrCore  ? Hard AutoCommit: disabled
[junit4:junit4]   1> 126153 [coreLoadExecutor-76-thread-3] INFO  org.apache.solr.core.SolrCore  ? Soft AutoCommit: disabled
[junit4:junit4]   1> 126156 [searcherExecutor-77-thread-1] INFO  org.apache.solr.core.SolrCore  ? [core1] Registered new searcher Searcher@b0e2096 main{StandardDirectoryReader(segments_1:1)}
[junit4:junit4]   1> 126159 [coreLoadExecutor-76-thread-3] INFO  org.apache.solr.core.CoreContainer  ? registering core: core1
[junit4:junit4]   1> 126149 [coreLoadExecutor-76-thread-2] INFO  org.apache.solr.core.CachingDirectoryFactory  ? return new directory for /Users/jenkins/jenkins-slave/workspace/Lucene-Solr-4.x-MacOSX/solr/build/solr-solrj/test/J0/./solrtest-TestSolrProperties-1370959821259/data1/index
[junit4:junit4]   1> 126194 [coreLoadExecutor-76-thread-2] INFO  org.apache.solr.core.SolrCore  ? SolrDeletionPolicy.onCommit: commits: num=1
[junit4:junit4]   1> 	commit{dir=MockDirWrapper(org.apache.lucene.store.RAMDirectory@4c7d5d85 lockFactory=org.apache.lucene.store.NativeFSLockFactory@4f86a67),segFN=segments_1,generation=1}
[junit4:junit4]   1> 126195 [coreLoadExecutor-76-thread-2] INFO  org.apache.solr.core.SolrCore  ? newest commit generation = 1
[junit4:junit4]   1> 126218 [coreLoadExecutor-76-thread-2] INFO  org.apache.solr.core.RequestHandlers  ? created standard: solr.StandardRequestHandler
[junit4:junit4]   1> 126220 [coreLoadExecutor-76-thread-2] INFO  org.apache.solr.core.RequestHandlers  ? created /update: solr.UpdateRequestHandler
[junit4:junit4]   1> 126222 [coreLoadExecutor-76-thread-2] INFO  org.apache.solr.core.RequestHandlers  ? created /admin/: org.apache.solr.handler.admin.AdminHandlers
[junit4:junit4]   1> 126239 [coreLoadExecutor-76-thread-2] INFO  org.apache.solr.handler.loader.XMLLoader  ? xsltCacheLifetimeSeconds=60
[junit4:junit4]   1> 126278 [coreLoadExecutor-76-thread-2] INFO  org.apache.solr.search.SolrIndexSearcher  ? Opening Searcher@11286929 main
[junit4:junit4]   1> 126280 [coreLoadExecutor-76-thread-2] INFO  org.apache.solr.update.UpdateHandler  ? Clearing tlog files, tlogDir=/Users/jenkins/jenkins-slave/workspace/Lucene-Solr-4.x-MacOSX/solr/build/solr-solrj/test/J0/./solrtest-TestSolrProperties-1370959821259/data1/tlog
[junit4:junit4]   1> 126283 [coreLoadExecutor-76-thread-2] INFO  org.apache.solr.core.SolrCore  ? Hard AutoCommit: disabled
[junit4:junit4]   1> 126284 [coreLoadExecutor-76-thread-2] INFO  org.apache.solr.core.SolrCore  ? Soft AutoCommit: disabled
[junit4:junit4]   1> 126288 [coreLoadExecutor-76-thread-2] INFO  org.apache.solr.core.CoreContainer  ? registering core: core0
[junit4:junit4]   1> 126291 [searcherExecutor-79-thread-1] INFO  org.apache.solr.core.SolrCore  ? [core0] Registered new searcher Searcher@11286929 main{StandardDirectoryReader(segments_1:1)}
[junit4:junit4]   1> 126300 [TEST-TestSolrProperties.testProperties-seed#[9AD7FA0840C60AC0]] INFO  org.apache.solr.core.SolrCore  ? SolrDeletionPolicy.onInit: commits: num=1
[junit4:junit4]   1> 	commit{dir=MockDirWrapper(org.apache.lucene.store.RAMDirectory@4c7d5d85 lockFactory=org.apache.lucene.store.NativeFSLockFactory@4f86a67),segFN=segments_1,generation=1}
[junit4:junit4]   1> 126302 [TEST-TestSolrProperties.testProperties-seed#[9AD7FA0840C60AC0]] INFO  org.apache.solr.core.SolrCore  ? newest commit generation = 1
[junit4:junit4]   1> 126306 [TEST-TestSolrProperties.testProperties-seed#[9AD7FA0840C60AC0]] INFO  org.apache.solr.search.SolrIndexSearcher  ? Opening Searcher@1ddf7713 realtime
[junit4:junit4]   1> 126310 [TEST-TestSolrProperties.testProperties-seed#[9AD7FA0840C60AC0]] INFO  org.apache.solr.update.UpdateHandler  ? start commit{,optimize=false,openSearcher=true,waitSearcher=true,expungeDeletes=false,softCommit=false,prepareCommit=false}
[junit4:junit4]   1> 126316 [TEST-TestSolrProperties.testProperties-seed#[9AD7FA0840C60AC0]] INFO  org.apache.solr.core.SolrCore  ? SolrDeletionPolicy.onCommit: commits: num=2
[junit4:junit4]   1> 	commit{dir=MockDirWrapper(org.apache.lucene.store.RAMDirectory@4c7d5d85 lockFactory=org.apache.lucene.store.NativeFSLockFactory@4f86a67),segFN=segments_1,generation=1}
[junit4:junit4]   1> 	commit{dir=MockDirWrapper(org.apache.lucene.store.RAMDirectory@4c7d5d85 lockFactory=org.apache.lucene.store.NativeFSLockFactory@4f86a67),segFN=segments_2,generation=2}
[junit4:junit4]   1> 126320 [TEST-TestSolrProperties.testProperties-seed#[9AD7FA0840C60AC0]] INFO  org.apache.solr.core.SolrCore  ? newest commit generation = 2
[junit4:junit4]   1> 126332 [TEST-TestSolrProperties.testProperties-seed#[9AD7FA0840C60AC0]] INFO  org.apache.solr.search.SolrIndexSearcher  ? Opening Searcher@6c60efe7 main
[junit4:junit4]   1> 126338 [TEST-TestSolrProperties.testProperties-seed#[9AD7FA0840C60AC0]] INFO  org.apache.solr.update.UpdateHandler  ? end_commit_flush
[junit4:junit4]   1> 126338 [searcherExecutor-79-thread-1] INFO  org.apache.solr.core.SolrCore  ? [core0] Registered new searcher Searcher@6c60efe7 main{StandardDirectoryReader(segments_1:1:nrt)}
[junit4:junit4]   1> 126341 [TEST-TestSolrProperties.testProperties-seed#[9AD7FA0840C60AC0]] INFO  org.apache.solr.update.processor.LogUpdateProcessor  ? [core0] webapp=null path=/update params={commit=true&softCommit=false&waitSearcher=true} {deleteByQuery=*:* (-1437555568023699456),commit=} 0 50
[junit4:junit4]   1> 126357 [TEST-TestSolrProperties.testProperties-seed#[9AD7FA0840C60AC0]] INFO  org.apache.solr.core.SolrCore  ? SolrDeletionPolicy.onInit: commits: num=1
[junit4:junit4]   1> 	commit{dir=MockDirWrapper(org.apache.lucene.store.RAMDirectory@2d33d68a lockFactory=org.apache.lucene.store.NativeFSLockFactory@63e35108),segFN=segments_1,generation=1}
[junit4:junit4]   1> 126358 [TEST-TestSolrProperties.testProperties-seed#[9AD7FA0840C60AC0]] INFO  org.apache.solr.core.SolrCore  ? newest commit generation = 1
[junit4:junit4]   1> 126362 [TEST-TestSolrProperties.testProperties-seed#[9AD7FA0840C60AC0]] INFO  org.apache.solr.search.SolrIndexSearcher  ? Opening Searcher@454e3bb0 realtime
[junit4:junit4]   1> 126363 [TEST-TestSolrProperties.testProperties-seed#[9AD7FA0840C60AC0]] INFO  org.apache.solr.update.UpdateHandler  ? start commit{,optimize=false,openSearcher=true,waitSearcher=true,expungeDeletes=false,softCommit=false,prepareCommit=false}
[junit4:junit4]   1> 126365 [TEST-TestSolrProperties.testProperties-seed#[9AD7FA0840C60AC0]] INFO  org.apache.solr.core.SolrCore  ? SolrDeletionPolicy.onCommit: commits: num=2
[junit4:junit4]   1> 	commit{dir=MockDirWrapper(org.apache.lucene.store.RAMDirectory@2d33d68a lockFactory=org.apache.lucene.store.NativeFSLockFactory@63e35108),segFN=segments_1,generation=1}
[junit4:junit4]   1> 	commit{dir=MockDirWrapper(org.apache.lucene.store.RAMDirectory@2d33d68a lockFactory=org.apache.lucene.store.NativeFSLockFactory@63e35108),segFN=segments_2,generation=2}
[junit4:junit4]   1> 126366 [TEST-TestSolrProperties.testProperties-seed#[9AD7FA0840C60AC0]] INFO  org.apache.solr.core.SolrCore  ? newest commit generation = 2
[junit4:junit4]   1> 126367 [TEST-TestSolrProperties.testProperties-seed#[9AD7FA0840C60AC0]] INFO  org.apache.solr.search.SolrIndexSearcher  ? Opening Searcher@3cdb8522 main
[junit4:junit4]   1> 126369 [TEST-TestSolrProperties.testProperties-seed#[9AD7FA0840C60AC0]] INFO  org.apache.solr.update.UpdateHandler  ? end_commit_flush
[junit4:junit4]   1> 126371 [searcherExecutor-77-thread-1] INFO  org.apache.solr.core.SolrCore  ? [core1] Registered new searcher Searcher@3cdb8522 main{StandardDirectoryReader(segments_1:1:nrt)}
[junit4:junit4]   1> 126372 [TEST-TestSolrProperties.testProperties-seed#[9AD7FA0840C60AC0]] INFO  org.apache.solr.update.processor.LogUpdateProcessor  ? [core1] webapp=null path=/update params={commit=true&softCommit=false&waitSearcher=true} {deleteByQuery=*:* (-1437555568076128256),commit=} 0 28
[junit4:junit4]   1> 126398 [TEST-TestSolrProperties.testProperties-seed#[9AD7FA0840C60AC0]] INFO  org.apache.solr.update.UpdateHandler  ? start commit{,optimize=false,openSearcher=true,waitSearcher=true,expungeDeletes=false,softCommit=false,prepareCommit=false}
[junit4:junit4]   1> 126696 [TEST-TestSolrProperties.testProperties-seed#[9AD7FA0840C60AC0]] INFO  org.apache.solr.core.SolrCore  ? SolrDeletionPolicy.onCommit: commits: num=2
[junit4:junit4]   1> 	commit{dir=MockDirWrapper(org.apache.lucene.store.RAMDirectory@4c7d5d85 lockFactory=org.apache.lucene.store.NativeFSLockFactory@4f86a67),segFN=segments_2,generation=2}
[junit4:junit4]   1> 	commit{dir=MockDirWrapper(org.apache.lucene.store.RAMDirectory@4c7d5d85 lockFactory=org.apache.lucene.store.NativeFSLockFactory@4f86a67),segFN=segments_3,generation=3}
[junit4:junit4]   1> 126698 [TEST-TestSolrProperties.testProperties-seed#[9AD7FA0840C60AC0]] INFO  org.apache.solr.core.SolrCore  ? newest commit generation = 3
[junit4:junit4]   1> 126949 [TEST-TestSolrProperties.testProperties-seed#[9AD7FA0840C60AC0]] INFO  org.apache.solr.search.SolrIndexSearcher  ? Opening Searcher@22223c66 main
[junit4:junit4]   1> 126951 [TEST-TestSolrProperties.testProperties-seed#[9AD7FA0840C60AC0]] INFO  org.apache.solr.update.UpdateHandler  ? end_commit_flush
[junit4:junit4]   1> 126953 [searcherExecutor-79-thread-1] INFO  org.apache.solr.core.SolrCore  ? [core0] Registered new searcher Searcher@22223c66 main{StandardDirectoryReader(segments_3:3:nrt _0(4.4):C1)}
[junit4:junit4]   1> 126966 [TEST-TestSolrProperties.testProperties-seed#[9AD7FA0840C60AC0]] INFO  org.apache.solr.update.processor.LogUpdateProcessor  ? [core0] webapp=null path=/update params={commit=true&softCommit=false&waitSearcher=true} {add=[AAA (1437555568107585536)],commit=} 0 592
[junit4:junit4]   1> 126968 [TEST-TestSolrProperties.testProperties-seed#[9AD7FA0840C60AC0]] INFO  org.apache.solr.update.processor.LogUpdateProcessor  ? [core1] webapp=null path=/update params={commit=true&softCommit=false&waitSearcher=true} {} 0 0
[junit4:junit4]   1> 126971 [TEST-TestSolrProperties.testProperties-seed#[9AD7FA0840C60AC0]] INFO  org.apache.solr.core.SolrCore  ? Ignoring exception matching unknown field
[junit4:junit4]   1> 126992 [TEST-TestSolrProperties.testProperties-seed#[9AD7FA0840C60AC0]] INFO  org.apache.solr.update.UpdateHandler  ? start commit{,optimize=false,openSearcher=true,waitSearcher=true,expungeDeletes=false,softCommit=false,prepareCommit=false}
[junit4:junit4]   1> 127015 [TEST-TestSolrProperties.testProperties-seed#[9AD7FA0840C60AC0]] INFO  org.apache.solr.core.SolrCore  ? SolrDeletionPolicy.onCommit: commits: num=2
[junit4:junit4]   1> 	commit{dir=MockDirWrapper(org.apache.lucene.store.RAMDirectory@2d33d68a lockFactory=org.apache.lucene.store.NativeFSLockFactory@63e35108),segFN=segments_2,generation=2}
[junit4:junit4]   1> 	commit{dir=MockDirWrapper(org.apache.lucene.store.RAMDirectory@2d33d68a lockFactory=org.apache.lucene.store.NativeFSLockFactory@63e35108),segFN=segments_3,generation=3}
[junit4:junit4]   1> 127017 [TEST-TestSolrProperties.testProperties-seed#[9AD7FA0840C60AC0]] INFO  org.apache.solr.core.SolrCore  ? newest commit generation = 3
[junit4:junit4]   1> 127024 [TEST-TestSolrProperties.testProperties-seed#[9AD7FA0840C60AC0]] INFO  org.apache.solr.search.SolrIndexSearcher  ? Opening Searcher@17ccad9c main
[junit4:junit4]   1> 127025 [searcherExecutor-77-thread-1] INFO  org.apache.solr.core.SolrCore  ? [core1] Registered new searcher Searcher@17ccad9c main{StandardDirectoryReader(segments_3:3:nrt _0(4.4):C2/1)}
[junit4:junit4]   1> 127026 [TEST-TestSolrProperties.testProperties-seed#[9AD7FA0840C60AC0]] INFO  org.apache.solr.update.UpdateHandler  ? end_commit_flush
[junit4:junit4]   1> 127027 [TEST-TestSolrProperties.testProperties-seed#[9AD7FA0840C60AC0]] INFO  org.apache.solr.update.processor.LogUpdateProcessor  ? [core1] webapp=null path=/update params={commit=true&softCommit=false&waitSearcher=true} {add=[BBB (1437555568735682560), BBB (1437555568753508352)],commit=} 0 54
[junit4:junit4]   1> 127029 [TEST-TestSolrProperties.testProperties-seed#[9AD7FA0840C60AC0]] INFO  org.apache.solr.update.processor.LogUpdateProcessor  ? [core0] webapp=null path=/update params={commit=true&softCommit=false&waitSearcher=true} {} 0 1
[junit4:junit4]   1> 127030 [TEST-TestSolrProperties.testProperties-seed#[9AD7FA0840C60AC0]] INFO  org.apache.solr.core.SolrCore  ? Ignoring exception matching unknown field
[junit4:junit4]   1> 127070 [TEST-TestSolrProperties.testProperties-seed#[9AD7FA0840C60AC0]] INFO  org.apache.solr.core.SolrCore  ? [core0] webapp=null path=/select params={q=id%3AAAA} hits=1 status=0 QTime=39 
[junit4:junit4]   1> 127073 [TEST-TestSolrProperties.testProperties-seed#[9AD7FA0840C60AC0]] INFO  org.apache.solr.core.SolrCore  ? [core1] webapp=null path=/select params={q=id%3AAAA} hits=0 status=0 QTime=1 
[junit4:junit4]   1> 127075 [TEST-TestSolrProperties.testProperties-seed#[9AD7FA0840C60AC0]] INFO  org.apache.solr.core.SolrCore  ? [core0] webapp=null path=/select params={q=id%3AAAA} hits=1 status=0 QTime=1 
[junit4:junit4]   1> 127084 [TEST-TestSolrProperties.testProperties-seed#[9AD7FA0840C60AC0]] INFO  org.apache.solr.core.SolrCore  ? [core0] webapp=null path=/select params={q=id%3ABBB} hits=0 status=0 QTime=1 
[junit4:junit4]   1> 127087 [TEST-TestSolrProperties.testProperties-seed#[9AD7FA0840C60AC0]] INFO  org.apache.solr.core.SolrCore  ? [core1] webapp=null path=/select params={q=id%3AAAA} hits=0 status=0 QTime=1 
[junit4:junit4]   1> 127089 [TEST-TestSolrProperties.testProperties-seed#[9AD7FA0840C60AC0]] INFO  org.apache.solr.core.SolrCore  ? [core1] webapp=null path=/select params={q=id%3ABBB} hits=1 status=0 QTime=1 
[junit4:junit4]   1> 127111 [TEST-TestSolrProperties.testProperties-seed#[9AD7FA0840C60AC0]] INFO  org.apache.solr.core.SolrCore  ? [core0] webapp=null path=/admin/cores params={action=STATUS&core=core0&indexInfo=true} status=0 QTime=21 
[junit4:junit4]   1> 127112 [TEST-TestSolrProperties.testProperties-seed#[9AD7FA0840C60AC0]] INFO  org.apache.solr.core.CoreContainer  ? Reloading SolrCore 'core0' using instanceDir: /Users/jenkins/jenkins-slave/workspace/Lucene-Solr-4.x-MacOSX/solr/solrj/src/test-files/solrj/solr/shared/.
[junit4:junit4]   1> 127114 [TEST-TestSolrProperties.testProperties-seed#[9AD7FA0840C60AC0]] INFO  org.apache.solr.core.SolrResourceLoader  ? new SolrResourceLoader for directory: '/Users/jenkins/jenkins-slave/workspace/Lucene-Solr-4.x-MacOSX/solr/solrj/src/test-files/solrj/solr/shared/./'
[junit4:junit4]   1> 127320 [TEST-TestSolrProperties.testProperties-seed#[9AD7FA0840C60AC0]] INFO  org.apache.solr.core.SolrConfig  ? Using Lucene MatchVersion: LUCENE_44
[junit4:junit4]   1> 127476 [TEST-TestSolrProperties.testProperties-seed#[9AD7FA0840C60AC0]] INFO  org.apache.solr.core.Config  ? Loaded SolrConfig: solrconfig.xml
[junit4:junit4]   1> 127478 [TEST-TestSolrProperties.testProperties-seed#[9AD7FA0840C60AC0]] INFO  org.apache.solr.schema.IndexSchema  ? Reading Solr Schema from schema.xml
[junit4:junit4]   1> 127495 [TEST-TestSolrProperties.testProperties-seed#[9AD7FA0840C60AC0]] INFO  org.apache.solr.schema.IndexSchema  ? [core0] Schema name=example core EN
[junit4:junit4]   1> 127624 [TEST-TestSolrProperties.testProperties-seed#[9AD7FA0840C60AC0]] INFO  org.apache.solr.schema.IndexSchema  ? default search field in schema is name
[junit4:junit4]   1> 127628 [TEST-TestSolrProperties.testProperties-seed#[9AD7FA0840C60AC0]] INFO  org.apache.solr.schema.IndexSchema  ? query parser default operator is OR
[junit4:junit4]   1> 127632 [TEST-TestSolrProperties.testProperties-seed#[9AD7FA0840C60AC0]] INFO  org.apache.solr.schema.IndexSchema  ? unique key field: id
[junit4:junit4]   1> 127647 [TEST-TestSolrProperties.testProperties-seed#[9AD7FA0840C60AC0]] INFO  org.apache.solr.core.SolrCore  ? [core0] Opening new SolrCore at /Users/jenkins/jenkins-slave/workspace/Lucene-Solr-4.x-MacOSX/solr/solrj/src/test-files/solrj/solr/shared/./, dataDir=/Users/jenkins/jenkins-slave/workspace/Lucene-Solr-4.x-MacOSX/solr/build/solr-solrj/test/J0/./solrtest-TestSolrProperties-1370959821259/data1/
[junit4:junit4]   1> 127648 [TEST-TestSolrProperties.testProperties-seed#[9AD7FA0840C60AC0]] INFO  org.apache.solr.core.SolrCore  ? JMX monitoring not detected for core: core0
[junit4:junit4]   1> 127648 [TEST-TestSolrProperties.testProperties-seed#[9AD7FA0840C60AC0]] INFO  org.apache.solr.core.SolrCore  ? New index directory detected: old=null new=/Users/jenkins/jenkins-slave/workspace/Lucene-Solr-4.x-MacOSX/solr/build/solr-solrj/test/J0/./solrtest-TestSolrProperties-1370959821259/data1/index/
[junit4:junit4]   1> 127658 [TEST-TestSolrProperties.testProperties-seed#[9AD7FA0840C60AC0]] INFO  org.apache.solr.core.RequestHandlers  ? created standard: solr.StandardRequestHandler
[junit4:junit4]   1> 127660 [TEST-TestSolrProperties.testProperties-seed#[9AD7FA0840C60AC0]] INFO  org.apache.solr.core.RequestHandlers  ? created /update: solr.UpdateRequestHandler
[junit4:junit4]   1> 127670 [TEST-TestSolrProperties.testProperties-seed#[9AD7FA0840C60AC0]] INFO  org.apache.solr.core.RequestHandlers  ? created /admin/: org.apache.solr.handler.admin.AdminHandlers
[junit4:junit4]   1> 127684 [TEST-TestSolrProperties.testProperties-seed#[9AD7FA0840C60AC0]] INFO  org.apache.solr.handler.loader.XMLLoader  ? xsltCacheLifetimeSeconds=60
[junit4:junit4]   1> 127710 [TEST-TestSolrProperties.testProperties-seed#[9AD7FA0840C60AC0]] INFO  org.apache.solr.search.SolrIndexSearcher  ? Opening Searcher@2d4cadc4 main
[junit4:junit4]   1> 127712 [TEST-TestSolrProperties.testProperties-seed#[9AD7FA0840C60AC0]] INFO  org.apache.solr.core.SolrCore  ? Hard AutoCommit: disabled
[junit4:junit4]   1> 127714 [TEST-TestSolrProperties.testProperties-seed#[9AD7FA0840C60AC0]] INFO  org.apache.solr.core.SolrCore  ? Soft AutoCommit: disabled
[junit4:junit4]   1> 127716 [TEST-TestSolrProperties.testProperties-seed#[9AD7FA0840C60AC0]] INFO  org.apache.solr.update.DefaultSolrCoreState  ? Creating new IndexWriter...
[junit4:junit4]   1> 127716 [TEST-TestSolrProperties.testProperties-seed#[9AD7FA0840C60AC0]] INFO  org.apache.solr.update.DefaultSolrCoreState  ? Waiting until IndexWriter is unused... core=core0
[junit4:junit4]   1> 127717 [TEST-TestSolrProperties.testProperties-seed#[9AD7FA0840C60AC0]] INFO  org.apache.solr.update.DefaultSolrCoreState  ? Closing old IndexWriter... core=core0
[junit4:junit4]   1> 127723 [TEST-TestSolrProperties.testProperties-seed#[9AD7FA0840C60AC0]] INFO  org.apache.solr.core.SolrCore  ? SolrDeletionPolicy.onInit: commits: num=1
[junit4:junit4]   1> 	commit{dir=MockDirWrapper(org.apache.lucene.store.RAMDirectory@4c7d5d85 lockFactory=org.apache.lucene.store.NativeFSLockFactory@4f86a67),segFN=segments_3,generation=3}
[junit4:junit4]   1> 127724 [TEST-TestSolrProperties.testProperties-seed#[9AD7FA0840C60AC0]] INFO  org.apache.solr.core.SolrCore  ? newest commit generation = 3
[junit4:junit4]   1> 127725 [TEST-TestSolrProperties.testProperties-seed#[9AD7FA0840C60AC0]] INFO  org.apache.solr.update.DefaultSolrCoreState  ? New IndexWriter is ready to be used.
[junit4:junit4]   1> 127725 [TEST-TestSolrProperties.testProperties-seed#[9AD7FA0840C60AC0]] WARN  org.apache.solr.core.SolrCore  ? [core0] PERFORMANCE WARNING: Overlapping onDeckSearchers=2
[junit4:junit4]   1> 127732 [searcherExecutor-89-thread-1] INFO  org.apache.solr.core.SolrCore  ? [core0] Registered new searcher Searcher@2d4cadc4 main{StandardDirectoryReader(segments_3:3:nrt _0(4.4):C1)}
[junit4:junit4]   1> 127737 [TEST-TestSolrProperties.testProperties-seed#[9AD7FA0840C60AC0]] INFO  org.apache.solr.search.SolrIndexSearcher  ? Opening Searcher@516fa2a5 main
[junit4:junit4]   1> 127744 [searcherExecutor-89-thread-1] INFO  org.apache.solr.core.SolrCore  ? [core0] Registered new searcher Searcher@516fa2a5 main{StandardDirectoryReader(segments_3:3:nrt _0(4.4):C1)}
[junit4:junit4]   1> 127745 [TEST-TestSolrProperties.testProperties-seed#[9AD7FA0840C60AC0]] INFO  org.apache.solr.core.CoreContainer  ? replacing core: core0
[junit4:junit4]   1> 127749 [TEST-TestSolrProperties.testProperties-seed#[9AD7FA0840C60AC0]] INFO  org.apache.solr.core.SolrCore  ? [core0] webapp=null path=/admin/cores params={action=RELOAD&core=core0&indexInfo=true} status=0 QTime=636 
[junit4:junit4]   1> 127753 [TEST-TestSolrProperties.testProperties-seed#[9AD7FA0840C60AC0]] INFO  org.apache.solr.core.SolrCore  ? [core0]  CLOSING SolrCore org.apache.solr.core.SolrCore@c74cc70
[junit4:junit4]   1> 127754 [TEST-TestSolrProperties.testProperties-seed#[9AD7FA0840C60AC0]] INFO  org.apache.solr.update.UpdateHandler  ? closing DirectUpdateHandler2{commits=2,autocommits=0,soft autocommits=0,optimizes=0,rollbacks=0,expungeDeletes=0,docsPending=0,adds=1,deletesById=0,deletesByQuery=0,errors=1,cumulative_adds=2,cumulative_deletesById=0,cumulative_deletesByQuery=1,cumulative_errors=1}
[junit4:junit4]   1> 127757 [TEST-TestSolrProperties.testProperties-seed#[9AD7FA0840C60AC0]] INFO  org.apache.solr.core.SolrCore  ? [core0] Closing main searcher on request.
[junit4:junit4]   1> 127760 [TEST-TestSolrProperties.testProperties-seed#[9AD7FA0840C60AC0]] INFO  org.apache.solr.core.SolrCore  ? [core0] webapp=null path=/admin/cores params={action=STATUS&core=core0&indexInfo=true} status=0 QTime=2 
[junit4:junit4]   1> 127769 [TEST-TestSolrProperties.testProperties-seed#[9AD7FA0840C60AC0]] INFO  org.apache.solr.core.CoreContainer  ? Persisting cores config to ./solrtest-TestSolrProperties-1370959821259/solr-persist.xml
[junit4:junit4]   1> 127782 [TEST-TestSolrProperties.testProperties-seed#[9AD7FA0840C60AC0]] INFO  org.apache.solr.core.SolrXMLSerializer  ? Persisting cores config to ./solrtest-TestSolrProperties-1370959821259/solr-persist.xml
[junit4:junit4]   1> 127787 [TEST-TestSolrProperties.testProperties-seed#[9AD7FA0840C60AC0]] INFO  org.apache.solr.core.SolrCore  ? [core0] webapp=null path=/admin/cores params={action=PERSIST&file=solr-persist.xml} status=0 QTime=18 
[junit4:junit4]   1> 127824 [TEST-TestSolrProperties.testProperties-seed#[9AD7FA0840C60AC0]] INFO  org.apache.solr.core.CoreContainer  ? registering core: renamed_core
[junit4:junit4]   1> 127825 [TEST-TestSolrProperties.testProperties-seed#[9AD7FA0840C60AC0]] INFO  org.apache.solr.core.CoreContainer  ? Persisting cores config to ./solrtest-TestSolrProperties-1370959821259/solr.xml
[junit4:junit4]   1> 127833 [TEST-TestSolrProperties.testProperties-seed#[9AD7FA0840C60AC0]] INFO  org.apache.solr.core.SolrXMLSerializer  ? Persisting cores config to ./solrtest-TestSolrProperties-1370959821259/solr.xml
[junit4:junit4]   1> 127840 [TEST-TestSolrProperties.testProperties-seed#[9AD7FA0840C60AC0]] INFO  org.apache.solr.core.SolrCore  ? [renamed_core] webapp=null path=/admin/cores params={action=RENAME&core=core0&indexInfo=true&other=renamed_core} status=0 QTime=16 
[junit4:junit4]   1> 127841 [TEST-TestSolrProperties.testProperties-seed#[9AD7FA0840C60AC0]] INFO  org.apache.solr.core.CoreContainer  ? Persisting cores config to ./solrtest-TestSolrProperties-1370959821259/solr-persist.xml
[junit4:junit4]   1> 127859 [TEST-TestSolrProperties.testProperties-seed#[9AD7FA0840C60AC0]] INFO  org.apache.solr.core.SolrXMLSerializer  ? Persisting cores config to ./solrtest-TestSolrProperties-1370959821259/solr-persist.xml
[junit4:junit4]   1> 127864 [TEST-TestSolrProperties.testProperties-seed#[9AD7FA0840C60AC0]] INFO  org.apache.solr.core.SolrCore  ? [renamed_core] webapp=null path=/admin/cores params={action=PERSIST&file=solr-persist.xml} status=0 QTime=23 
[junit4:junit4]   1> 127903 [TEST-TestSolrProperties.testProperties-seed#[9AD7FA0840C60AC0]] INFO  org.apache.solr.core.CoreContainer  ? Creating SolrCore 'newCore' using instanceDir: /Users/jenkins/jenkins-slave/workspace/Lucene-Solr-4.x-MacOSX/solr/solrj/src/test-files/solrj/solr/shared
[junit4:junit4]   1> 127904 [TEST-TestSolrProperties.testProperties-seed#[9AD7FA0840C60AC0]] INFO  org.apache.solr.core.SolrResourceLoader  ? new SolrResourceLoader for directory: '/Users/jenkins/jenkins-slave/workspace/Lucene-Solr-4.x-MacOSX/solr/solrj/src/test-files/solrj/solr/shared/'
[junit4:junit4]   1> 128104 [TEST-TestSolrProperties.testProperties-seed#[9AD7FA0840C60AC0]] INFO  org.apache.solr.core.SolrConfig  ? Using Lucene MatchVersion: LUCENE_44
[junit4:junit4]   1> 128264 [TEST-TestSolrProperties.testProperties-seed#[9AD7FA0840C60AC0]] INFO  org.apache.solr.core.Config  ? Loaded SolrConfig: solrconfig.xml
[junit4:junit4]   1> 128267 [TEST-TestSolrProperties.testProperties-seed#[9AD7FA0840C60AC0]] INFO  org.apache.solr.schema.IndexSchema  ? Reading Solr Schema from schema.xml
[junit4:junit4]   1> 128281 [TEST-TestSolrProperties.testProperties-seed#[9AD7FA0840C60AC0]] INFO  org.apache.solr.schema.IndexSchema  ? [newCore] Schema name=example core 
[junit4:junit4]   1> 128466 [TEST-TestSolrProperties.testProperties-seed#[9AD7FA0840C60AC0]] INFO  org.apache.solr.schema.IndexSchema  ? default search field in schema is name
[junit4:junit4]   1> 128482 [TEST-TestSolrProperties.testProperties-seed#[9AD7FA0840C60AC0]] INFO  org.apache.solr.schema.IndexSchema  ? query parser default operator is OR
[junit4:junit4]   1> 128487 [TEST-TestSolrProperties.testProperties-seed#[9AD7FA0840C60AC0]] INFO  org.apache.solr.schema.IndexSchema  ? unique key field: id
[junit4:junit4]   1> 128498 [TEST-TestSolrProperties.testProperties-seed#[9AD7FA0840C60AC0]] INFO  org.apache.solr.core.SolrCore  ? org.apache.solr.core.MockDirectoryFactory
[junit4:junit4]   1> 128500 [TEST-TestSolrProperties.testProperties-seed#[9AD7FA0840C60AC0]] INFO  org.apache.solr.core.SolrCore  ? [newCore] Opening new SolrCore at /Users/jenkins/jenkins-slave/workspace/Lucene-Solr-4.x-MacOSX/solr/solrj/src/test-files/solrj/solr/shared/, dataDir=/Users/jenkins/jenkins-slave/workspace/Lucene-Solr-4.x-MacOSX/solr/build/solr-solrj/test/J0/./solrtest-TestSolrProperties-1370959821259/data3/
[junit4:junit4]   1> 128502 [TEST-TestSolrProperties.testProperties-seed#[9AD7FA0840C60AC0]] INFO  org.apache.solr.core.SolrCore  ? JMX monitoring not detected for core: newCore
[junit4:junit4]   1> 128504 [TEST-TestSolrProperties.testProperties-seed#[9AD7FA0840C60AC0]] INFO  org.apache.solr.core.SolrCore  ? org.apache.solr.core.MockDirectoryFactory
[junit4:junit4]   1> 128507 [TEST-TestSolrProperties.testProperties-seed#[9AD7FA0840C60AC0]] INFO  org.apache.solr.core.CachingDirectoryFactory  ? return new directory for /Users/jenkins/jenkins-slave/workspace/Lucene-Solr-4.x-MacOSX/solr/build/solr-solrj/test/J0/./solrtest-TestSolrProperties-1370959821259/data3
[junit4:junit4]   1> 128514 [TEST-TestSolrProperties.testProperties-seed#[9AD7FA0840C60AC0]] INFO  org.apache.solr.core.SolrCore  ? New index directory detected: old=null new=/Users/jenkins/jenkins-slave/workspace/Lucene-Solr-4.x-MacOSX/solr/build/solr-solrj/test/J0/./solrtest-TestSolrProperties-1370959821259/data3/index/
[junit4:junit4]   1> 128515 [TEST-TestSolrProperties.testProperties-seed#[9AD7FA0840C60AC0]] WARN  org.apache.solr.core.SolrCore  ? [newCore] Solr index directory '/Users/jenkins/jenkins-slave/workspace/Lucene-Solr-4.x-MacOSX/solr/build/solr-solrj/test/J0/./solrtest-TestSolrProperties-1370959821259/data3/index' doesn't exist. Creating new index...
[junit4:junit4]   1> 128518 [TEST-TestSolrProperties.testProperties-seed#[9AD7FA0840C60AC0]] INFO  org.apache.solr.core.CachingDirectoryFactory  ? return new directory for /Users/jenkins/jenkins-slave/workspace/Lucene-Solr-4.x-MacOSX/solr/build/solr-solrj/test/J0/./solrtest-TestSolrProperties-1370959821259/data3/index
[junit4:junit4]   1> 128533 [TEST-TestSolrProperties.testProperties-seed#[9AD7FA0840C60AC0]] INFO  org.apache.solr.core.SolrCore  ? SolrDeletionPolicy.onCommit: commits: num=1
[junit4:junit4]   1> 	commit{dir=MockDirWrapper(org.apache.lucene.store.RAMDirectory@191d7bd5 lockFactory=org.apache.lucene.store.NativeFSLockFactory@116e3a7e),segFN=segments_1,generation=1}
[junit4:junit4]   1> 128554 [TEST-TestSolrProperties.testProperties-seed#[9AD7FA0840C60AC0]] INFO  org.apache.solr.core.SolrCore  ? newest commit generation = 1
[junit4:junit4]   1> 128567 [TEST-TestSolrProperties.testProperties-seed#[9AD7FA0840C60AC0]] INFO  org.apache.solr.core.RequestHandlers  ? created standard: solr.StandardRequestHandler
[junit4:junit4]   1> 128568 [TEST-TestSolrProperties.testProperties-seed#[9AD7FA0840C60AC0]] INFO  org.apache.solr.core.RequestHandlers  ? created /update: solr.UpdateRequestHandler
[junit4:junit4]   1> 128572 [TEST-TestSolrProperties.testProperties-seed#[9AD7FA0840C60AC0]] INFO  org.apache.solr.core.RequestHandlers  ? created /admin/: org.apache.solr.handler.admin.AdminHandlers
[junit4:junit4]   1> 128589 [TEST-TestSolrProperties.testProperties-seed#[9AD7FA0840C60AC0]] INFO  org.apache.solr.handler.loader.XMLLoader  ? xsltCacheLifetimeSeconds=60
[junit4:junit4]   1> 128602 [TEST-TestSolrProperties.testProperties-seed#[9AD7FA0840C60AC0]] INFO  org.apache.solr.search.SolrIndexSearcher  ? Opening Searcher@d43ccf5 main
[junit4:junit4]   1> 128603 [TEST-TestSolrProperties.testProperties-seed#[9AD7FA0840C60AC0]] INFO  org.apache.solr.update.UpdateHandler  ? Clearing tlog files, tlogDir=/Users/jenkins/jenkins-slave/workspace/Lucene-Solr-4.x-MacOSX/solr/build/solr-solrj/test/J0/./solrtest-TestSolrProperties-1370959821259/tlog3/tlog
[junit4:junit4]   1> 128606 [TEST-TestSolrProperties.testProperties-seed#[9AD7FA0840C60AC0]] INFO  org.apache.solr.core.SolrCore  ? Hard AutoCommit: disabled
[junit4:junit4]   1> 128607 [TEST-TestSolrProperties.testProperties-seed#[9AD7FA0840C60AC0]] INFO  org.apache.solr.core.SolrCore  ? Soft AutoCommit: disabled
[junit4:junit4]   1> 128609 [searcherExecutor-92-thread-1] INFO  org.apache.solr.core.SolrCore  ? [newCore] Registered new searcher Searcher@d43ccf5 main{StandardDirectoryReader(segments_1:1)}
[junit4:junit4]   1> 128609 [TEST-TestSolrProperties.testProperties-seed#[9AD7FA0840C60AC0]] INFO  org.apache.solr.core.CoreContainer  ? registering core: newCore
[junit4:junit4]   1> 128611 [TEST-TestSolrProperties.testProperties-seed#[9AD7FA0840C60AC0]] INFO  org.apache.solr.core.CoreContainer  ? Persisting cores config to ./solrtest-TestSolrProperties-1370959821259/solr.xml
[junit4:junit4]   1> 128623 [TEST-TestSolrProperties.testProperties-seed#[9AD7FA0840C60AC0]] INFO  org.apache.solr.core.SolrXMLSerializer  ? Persisting cores config to ./solrtest-TestSolrProperties-1370959821259/solr.xml
[junit4:junit4]   1> 128628 [TEST-TestSolrProperties.testProperties-seed#[9AD7FA0840C60AC0]] INFO  org.apache.solr.core.SolrCore  ? [renamed_core] webapp=null path=/admin/cores params={action=CREATE&name=newCore&instanceDir=%2FUsers%2Fjenkins%2Fjenkins-slave%2Fworkspace%2FLucene-Solr-4.x-MacOSX%2Fsolr%2Fsolrj%2Fsrc%2Ftest-files%2Fsolrj%2Fsolr%2Fshared&dataDir=%2FUsers%2Fjenkins%2Fjenkins-slave%2Fworkspace%2FLucene-Solr-4.x-MacOSX%2Fsolr%2Fbuild%2Fsolr-solrj%2Ftest%2FJ0%2F.%2Fsolrtest-TestSolrProperties-1370959821259%2Fdata3&ulogDir=%2FUsers%2Fjenkins%2Fjenkins-slave%2Fworkspace%2FLucene-Solr-4.x-MacOSX%2Fsolr%2Fbuild%2Fsolr-solrj%2Ftest%2FJ0%2F.%2Fsolrtest-TestSolrProperties-1370959821259%2Ftlog3} status=0 QTime=726 
[junit4:junit4]   1> 128638 [TEST-TestSolrProperties.testProperties-seed#[9AD7FA0840C60AC0]] INFO  org.apache.solr.core.CoreContainer  ? Persisting cores config to ./solrtest-TestSolrProperties-1370959821259/solr-persist.xml
[junit4:junit4]   1> 128654 [TEST-TestSolrProperties.testProperties-seed#[9AD7FA0840C60AC0]] INFO  org.apache.solr.core.SolrXMLSerializer  ? Persisting cores config to ./solrtest-TestSolrProperties-1370959821259/solr-persist.xml
[junit4:junit4]   1> 128660 [TEST-TestSolrProperties.testProperties-seed#[9AD7FA0840C60AC0]] INFO  org.apache.solr.core.SolrCore  ? [renamed_core] webapp=null path=/admin/cores params={action=PERSIST&file=solr-persist.xml} status=0 QTime=22 
[junit4:junit4]   1> 128684 [TEST-TestSolrProperties.testProperties-seed#[9AD7FA0840C60AC0]] INFO  org.apache.solr.core.CoreContainer  ? Shutting down CoreContainer instance=247355015
[junit4:junit4]   1> 128685 [TEST-TestSolrProperties.testProperties-seed#[9AD7FA0840C60AC0]] INFO  org.apache.solr.core.SolrCore  ? [collection1]  CLOSING SolrCore org.apache.solr.core.SolrCore@451d4b2e
[junit4:junit4]   1> 128686 [TEST-TestSolrProperties.testProperties-seed#[9AD7FA0840C60AC0]] INFO  org.apache.solr.update.UpdateHandler  ? closing DirectUpdateHandler2{commits=0,autocommits=0,soft autocommits=0,optimizes=0,rollbacks=0,expungeDeletes=0,docsPending=0,adds=0,deletesById=0,deletesByQuery=0,errors=0,cumulative_adds=0,cumulative_deletesById=0,cumulative_deletesByQuery=0,cumulative_errors=0}
[junit4:junit4]   1> 128687 [TEST-TestSolrProperties.testProperties-seed#[9AD7FA0840C60AC0]] INFO  org.apache.solr.update.SolrCoreState  ? Closing SolrCoreState
[junit4:junit4]   1> 128687 [TEST-TestSolrProperties.testProperties-seed#[9AD7FA0840C60AC0]] INFO  org.apache.solr.update.DefaultSolrCoreState  ? SolrCoreState ref count has reached 0 - closing IndexWriter
[junit4:junit4]   1> 128688 [TEST-TestSolrProperties.testProperties-seed#[9AD7FA0840C60AC0]] INFO  org.apache.solr.update.DefaultSolrCoreState  ? closing IndexWriter with IndexWriterCloser
[junit4:junit4]   1> 128689 [TEST-TestSolrProperties.testProperties-seed#[9AD7FA0840C60AC0]] INFO  org.apache.solr.core.SolrCore  ? [collection1] Closing main searcher on request.
[junit4:junit4]   1> 128690 [TEST-TestSolrProperties.testProperties-seed#[9AD7FA0840C60AC0]] INFO  org.apache.solr.core.CachingDirectoryFactory  ? Closing MockDirectoryFactory - 2 directories currently being tracked
[junit4:junit4]   1> 128691 [TEST-TestSolrProperties.testProperties-seed#[9AD7FA0840C60AC0]] INFO  org.apache.solr.core.CachingDirectoryFactory  ? looking to close /Users/jenkins/jenkins-slave/workspace/Lucene-Solr-4.x-MacOSX/solr/build/solr-solrj/test/J0/./solrtest-TestSolrProperties-1370959821259/data/-1.3/index [CachedDir<<refCount=0;path=/Users/jenkins/jenkins-slave/workspace/Lucene-Solr-4.x-MacOSX/solr/build/solr-solrj/test/J0/./solrtest-TestSolrProperties-1370959821259/data/-1.3/index;done=false>>]
[junit4:junit4]   1> 128692 [TEST-TestSolrProperties.testProperties-seed#[9AD7FA0840C60AC0]] INFO  org.apache.solr.core.CachingDirectoryFactory  ? Closing directory: /Users/jenkins/jenkins-slave/workspace/Lucene-Solr-4.x-MacOSX/solr/build/solr-solrj/test/J0/./solrtest-TestSolrProperties-1370959821259/data/-1.3/index
[junit4:junit4]   1> 128692 [TEST-TestSolrProperties.testProperties-seed#[9AD7FA0840C60AC0]] INFO  org.apache.solr.core.CachingDirectoryFactory  ? looking to close /Users/jenkins/jenkins-slave/workspace/Lucene-Solr-4.x-MacOSX/solr/build/solr-solrj/test/J0/./solrtest-TestSolrProperties-1370959821259/data/-1.3 [CachedDir<<refCount=0;path=/Users/jenkins/jenkins-slave/workspace/Lucene-Solr-4.x-MacOSX/solr/build/solr-solrj/test/J0/./solrtest-TestSolrProperties-1370959821259/data/-1.3;done=false>>]
[junit4:junit4]   1> 128693 [TEST-TestSolrProperties.testProperties-seed#[9AD7FA0840C60AC0]] INFO  org.apache.solr.core.CachingDirectoryFactory  ? Closing directory: /Users/jenkins/jenkins-slave/workspace/Lucene-Solr-4.x-MacOSX/solr/build/solr-solrj/test/J0/./solrtest-TestSolrProperties-1370959821259/data/-1.3
[junit4:junit4]   1> 128694 [TEST-TestSolrProperties.testProperties-seed#[9AD7FA0840C60AC0]] INFO  org.apache.solr.core.SolrCore  ? [core1]  CLOSING SolrCore org.apache.solr.core.SolrCore@e1c3a7
[junit4:junit4]   1> 128694 [TEST-TestSolrProperties.testProperties-seed#[9AD7FA0840C60AC0]] INFO  org.apache.solr.update.UpdateHandler  ? closing DirectUpdateHandler2{commits=2,autocommits=0,soft autocommits=0,optimizes=0,rollbacks=0,expungeDeletes=0,docsPending=0,adds=0,deletesById=0,deletesByQuery=0,errors=1,cumulative_adds=3,cumulative_deletesById=0,cumulative_deletesByQuery=1,cumulative_errors=1}
[junit4:junit4]   1> 128695 [TEST-TestSolrProperties.testProperties-seed#[9AD7FA0840C60AC0]] INFO  org.apache.solr.update.SolrCoreState  ? Closing SolrCoreState
[junit4:junit4]   1> 128696 [TEST-TestSolrProperties.testProperties-seed#[9AD7FA0840C60AC0]] INFO  org.apache.solr.update.DefaultSolrCoreState  ? SolrCoreState ref count has reached 0 - closing IndexWriter
[junit4:junit4]   1> 128696 [TEST-TestSolrProperties.testProperties-seed#[9AD7FA0840C60AC0]] INFO  org.apache.solr.update.DefaultSolrCoreState  ? closing IndexWriter with IndexWriterCloser
[junit4:junit4]   1> 128703 [TEST-TestSolrProperties.testProperties-seed#[9AD7FA0840C60AC0]] INFO  org.apache.solr.core.SolrCore  ? [core1] Closing main searcher on request.
[junit4:junit4]   1> 128758 [TEST-TestSolrProperties.testProperties-seed#[9AD7FA0840C60AC0]] INFO  org.apache.solr.core.CachingDirectoryFactory  ? Closing MockDirectoryFactory - 2 directories currently being tracked
[junit4:junit4]   1> 128759 [TEST-TestSolrProperties.testProperties-seed#[9AD7FA0840C60AC0]] INFO  org.apache.solr.core.CachingDirectoryFactory  ? looking to close /Users/jenkins/jenkins-slave/workspace/Lucene-Solr-4.x-MacOSX/solr/build/solr-solrj/test/J0/./solrtest-TestSolrProperties-1370959821259/data2 [CachedDir<<refCount=0;path=/Users/jenkins/jenkins-slave/workspace/Lucene-Solr-4.x-MacOSX/solr/build/solr-solrj/test/J0/./solrtest-TestSolrProperties-1370959821259/data2;done=false>>]
[junit4:junit4]   1> 128760 [TEST-TestSolrProperties.testProperties-seed#[9AD7FA0840C60AC0]] INFO  org.apache.solr.core.CachingDirectoryFactory  ? Closing directory: /Users/jenkins/jenkins-slave/workspace/Lucene-Solr-4.x-MacOSX/solr/build/solr-solrj/test/J0/./solrtest-TestSolrProperties-1370959821259/data2
[junit4:junit4]   1> 128762 [TEST-TestSolrProperties.testProperties-seed#[9AD7FA0840C60AC0]] INFO  org.apache.solr.core.CachingDirectoryFactory  ? looking to close /Users/jenkins/jenkins-slave/workspace/Lucene-Solr-4.x-MacOSX/solr/build/solr-solrj/test/J0/./solrtest-TestSolrProperties-1370959821259/data2/index [CachedDir<<refCount=0;path=/Users/jenkins/jenkins-slave/workspace/Lucene-Solr-4.x-MacOSX/solr/build/solr-solrj/test/J0/./solrtest-TestSolrProperties-1370959821259/data2/index;done=false>>]
[junit4:junit4]   1> 128763 [TEST-TestSolrProperties.testProperties-seed#[9AD7FA0840C60AC0]] INFO  org.apache.solr.core.CachingDirectoryFactory  ? Closing directory: /Users/jenkins/jenkins-slave/workspace/Lucene-Solr-4.x-MacOSX/solr/build/solr-solrj/test/J0/./solrtest-TestSolrProperties-1370959821259/data2/index
[junit4:junit4]   1> 128766 [TEST-TestSolrProperties.testProperties-seed#[9AD7FA0840C60AC0]] INFO  org.apache.solr.core.SolrCore  ? [renamed_core]  CLOSING SolrCore org.apache.solr.core.SolrCore@781f2867
[junit4:junit4]   1> 128767 [TEST-TestSolrProperties.testProperties-seed#[9AD7FA0840C60AC0]] INFO  org.apache.solr.update.UpdateHandler  ? closing DirectUpdateHandler2{commits=0,autocommits=0,soft autocommits=0,optimizes=0,rollbacks=0,expungeDeletes=0,docsPending=0,adds=0,deletesById=0,deletesByQuery=0,errors=0,cumulative_adds=0,cumulative_deletesById=0,cumulative_deletesByQuery=0,cumulative_errors=0}
[junit4:junit4]   1> 128768 [TEST-TestSolrProperties.testProperties-seed#[9AD7FA0840C60AC0]] INFO  org.apache.solr.update.SolrCoreState  ? Closing SolrCoreState
[junit4:junit4]   1> 128768 [TEST-TestSolrProperties.testProperties-seed#[9AD7FA0840C60AC0]] INFO  org.apache.solr.update.DefaultSolrCoreState  ? SolrCoreState ref count has reached 0 - closing IndexWriter
[junit4:junit4]   1> 128769 [TEST-TestSolrProperties.testProperties-seed#[9AD7FA0840C60AC0]] INFO  org.apache.solr.update.DefaultSolrCoreState  ? closing IndexWriter with IndexWriterCloser
[junit4:junit4]   1> 128774 [TEST-TestSolrProperties.testProperties-seed#[9AD7FA0840C60AC0]] INFO  org.apache.solr.core.SolrCore  ? [renamed_core] Closing main searcher on request.
[junit4:junit4]   1> 128775 [TEST-TestSolrProperties.testProperties-seed#[9AD7FA0840C60AC0]] INFO  org.apache.solr.core.CachingDirectoryFactory  ? Closing MockDirectoryFactory - 2 directories currently being tracked
[junit4:junit4]   1> 128777 [TEST-TestSolrProperties.testProperties-seed#[9AD7FA0840C60AC0]] INFO  org.apache.solr.core.CachingDirectoryFactory  ? looking to close /Users/jenkins/jenkins-slave/workspace/Lucene-Solr-4.x-MacOSX/solr/build/solr-solrj/test/J0/./solrtest-TestSolrProperties-1370959821259/data1 [CachedDir<<refCount=0;path=/Users/jenkins/jenkins-slave/workspace/Lucene-Solr-4.x-MacOSX/solr/build/solr-solrj/test/J0/./solrtest-TestSolrProperties-1370959821259/data1;done=false>>]
[junit4:junit4]   1> 128778 [TEST-TestSolrProperties.testProperties-seed#[9AD7FA0840C60AC0]] INFO  org.apache.solr.core.CachingDirectoryFactory  ? Closing directory: /Users/jenkins/jenkins-slave/workspace/Lucene-Solr-4.x-MacOSX/solr/build/solr-solrj/test/J0/./solrtest-TestSolrProperties-1370959821259/data1
[junit4:junit4]   1> 128779 [TEST-TestSolrProperties.testProperties-seed#[9AD7FA0840C60AC0]] INFO  org.apache.solr.core.CachingDirectoryFactory  ? looking to close /Users/jenkins/jenkins-slave/workspace/Lucene-Solr-4.x-MacOSX/solr/build/solr-solrj/test/J0/./solrtest-TestSolrProperties-1370959821259/data1/index [CachedDir<<refCount=0;path=/Users/jenkins/jenkins-slave/workspace/Lucene-Solr-4.x-MacOSX/solr/build/solr-solrj/test/J0/./solrtest-TestSolrProperties-1370959821259/data1/index;done=false>>]
[junit4:junit4]   1> 128781 [TEST-TestSolrProperties.testProperties-seed#[9AD7FA0840C60AC0]] INFO  org.apache.solr.core.CachingDirectoryFactory  ? Closing directory: /Users/jenkins/jenkins-slave/workspace/Lucene-Solr-4.x-MacOSX/solr/build/solr-solrj/test/J0/./solrtest-TestSolrProperties-1370959821259/data1/index
[junit4:junit4]   1> 128782 [TEST-TestSolrProperties.testProperties-seed#[9AD7FA0840C60AC0]] INFO  org.apache.solr.core.SolrCore  ? [newCore]  CLOSING SolrCore org.apache.solr.core.SolrCore@4ef16070
[junit4:junit4]   1> 128782 [TEST-TestSolrProperties.testProperties-seed#[9AD7FA0840C60AC0]] INFO  org.apache.solr.update.UpdateHandler  ? closing DirectUpdateHandler2{commits=0,autocommits=0,soft autocommits=0,optimizes=0,rollbacks=0,expungeDeletes=0,docsPending=0,adds=0,deletesById=0,deletesByQuery=0,errors=0,cumulative_adds=0,cumulative_deletesById=0,cumulative_deletesByQuery=0,cumulative_errors=0}
[junit4:junit4]   1> 128783 [TEST-TestSolrProperties.testProperties-seed#[9AD7FA0840C60AC0]] INFO  org.apache.solr.update.SolrCoreState  ? Closing SolrCoreState
[junit4:junit4]   1> 128784 [TEST-TestSolrProperties.testProperties-seed#[9AD7FA0840C60AC0]] INFO  org.apache.solr.update.DefaultSolrCoreState  ? SolrCoreState ref count has reached 0 - closing IndexWriter
[junit4:junit4]   1> 128785 [TEST-TestSolrProperties.testProperties-seed#[9AD7FA0840C60AC0]] INFO  org.apache.solr.update.DefaultSolrCoreState  ? closing IndexWriter with IndexWriterCloser
[junit4:junit4]   1> 128788 [TEST-TestSolrProperties.testProperties-seed#[9AD7FA0840C60AC0]] INFO  org.apache.solr.core.SolrCore  ? [newCore] Closing main searcher on request.
[junit4:junit4]   1> 128789 [TEST-TestSolrProperties.testProperties-seed#[9AD7FA0840C60AC0]] INFO  org.apache.solr.core.CachingDirectoryFactory  ? Closing MockDirectoryFactory - 2 directories currently being tracked
[junit4:junit4]   1> 128789 [TEST-TestSolrProperties.testProperties-seed#[9AD7FA0840C60AC0]] INFO  org.apache.solr.core.CachingDirectoryFactory  ? looking to close /Users/jenkins/jenkins-slave/workspace/Lucene-Solr-4.x-MacOSX/solr/build/solr-solrj/test/J0/./solrtest-TestSolrProperties-1370959821259/data3/index [CachedDir<<refCount=0;path=/Users/jenkins/jenkins-slave/workspace/Lucene-Solr-4.x-MacOSX/solr/build/solr-solrj/test/J0/./solrtest-TestSolrProperties-1370959821259/data3/index;done=false>>]
[junit4:junit4]   1> 128790 [TEST-TestSolrProperties.testProperties-seed#[9AD7FA0840C60AC0]] INFO  org.apache.solr.core.CachingDirectoryFactory  ? Closing directory: /Users/jenkins/jenkins-slave/workspace/Lucene-Solr-4.x-MacOSX/solr/build/solr-solrj/test/J0/./solrtest-TestSolrProperties-1370959821259/data3/index
[junit4:junit4]   1> 128791 [TEST-TestSolrProperties.testProperties-seed#[9AD7FA0840C60AC0]] INFO  org.apache.solr.core.CachingDirectoryFactory  ? looking to close /Users/jenkins/jenkins-slave/workspace/Lucene-Solr-4.x-MacOSX/solr/build/solr-solrj/test/J0/./solrtest-TestSolrProperties-1370959821259/data3 [CachedDir<<refCount=0;path=/Users/jenkins/jenkins-slave/workspace/Lucene-Solr-4.x-MacOSX/solr/build/solr-solrj/test/J0/./solrtest-TestSolrProperties-1370959821259/data3;done=false>>]
[junit4:junit4]   1> 128792 [TEST-TestSolrProperties.testProperties-seed#[9AD7FA0840C60AC0]] INFO  org.apache.solr.core.CachingDirectoryFactory  ? Closing directory: /Users/jenkins/jenkins-slave/workspace/Lucene-Solr-4.x-MacOSX/solr/build/solr-solrj/test/J0/./solrtest-TestSolrProperties-1370959821259/data3
[junit4:junit4]   1> 128793 [TEST-TestSolrProperties.testProperties-seed#[9AD7FA0840C60AC0]] INFO  org.apache.solr.core.CoreContainer  ? New CoreContainer 33680816
[junit4:junit4]   1> 128795 [TEST-TestSolrProperties.testProperties-seed#[9AD7FA0840C60AC0]] INFO  org.apache.solr.core.CoreContainer  ? Loading CoreContainer using Solr Home: '/Users/jenkins/jenkins-slave/workspace/Lucene-Solr-4.x-MacOSX/solr/solrj/src/test-files/solrj/solr/shared'
[junit4:junit4]   1> 128796 [TEST-TestSolrProperties.testProperties-seed#[9AD7FA0840C60AC0]] INFO  org.apache.solr.core.SolrResourceLoader  ? new SolrResourceLoader for directory: '/Users/jenkins/jenkins-slave/workspace/Lucene-Solr-4.x-MacOSX/solr/solrj/src/test-files/solrj/solr/shared/'
[junit4:junit4]   1> 129159 [TEST-TestSolrProperties.testProperties-seed#[9AD7FA0840C60AC0]] INFO  org.apache.solr.handler.component.HttpShardHandlerFactory  ? Setting socketTimeout to: 0
[junit4:junit4]   1> 129160 [TEST-TestSolrProperties.testProperties-seed#[9AD7FA0840C60AC0]] INFO  org.apache.solr.handler.component.HttpShardHandlerFactory  ? Setting urlScheme to: http://
[junit4:junit4]   1> 129170 [TEST-TestSolrProperties.testProperties-seed#[9AD7FA0840C60AC0]] INFO  org.apache.solr.handler.component.HttpShardHandlerFactory  ? Setting connTimeout to: 0
[junit4:junit4]   1> 129171 [TEST-TestSolrProperties.testProperties-seed#[9AD7FA0840C60AC0]] INFO  org.apache.solr.handler.component.HttpShardHandlerFactory  ? Setting maxConnectionsPerHost to: 20
[junit4:junit4]   1> 129172 [TEST-TestSolrProperties.testProperties-seed#[9AD7FA0840C60AC0]] INFO  org.apache.solr.handler.component.HttpShardHandlerFactory  ? Setting corePoolSize to: 0
[junit4:junit4]   1> 129173 [TEST-TestSolrProperties.testProperties-seed#[9AD7FA0840C60AC0]] INFO  org.apache.solr.handler.component.HttpShardHandlerFactory  ? Setting maximumPoolSize to: 2147483647
[junit4:junit4]   1> 129174 [TEST-TestSolrProperties.testProperties-seed#[9AD7FA0840C60AC0]] INFO  org.apache.solr.handler.component.HttpShardHandlerFactory  ? Setting maxThreadIdleTime to: 5
[junit4:junit4]   1> 129175 [TEST-TestSolrProperties.testProperties-seed#[9AD7FA0840C60AC0]] INFO  org.apache.solr.handler.component.HttpShardHandlerFactory  ? Setting sizeOfQueue to: -1
[junit4:junit4]   1> 129176 [TEST-TestSolrProperties.testProperties-seed#[9AD7FA0840C60AC0]] INFO  org.apache.solr.handler.component.HttpShardHandlerFactory  ? Setting fairnessPolicy to: false
[junit4:junit4]   1> 129177 [TEST-TestSolrProperties.testProperties-seed#[9AD7FA0840C60AC0]] INFO  org.apache.solr.client.solrj.impl.HttpClientUtil  ? Creating new http client, config:maxConnectionsPerHost=20&maxConnections=10000&socketTimeout=0&connTimeout=0&retry=false
[junit4:junit4]   1> 129262 [TEST-TestSolrProperties.testProperties-seed#[9AD7FA0840C60AC0]] INFO  org.apache.solr.logging.LogWatcher  ? Registering Log Listener
[junit4:junit4]   1> 129276 [coreLoadExecutor-98-thread-1] INFO  org.apache.solr.core.CoreContainer  ? Creating SolrCore 'collection1' using instanceDir: /Users/jenkins/jenkins-slave/workspace/Lucene-Solr-4.x-MacOSX/solr/solrj/src/test-files/solrj/solr/shared/.
[junit4:junit4]   1> 129280 [coreLoadExecutor-98-thread-1] INFO  org.apache.solr.core.SolrResourceLoader  ? new SolrResourceLoader for directory: '/Users/jenkins/jenkins-slave/workspace/Lucene-Solr-4.x-MacOSX/solr/solrj/src/test-files/solrj/solr/shared/./'
[junit4:junit4]   1> 129316 [coreLoadExecutor-98-thread-2] INFO  org.apache.solr.core.CoreContainer  ? Creating SolrCore 'core1' using instanceDir: /Users/jenkins/jenkins-slave/workspace/Lucene-Solr-4.x-MacOSX/solr/solrj/src/test-files/solrj/solr/shared/.
[junit4:junit4]   1> 129368 [coreLoadExecutor-98-thread-2] INFO  org.apache.solr.core.SolrResourceLoader  ? new SolrResourceLoader for directory: '/Users/jenkins/jenkins-slave/workspace/Lucene-Solr-4.x-MacOSX/solr/solrj/src/test-files/solrj/solr/shared/./'
[junit4:junit4]   1> 129395 [coreLoadExecutor-98-thread-3] INFO  org.apache.solr.core.CoreContainer  ? Creating SolrCore 'renamed_core' using instanceDir: /Users/jenkins/jenkins-slave/workspace/Lucene-Solr-4.x-MacOSX/solr/solrj/src/test-files/solrj/solr/shared/.
[junit4:junit4]   1> 129398 [coreLoadExecutor-98-thread-3] INFO  org.apache.solr.core.SolrResourceLoader  ? new SolrResourceLoader for directory: '/Users/jenkins/jenkins-slave/workspace/Lucene-Solr-4.x-MacOSX/solr/solrj/src/test-files/solrj/solr/shared/./'
[junit4:junit4]   1> 129640 [coreLoadExecutor-98-thread-2] INFO  org.apache.solr.core.SolrConfig  ? Using Lucene MatchVersion: LUCENE_44
[junit4:junit4]   1> 129666 [coreLoadExecutor-98-thread-1] INFO  org.apache.solr.core.SolrConfig  ? Using Lucene MatchVersion: LUCENE_44
[junit4:junit4]   1> 129687 [coreLoadExecutor-98-thread-3] INFO  org.apache.solr.core.SolrConfig  ? Using Lucene MatchVersion: LUCENE_44
[junit4:junit4]   1> 130137 [coreLoadExecutor-98-thread-2] INFO  org.apache.solr.core.Config  ? Loaded SolrConfig: solrconfig.xml
[junit4:junit4]   1> 130156 [coreLoadExecutor-98-thread-2] INFO  org.apache.solr.schema.IndexSchema  ? Reading Solr Schema from schema.xml
[junit4:junit4]   1> 130158 [coreLoadExecutor-98-thread-1] INFO  org.apache.solr.core.Config  ? Loaded SolrConfig: solrconfig.xml
[junit4:junit4]   1> 130159 [coreLoadExecutor-98-thread-1] INFO  org.apache.solr.schema.IndexSchema  ? Reading Solr Schema from schema.xml
[junit4:junit4]   1> 130190 [coreLoadExecutor-98-thread-1] INFO  org.apache.solr.schema.IndexSchema  ? [collection1] Schema name=example core 
[junit4:junit4]   1> 130199 [coreLoadExecutor-98-thread-2] INFO  org.apache.solr.schema.IndexSchema  ? [core1] Schema name=example core FR
[junit4:junit4]   1> 130211 [coreLoadExecutor-98-thread-3] INFO  org.apache.solr.core.Config  ? Loaded SolrConfig: solrconfig.xml
[junit4:junit4]   1> 130212 [coreLoadExecutor-98-thread-3] INFO  org.apache.solr.schema.IndexSchema  ? Reading Solr Schema from schema.xml
[junit4:junit4]   1> 130269 [coreLoadExecutor-98-thread-3] INFO  org.apache.solr.schema.IndexSchema  ? [renamed_core] Schema name=example core EN
[junit4:junit4]   1> 130525 [coreLoadExecutor-98-thread-2] INFO  org.apache.solr.schema.IndexSchema  ? default search field in schema is name
[junit4:junit4]   1> 130528 [coreLoadExecutor-98-thread-2] INFO  org.apache.solr.schema.IndexSchema  ? query parser default operator is OR
[junit4:junit4]   1> 130532 [coreLoadExecutor-98-thread-2] INFO  org.apache.solr.schema.IndexSchema  ? unique key field: id
[junit4:junit4]   1> 130540 [coreLoadExecutor-98-thread-2] INFO  org.apache.solr.core.SolrCore  ? org.apache.solr.core.MockDirectoryFactory
[junit4:junit4]   1> 130541 [coreLoadExecutor-98-thread-2] INFO  org.apache.solr.core.SolrCore  ? [core1] Opening new SolrCore at /Users/jenkins/jenkins-slave/workspace/Lucene-Solr-4.x-MacOSX/solr/solrj/src/test-files/solrj/solr/shared/./, dataDir=/Users/jenkins/jenkins-slave/workspace/Lucene-Solr-4.x-MacOSX/solr/build/solr-solrj/test/J0/./solrtest-TestSolrProperties-1370959821259/data2/
[junit4:junit4]   1> 130541 [coreLoadExecutor-98-thread-2] INFO  org.apache.solr.core.SolrCore  ? JMX monitoring not detected for core: core1
[junit4:junit4]   1> 130542 [coreLoadExecutor-98-thread-2] INFO  org.apache.solr.core.SolrCore  ? org.apache.solr.core.MockDirectoryFactory
[junit4:junit4]   1> 130554 [coreLoadExecutor-98-thread-2] INFO  org.apache.solr.core.CachingDirectoryFactory  ? return new directory for /Users/jenkins/jenkins-slave/workspace/Lucene-Solr-4.x-MacOSX/solr/build/solr-solrj/test/J0/./solrtest-TestSolrProperties-1370959821259/data2
[junit4:junit4]   1> 130555 [coreLoadExecutor-98-thread-2] INFO  org.apache.solr.core.SolrCore  ? New index directory detected: old=null new=/Users/jenkins/jenkins-slave/workspace/Lucene-Solr-4.x-MacOSX/solr/build/solr-solrj/test/J0/./solrtest-TestSolrProperties-1370959821259/data2/index/
[junit4:junit4]   1> 130555 [coreLoadExecutor-98-thread-2] WARN  org.apache.solr.core.SolrCore  ? [core1] Solr index directory '/Users/jenkins/jenkins-slave/workspace/Lucene-Solr-4.x-MacOSX/solr/build/solr-solrj/test/J0/./solrtest-TestSolrProperties-1370959821259/data2/index' doesn't exist. Creating new index...
[junit4:junit4]   1> 130563 [coreLoadExecutor-98-thread-2] INFO  org.apache.solr.core.CachingDirectoryFactory  ? return new directory for /Users/jenkins/jenkins-slave/workspace/Lucene-Solr-4.x-MacOSX/solr/build/solr-solrj/test/J0/./solrtest-TestSolrProperties-1370959821259/data2/index
[junit4:junit4]   1> 130567 [coreLoadExecutor-98-thread-2] INFO  org.apache.solr.core.SolrCore  ? SolrDeletionPolicy.onCommit: commits: num=1
[junit4:junit4]   1> 	commit{dir=MockDirWrapper(org.apache.lucene.store.RAMDirectory@54e5a4b1 lockFactory=org.apache.lucene.store.NativeFSLockFactory@1bfc9484),segFN=segments_1,generation=1}
[junit4:junit4]   1> 130568 [coreLoadExecutor-98-thread-2] INFO  org.apache.solr.core.SolrCore  ? newest commit generation = 1
[junit4:junit4]   1> 130571 [coreLoadExecutor-98-thread-2] INFO  org.apache.solr.core.RequestHandlers  ? created standard: solr.StandardRequestHandler
[junit4:junit4]   1> 130572 [coreLoadExecutor-98-thread-2] INFO  org.apache.solr.core.RequestHandlers  ? created /update: solr.UpdateRequestHandler
[junit4:junit4]   1> 130574 [coreLoadExecutor-98-thread-2] INFO  org.apache.solr.core.RequestHandlers  ? created /admin/: org.apache.solr.handler.admin.AdminHandlers
[junit4:junit4]   1> 130611 [coreLoadExecutor-98-thread-2] INFO  org.apache.solr.handler.loader.XMLLoader  ? xsltCacheLifetimeSeconds=60
[junit4:junit4]   1> 130618 [coreLoadExecutor-98-thread-1] INFO  org.apache.solr.schema.IndexSchema  ? default search field in schema is name
[junit4:junit4]   1> 130622 [coreLoadExecutor-98-thread-1] INFO  org.apache.solr.schema.IndexSchema  ? query parser default operator is OR
[junit4:junit4]   1> 130641 [coreLoadExecutor-98-thread-1] INFO  org.apache.solr.schema.IndexSchema  ? unique key field: id
[junit4:junit4]   1> 130649 [coreLoadExecutor-98-thread-1] INFO  org.apache.solr.core.SolrCore  ? org.apache.solr.core.MockDirectoryFactory
[junit4:junit4]   1> 130650 [coreLoadExecutor-98-thread-1] INFO  org.apache.solr.core.SolrCore  ? [collection1] Opening new SolrCore at /Users/jenkins/jenkins-slave/workspace/Lucene-Solr-4.x-MacOSX/solr/solrj/src/test-files/solrj/solr/shared/./, dataDir=/Users/jenkins/jenkins-slave/workspace/Lucene-Solr-4.x-MacOSX/solr/solrj/src/test-files/solrj/solr/shared/./data/
[junit4:junit4]   1> 130651 [coreLoadExecutor-98-thread-1] INFO  org.apache.solr.core.SolrCore  ? JMX monitoring not detected for core: collection1
[junit4:junit4]   1> 130651 [coreLoadExecutor-98-thread-1] INFO  org.apache.solr.core.SolrCore  ? org.apache.solr.core.MockDirectoryFactory
[junit4:junit4]   1> 130643 [coreLoadExecutor-98-thread-2] INFO  org.apache.solr.search.SolrIndexSearcher  ? Opening Searcher@afba5d main
[junit4:junit4]   1> 130643 [coreLoadExecutor-98-thread-3] INFO  org.apache.solr.schema.IndexSchema  ? default search field in schema is name
[junit4:junit4]   1> 130657 [coreLoadExecutor-98-thread-3] INFO  org.apache.solr.schema.IndexSchema  ? query parser default operator is OR
[junit4:junit4]   1> 130662 [coreLoadExecutor-98-thread-3] INFO  org.apache.solr.schema.IndexSchema  ? unique key field: id
[junit4:junit4]   1> 130654 [coreLoadExecutor-98-thread-1] INFO  org.apache.solr.core.CachingDirectoryFactory  ? return new directory for /Users/jenkins/jenkins-slave/workspace/Lucene-Solr-4.x-MacOSX/solr/solrj/src/test-files/solrj/solr/shared/./data
[junit4:junit4]   1> 130666 [coreLoadExecutor-98-thread-1] INFO  org.apache.solr.core.SolrCore  ? New index directory detected: old=null new=/Users/jenkins/jenkins-slave/workspace/Lucene-Solr-4.x-MacOSX/solr/solrj/src/test-files/solrj/solr/shared/./data/index/
[junit4:junit4]   1> 130666 [coreLoadExecutor-98-thread-1] WARN  org.apache.solr.core.SolrCore  ? [collection1] Solr index directory '/Users/jenkins/jenkins-slave/workspace/Lucene-Solr-4.x-MacOSX/solr/solrj/src/test-files/solrj/solr/shared/./data/index' doesn't exist. Creating new index...
[junit4:junit4]   1> 130670 [coreLoadExecutor-98-thread-1] INFO  org.apache.solr.core.CachingDirectoryFactory  ? return new directory for /Users/jenkins/jenkins-slave/workspace/Lucene-Solr-4.x-MacOSX/solr/solrj/src/test-files/solrj/solr/shared/./data/index
[junit4:junit4]   1> 130673 [coreLoadExecutor-98-thread-1] INFO  org.apache.solr.core.CachingDirectoryFactory  ? looking to close /Users/jenkins/jenkins-slave/workspace/Lucene-Solr-4.x-MacOSX/solr/solrj/src/test-files/solrj/solr/shared/./data/index [CachedDir<<refCount=0;path=/Users/jenkins/jenkins-slave/workspace/Lucene-Solr-4.x-MacOSX/solr/solrj/src/test-files/solrj/solr/shared/./data/index;done=true>>]
[junit4:junit4]   1> 130675 [coreLoadExecutor-98-thread-1] INFO  org.apache.solr.core.CachingDirectoryFactory  ? Closing directory: /Users/jenkins/jenkins-slave/workspace/Lucene-Solr-4.x-MacOSX/solr/solrj/src/test-files/solrj/solr/shared/./data/index
[junit4:junit4]   1> 130675 [coreLoadExecutor-98-thread-1] INFO  org.apache.solr.core.SolrCore  ? [collection1]  CLOSING SolrCore org.apache.solr.core.SolrCore@718f7af7
[junit4:junit4]   1> 130676 [coreLoadExecutor-98-thread-1] INFO  org.apache.solr.update.SolrCoreState  ? Closing SolrCoreState
[junit4:junit4]   1> 130677 [coreLoadExecutor-98-thread-1] INFO  org.apache.solr.update.DefaultSolrCoreState  ? SolrCoreState ref count has reached 0 - closing IndexWriter
[junit4:junit4]   1> 130677 [coreLoadExecutor-98-thread-1] INFO  org.apache.solr.core.SolrCore  ? [collection1] Closing main searcher on request.
[junit4:junit4]   1> 130678 [coreLoadExecutor-98-thread-1] INFO  org.apache.solr.core.CachingDirectoryFactory  ? Closing MockDirectoryFactory - 1 directories currently being tracked
[junit4:junit4]   1> 130678 [coreLoadExecutor-98-thread-1] INFO  org.apache.solr.core.CachingDirectoryFactory  ? looking to close /Users/jenkins/jenkins-slave/workspace/Lucene-Solr-4.x-MacOSX/solr/solrj/src/test-files/solrj/solr/shared/./data [CachedDir<<refCount=0;path=/Users/jenkins/jenkins-slave/workspace/Lucene-Solr-4.x-MacOSX/solr/solrj/src/test-files/solrj/solr/shared/./data;done=false>>]
[junit4:junit4]   1> 130679 [coreLoadExecutor-98-thread-1] INFO  org.apache.solr.core.CachingDirectoryFactory  ? Closing directory: /Users/jenkins/jenkins-slave/workspace/Lucene-Solr-4.x-MacOSX/solr/solrj/src/test-files/solrj/solr/shared/./data
[junit4:junit4]   1> 130686 [coreLoadExecutor-98-thread-1] ERROR org.apache.solr.core.CoreContainer  ? Unable to create core: collection1
[junit4:junit4]   1> org.apache.solr.common.SolrException: access denied (java.io.FilePermission /Users/jenkins/jenkins-slave/workspace/Lucene-Solr-4.x-MacOSX/solr/solrj/src/test-files/solrj/solr/shared/./data/index write)
[junit4:junit4]   1> 	at org.apache.solr.core.SolrCore.<init>(SolrCore.java:835)
[junit4:junit4]   1> 	at org.apache.solr.core.SolrCore.<init>(SolrCore.java:627)
[junit4:junit4]   1> 	at org.apache.solr.core.CoreContainer.createFromLocal(CoreContainer.java:727)
[junit4:junit4]   1> 	at org.apache.solr.core.CoreContainer.create(CoreContainer.java:762)
[junit4:junit4]   1> 	at org.apache.solr.core.CoreContainer$1.call(CoreContainer.java:429)
[junit4:junit4]   1> 	at org.apache.solr.core.CoreContainer$1.call(CoreContainer.java:421)
[junit4:junit4]   1> 	at java.util.concurrent.FutureTask$Sync.innerRun(FutureTask.java:303)
[junit4:junit4]   1> 	at java.util.concurrent.FutureTask.run(FutureTask.java:138)
[junit4:junit4]   1> 	at java.util.concurrent.Executors$RunnableAdapter.call(Executors.java:439)
[junit4:junit4]   1> 	at java.util.concurrent.FutureTask$Sync.innerRun(FutureTask.java:303)
[junit4:junit4]   1> 	at java.util.concurrent.FutureTask.run(FutureTask.java:138)
[junit4:junit4]   1> 	at java.util.concurrent.ThreadPoolExecutor$Worker.runTask(ThreadPoolExecutor.java:895)
[junit4:junit4]   1> 	at java.util.concurrent.ThreadPoolExecutor$Worker.run(ThreadPoolExecutor.java:918)
[junit4:junit4]   1> 	at java.lang.Thread.run(Thread.java:680)
[junit4:junit4]   1> Caused by: java.security.AccessControlException: access denied (java.io.FilePermission /Users/jenkins/jenkins-slave/workspace/Lucene-Solr-4.x-MacOSX/solr/solrj/src/test-files/solrj/solr/shared/./data/index write)
[junit4:junit4]   1> 	at java.security.AccessControlContext.checkPermission(AccessControlContext.java:374)
[junit4:junit4]   1> 	at java.security.AccessController.checkPermission(AccessController.java:549)
[junit4:junit4]   1> 	at java.lang.SecurityManager.checkPermission(SecurityManager.java:532)
[junit4:junit4]   1> 	at java.lang.SecurityManager.checkWrite(SecurityManager.java:962)
[junit4:junit4]   1> 	at java.io.File.mkdir(File.java:1155)
[junit4:junit4]   1> 	at java.io.File.mkdirs(File.java:1184)
[junit4:junit4]   1> 	at org.apache.lucene.store.NativeFSLock.obtain(NativeFSLockFactory.java:170)
[junit4:junit4]   1> 	at org.apache.lucene.store.MockLockFactoryWrapper$MockLock.obtain(MockLockFactoryWrapper.java:72)
[junit4:junit4]   1> 	at org.apache.lucene.store.Lock.obtain(Lock.java:72)
[junit4:junit4]   1> 	at org.apache.lucene.index.IndexWriter.<init>(IndexWriter.java:667)
[junit4:junit4]   1> 	at org.apache.solr.update.SolrIndexWriter.<init>(SolrIndexWriter.java:77)
[junit4:junit4]   1> 	at org.apache.solr.update.SolrIndexWriter.create(SolrIndexWriter.java:64)
[junit4:junit4]   1> 	at org.apache.solr.core.SolrCore.initIndex(SolrCore.java:507)
[junit4:junit4]   1> 	at org.apache.solr.core.SolrCore.<init>(SolrCore.java:759)
[junit4:junit4]   1> 	... 13 more
[junit4:junit4]   1> 130654 [coreLoadExecutor-98-thread-2] INFO  org.apache.solr.update.UpdateHandler  ? Clearing tlog files, tlogDir=/Users/jenkins/jenkins-slave/workspace/Lucene-Solr-4.x-MacOSX/solr/build/solr-solrj/test/J0/./solrtest-TestSolrProperties-1370959821259/data2/tlog
[junit4:junit4]   1> 130709 [coreLoadExecutor-98-thread-1] ERROR org.apache.solr.core.CoreContainer  ? null:org.apache.solr.common.SolrException: Unable to create core: collection1
[junit4:junit4]   1> 	at org.apache.solr.core.CoreContainer.recordAndThrow(CoreContainer.java:1222)
[junit4:junit4]   1> 	at org.apache.solr.core.CoreContainer.create(CoreContainer.java:771)
[junit4:junit4]   1> 	at org.apache.solr.core.CoreContainer$1.call(CoreContainer.java:429)
[junit4:junit4]   1> 	at org.apache.solr.core.CoreContainer$1.call(CoreContainer.java:421)
[junit4:junit4]   1> 	at java.util.concurrent.FutureTask$Sync.innerRun(FutureTask.java:303)
[junit4:junit4]   1> 	at java.util.concurrent.FutureTask.run(FutureTask.java:138)
[junit4:junit4]   1> 	at java.util.concurrent.Executors$RunnableAdapter.call(Executors.java:439)
[junit4:junit4]   1> 	at java.util.concurrent.FutureTask$Sync.innerRun(FutureTask.java:303)
[junit4:junit4]   1> 	at java.util.concurrent.FutureTask.run(FutureTask.java:138)
[junit4:junit4]   1> 	at java.util.concurrent.ThreadPoolExecutor$Worker.runTask(ThreadPoolExecutor.java:895)
[junit4:junit4]   1> 	at java.util.concurrent.ThreadPoolExecutor$Worker.run(ThreadPoolExecutor.java:918)
[junit4:junit4]   1> 	at java.lang.Thread.run(Thread.java:680)
[junit4:junit4]   1> Caused by: org.apache.solr.common.SolrException: access denied (java.io.FilePermission /Users/jenkins/jenkins-slave/workspace/Lucene-Solr-4.x-MacOSX/solr/solrj/src/test-files/solrj/solr/shared/./data/index write)
[junit4:junit4]   1> 	at org.apache.solr.core.SolrCore.<init>(SolrCore.java:835)
[junit4:junit4]   1> 	at org.apache.solr.core.SolrCore.<init>(SolrCore.java:627)
[junit4:junit4]   1> 	at org.apache.solr.core.CoreContainer.createFromLocal(CoreContainer.java:727)
[junit4:junit4]   1> 	at org.apache.solr.core.CoreContainer.create(CoreContainer.java:762)
[junit4:junit4]   1> 	... 10 more
[junit4:junit4]   1> Caused by: java.security.AccessControlException: access denied (java.io.FilePermission /Users/jenkins/jenkins-slave/workspace/Lucene-Solr-4.x-MacOSX/solr/solrj/src/test-files/solrj/solr/shared/./data/index write)
[junit4:junit4]   1> 	at java.security.AccessControlContext.checkPermission(AccessControlContext.java:374)
[junit4:junit4]   1> 	at java.security.AccessController.checkPermission(AccessController.java:549)
[junit4:junit4]   1> 	at java.lang.SecurityManager.checkPermission(SecurityManager.java:532)
[junit4:junit4]   1> 	at java.lang.SecurityManager.checkWrite(SecurityManager.java:962)
[junit4:junit4]   1> 	at java.io.File.mkdir(File.java:1155)
[junit4:junit4]   1> 	at java.io.File.mkdirs(File.java:1184)
[junit4:junit4]   1> 	at org.apache.lucene.store.NativeFSLock.obtain(NativeFSLockFactory.java:170)
[junit4:junit4]   1> 	at org.apache.lucene.store.MockLockFactoryWrapper$MockLock.obtain(MockLockFactoryWrapper.java:72)
[junit4:junit4]   1> 	at org.apache.lucene.store.Lock.obtain(Lock.java:72)
[junit4:junit4]   1> 	at org.apache.lucene.index.IndexWriter.<init>(IndexWriter.java:667)
[junit4:junit4]   1> 	at org.apache.solr.update.SolrIndexWriter.<init>(SolrIndexWriter.java:77)
[junit4:junit4]   1> 	at org.apache.solr.update.SolrIndexWriter.create(SolrIndexWriter.java:64)
[junit4:junit4]   1> 	at org.apache.solr.core.SolrCore.initIndex(SolrCore.java:507)
[junit4:junit4]   1> 	at org.apache.solr.core.SolrCore.<init>(SolrCore.java:759)
[junit4:junit4]   1> 	... 13 more
[junit4:junit4]   1> 
[junit4:junit4]   1> 130669 [coreLoadExecutor-98-thread-3] INFO  org.apache.solr.core.SolrCore  ? org.apache.solr.core.MockDirectoryFactory
[junit4:junit4]   1> 130712 [coreLoadExecutor-98-thread-2] INFO  org.apache.solr.core.SolrCore  ? Hard AutoCommit: disabled
[junit4:junit4]   1> 130711 [coreLoadExecutor-98-thread-1] INFO  org.apache.solr.core.CoreContainer  ? Creating SolrCore 'newCore' using instanceDir: /Users/jenkins/jenkins-slave/workspace/Lucene-Solr-4.x-MacOSX/solr/solrj/src/test-files/solrj/solr/shared
[junit4:junit4]   1> 130714 [coreLoadExecutor-98-thread-2] INFO  org.apache.solr.core.SolrCore  ? Soft AutoCommit: disabled
[junit4:junit4]   1> 130712 [coreLoadExecutor-98-thread-3] INFO  org.apache.solr.core.SolrCore  ? [renamed_core] Opening new SolrCore at /Users/jenkins/jenkins-slave/workspace/Lucene-Solr-4.x-MacOSX/solr/solrj/src/test-files/solrj/solr/shared/./, dataDir=/Users/jenkins/jenkins-slave/workspace/Lucene-Solr-4.x-MacOSX/solr/build/solr-solrj/test/J0/./solrtest-TestSolrProperties-1370959821259/data1/
[junit4:junit4]   1> 130717 [coreLoadExecutor-98-thread-3] INFO  org.apache.solr.core.SolrCore  ? JMX monitoring not detected for core: renamed_core
[junit4:junit4]   1> 130717 [coreLoadExecutor-98-thread-3] INFO  org.apache.solr.core.SolrCore  ? org.apache.solr.core.MockDirectoryFactory
[junit4:junit4]   1> 130720 [searcherExecutor-99-thread-1] INFO  org.apache.solr.core.SolrCore  ? [core1] Registered new searcher Searcher@afba5d main{StandardDirectoryReader(segments_1:1)}
[junit4:junit4]   1> 130715 [coreLoadExecutor-98-thread-1] INFO  org.apache.solr.core.SolrResourceLoader  ? new SolrResourceLoader for directory: '/Users/jenkins/jenkins-slave/workspace/Lucene-Solr-4.x-MacOSX/solr/solrj/src/test-files/solrj/solr/shared/'
[junit4:junit4]   1> 130721 [coreLoadExecutor-98-thread-3] INFO  org.apache.solr.core.CachingDirectoryFactory  ? return new directory for /Users/jenkins/jenkins-slave/workspace/Lucene-Solr-4.x-MacOSX/solr/build/solr-solrj/test/J0/./solrtest-TestSolrProperties-1370959821259/data1
[junit4:junit4]   1> 130728 [coreLoadExecutor-98-thread-3] INFO  org.apache.solr.core.SolrCore  ? New index directory detected: old=null new=/Users/jenkins/jenkins-slave/workspace/Lucene-Solr-4.x-MacOSX/solr/build/solr-solrj/test/J0/./solrtest-TestSolrProperties-1370959821259/data1/index/
[junit4:junit4]   1> 130729 [coreLoadExecutor-98-thread-3] WARN  org.apache.solr.core.SolrCore  ? [renamed_core] Solr index directory '/Users/jenkins/jenkins-slave/workspace/Lucene-Solr-4.x-MacOSX/solr/build/solr-solrj/test/J0/./solrtest-TestSolrProperties-1370959821259/data1/index' doesn't exist. Creating new index...
[junit4:junit4]   1> 130730 [coreLoadExecutor-98-thread-2] INFO  org.apache.solr.core.CoreContainer  ? registering core: core1
[junit4:junit4]   1> 130731 [coreLoadExecutor-98-thread-3] INFO  org.apache.solr.core.CachingDirectoryFactory  ? return new directory for /Users/jenkins/jenkins-slave/workspace/Lucene-Solr-4.x-MacOSX/solr/build/solr-solrj/test/J0/./solrtest-TestSolrProperties-1370959821259/data1/index
[junit4:junit4]   1> 130800 [coreLoadExecutor-98-thread-3] INFO  org.apache.solr.core.SolrCore  ? SolrDeletionPolicy.onCommit: commits: num=1
[junit4:junit4]   1> 	commit{dir=MockDirWrapper(org.apache.lucene.store.RAMDirectory@5304273f lockFactory=org.apache.lucene.store.NativeFSLockFactory@7c23b1e1),segFN=segments_1,generation=1}
[junit4:junit4]   1> 130802 [coreLoadExecutor-98-thread-3] INFO  org.apache.solr.core.SolrCore  ? newest commit generation = 1
[junit4:junit4]   1> 130810 [coreLoadExecutor-98-thread-3] INFO  org.apache.solr.core.RequestHandlers  ? created standard: solr.StandardRequestHandler
[junit4:junit4]   1> 130811 [coreLoadExecutor-98-thread-3] INFO  org.apache.solr.core.RequestHandlers  ? created /update: solr.UpdateRequestHandler
[junit4:junit4]   1> 130812 [coreLoadExecutor-98-thread-3] INFO  org.apache.solr.core.RequestHandlers  ? created /admin/: org.apache.solr.handler.admin.AdminHandlers
[junit4:junit4]   1> 130893 [coreLoadExecutor-98-thread-3] INFO  org.apache.solr.handler.loader.XMLLoader  ? xsltCacheLifetimeSeconds=60
[junit4:junit4]   1> 130917 [coreLoadExecutor-98-thread-3] INFO  org.apache.solr.search.SolrIndexSearcher  ? Opening Searcher@15ebec47 main
[junit4:junit4]   1> 130918 [coreLoadExecutor-98-thread-3] INFO  org.apache.solr.update.UpdateHandler  ? Clearing tlog files, tlogDir=/Users/jenkins/jenkins-slave/workspace/Lucene-Solr-4.x-MacOSX/solr/build/solr-solrj/test/J0/./solrtest-TestSolrProperties-1370959821259/data1/tlog
[junit4:junit4]   1> 130921 [coreLoadExecutor-98-thread-3] INFO  org.apache.solr.core.SolrCore  ? Hard AutoCommit: disabled
[junit4:junit4]   1> 130921 [coreLoadExecutor-98-thread-3] INFO  org.apache.solr.core.SolrCore  ? Soft AutoCommit: disabled
[junit4:junit4]   1> 130923 [searcherExecutor-101-thread-1] INFO  org.apache.solr.core.SolrCore  ? [renamed_core] Registered new searcher Searcher@15ebec47 main{StandardDirectoryReader(segments_1:1)}
[junit4:junit4]   1> 130923 [coreLoadExecutor-98-thread-3] INFO  org.apache.solr.core.CoreContainer  ? registering core: renamed_core
[junit4:junit4]   1> 131015 [coreLoadExecutor-98-thread-1] INFO  org.apache.solr.core.SolrConfig  ? Using Lucene MatchVersion: LUCENE_44
[junit4:junit4]   1> 131200 [coreLoadExecutor-98-thread-1] INFO  org.apache.solr.core.Config  ? Loaded SolrConfig: solrconfig.xml
[junit4:junit4]   1> 131201 [coreLoadExecutor-98-thread-1] INFO  org.apache.solr.schema.IndexSchema  ? Reading Solr Schema from schema.xml
[junit4:junit4]   1> 131218 [coreLoadExecutor-98-thread-1] INFO  org.apache.solr.schema.IndexSchema  ? [newCore] Schema name=example core 
[junit4:junit4]   1> 131366 [coreLoadExecutor-98-thread-1] INFO  org.apache.solr.schema.IndexSchema  ? default search field in schema is name
[junit4:junit4]   1> 131370 [coreLoadExecutor-98-thread-1] INFO  org.apache.solr.schema.IndexSchema  ? query parser default operator is OR
[junit4:junit4]   1> 131374 [coreLoadExecutor-98-thread-1] INFO  org.apache.solr.schema.IndexSchema  ? unique key field: id
[junit4:junit4]   1> 131391 [coreLoadExecutor-98-thread-1] INFO  org.apache.solr.core.SolrCore  ? org.apache.solr.core.MockDirectoryFactory
[junit4:junit4]   1> 131393 [coreLoadExecutor-98-thread-1] INFO  org.apache.solr.core.SolrCore  ? [newCore] Opening new SolrCore at /Users/jenkins/jenkins-slave/workspace/Lucene-Solr-4.x-MacOSX/solr/solrj/src/test-files/solrj/solr/shared/, dataDir=/Users/jenkins/jenkins-slave/workspace/Lucene-Solr-4.x-MacOSX/solr/build/solr-solrj/test/J0/./solrtest-TestSolrProperties-1370959821259/data3/
[junit4:junit4]   1> 131394 [coreLoadExecutor-98-thread-1] INFO  org.apache.solr.core.SolrCore  ? JMX monitoring not detected for core: newCore
[junit4:junit4]   1> 131395 [coreLoadExecutor-98-thread-1] INFO  org.apache.solr.core.SolrCore  ? org.apache.solr.core.MockDirectoryFactory
[junit4:junit4]   1> 131396 [coreLoadExecutor-98-thread-1] INFO  org.apache.solr.core.CachingDirectoryFactory  ? return new directory for /Users/jenkins/jenkins-slave/workspace/Lucene-Solr-4.x-MacOSX/solr/build/solr-solrj/test/J0/./solrtest-TestSolrProperties-1370959821259/data3
[junit4:junit4]   1> 131397 [coreLoadExecutor-98-thread-1] INFO  org.apache.solr.core.SolrCore  ? New index directory detected: old=null new=/Users/jenkins/jenkins-slave/workspace/Lucene-Solr-4.x-MacOSX/solr/build/solr-solrj/test/J0/./solrtest-TestSolrProperties-1370959821259/data3/index/
[junit4:junit4]   1> 131398 [coreLoadExecutor-98-thread-1] WARN  org.apache.solr.core.SolrCore  ? [newCore] Solr index directory '/Users/jenkins/jenkins-slave/workspace/Lucene-Solr-4.x-MacOSX/solr/build/solr-solrj/test/J0/./solrtest-TestSolrProperties-1370959821259/data3/index' doesn't exist. Creating new index...
[junit4:junit4]   1> 131399 [coreLoadExecutor-98-thread-1] INFO  org.apache.solr.core.CachingDirectoryFactory  ? return new directory for /Users/jenkins/jenkins-slave/workspace/Lucene-Solr-4.x-MacOSX/solr/build/solr-solrj/test/J0/./solrtest-TestSolrProperties-1370959821259/data3/index
[junit4:junit4]   1> 131404 [coreLoadExecutor-98-thread-1] INFO  org.apache.solr.core.SolrCore  ? SolrDeletionPolicy.onCommit: commits: num=1
[junit4:junit4]   1> 	commit{dir=MockDirWrapper(org.apache.lucene.store.RAMDirectory@71b7eb54 lockFactory=org.apache.lucene.store.NativeFSLockFactory@5fc0936),segFN=segments_1,generation=1}
[junit4:junit4]   1> 131405 [coreLoadExecutor-98-thread-1] INFO  org.apache.solr.core.SolrCore  ? newest commit generation = 1
[junit4:junit4]   1> 131418 [coreLoadExecutor-98-thread-1] INFO  org.apache.solr.core.RequestHandlers  ? created standard: solr.StandardRequestHandler
[junit4:junit4]   1> 131419 [coreLoadExecutor-98-thread-1] INFO  org.apache.solr.core.RequestHandlers  ? created /update: solr.UpdateRequestHandler
[junit4:junit4]   1> 131420 [coreLoadExecutor-98-thread-1] INFO  org.apache.solr.core.RequestHandlers  ? created /admin/: org.apache.solr.handler.admin.AdminHandlers
[junit4:junit4]   1> 131443 [coreLoadExecutor-98-thread-1] INFO  org.apache.solr.handler.loader.XMLLoader  ? xsltCacheLifetimeSeconds=60
[junit4:junit4]   1> 131472 [coreLoadExecutor-98-thread-1] INFO  org.apache.solr.search.SolrIndexSearcher  ? Opening Searcher@1f5e4ae5 main
[junit4:junit4]   1> 131473 [coreLoadExecutor-98-thread-1] INFO  org.apache.solr.update.UpdateHandler  ? Clearing tlog files, tlogDir=/Users/jenkins/jenkins-slave/workspace/Lucene-Solr-4.x-MacOSX/solr/build/solr-solrj/test/J0/./solrtest-TestSolrProperties-1370959821259/tlog3/tlog
[junit4:junit4]   1> 131475 [coreLoadExecutor-98-thread-1] INFO  org.apache.solr.core.SolrCore  ? Hard AutoCommit: disabled
[junit4:junit4]   1> 131476 [coreLoadExecutor-98-thread-1] INFO  org.apache.solr.core.SolrCore  ? Soft AutoCommit: disabled
[junit4:junit4]   1> 131478 [coreLoadExecutor-98-thread-1] INFO  org.apache.solr.core.CoreContainer  ? registering core: newCore
[junit4:junit4]   1> 131478 [searcherExecutor-108-thread-1] INFO  org.apache.solr.core.SolrCore  ? [newCore] Registered new searcher Searcher@1f5e4ae5 main{StandardDirectoryReader(segments_1:1)}
[junit4:junit4]   1> 131483 [TEST-TestSolrProperties.testProperties-seed#[9AD7FA0840C60AC0]] INFO  org.apache.solr.core.CoreContainer  ? Persisting cores config to ./solrtest-TestSolrProperties-1370959821259/solr-persist.xml
[junit4:junit4]   1> 131504 [TEST-TestSolrProperties.testProperties-seed#[9AD7FA0840C60AC0]] INFO  org.apache.solr.core.SolrXMLSerializer  ? Persisting cores config to ./solrtest-TestSolrProperties-1370959821259/solr-persist.xml
[junit4:junit4]   1> 131509 [TEST-TestSolrProperties.testProperties-seed#[9AD7FA0840C60AC0]] INFO  org.apache.solr.core.SolrCore  ? [renamed_core] webapp=null path=/admin/cores params={action=PERSIST&file=solr-persist.xml} status=0 QTime=26 
[junit4:junit4]   1> 131510 [TEST-TestSolrProperties.testProperties-seed#[9AD7FA0840C60AC0]] INFO  org.apache.solr.core.CoreContainer  ? Shutting down CoreContainer instance=33680816
[junit4:junit4]   2> 7207722 T108 ccr.ThreadLeakControl$2.evaluate WARNING Suite execution timed out: org.apache.solr.client.solrj.embedded.TestSolrProperties
[junit4:junit4]   2> 	==== jstack at approximately timeout time ====
[junit4:junit4]   2> 	"Thread-52" ID=125 WAITING on java.lang.Object@3ff0efca
[junit4:junit4]   2> 		at java.lang.Object.wait(Native Method)
[junit4:junit4]   2> 		- waiting on java.lang.Object@3ff0efca
[junit4:junit4]   2> 		at java.lang.Object.wait(Object.java:485)
[junit4:junit4]   2> 		at org.apache.solr.core.CloserThread.run(CoreContainer.java:1260)
[junit4:junit4]   2> 	
[junit4:junit4]   2> 	"searcherExecutor-108-thread-1" ID=124 WAITING on java.util.concurrent.locks.AbstractQueuedSynchronizer$ConditionObject@630ed791
[junit4:junit4]   2> 		at sun.misc.Unsafe.park(Native Method)
[junit4:junit4]   2> 		- waiting on java.util.concurrent.locks.AbstractQueuedSynchronizer$ConditionObject@630ed791
[junit4:junit4]   2> 		at java.util.concurrent.locks.LockSupport.park(LockSupport.java:156)
[junit4:junit4]   2> 		at java.util.concurrent.locks.AbstractQueuedSynchronizer$ConditionObject.await(AbstractQueuedSynchronizer.java:1987)
[junit4:junit4]   2> 		at java.util.concurrent.LinkedBlockingQueue.take(LinkedBlockingQueue.java:399)
[junit4:junit4]   2> 		at java.util.concurrent.ThreadPoolExecutor.getTask(ThreadPoolExecutor.java:957)
[junit4:junit4]   2> 		at java.util.concurrent.ThreadPoolExecutor$Worker.run(ThreadPoolExecutor.java:917)
[junit4:junit4]   2> 		at java.lang.Thread.run(Thread.java:680)
[junit4:junit4]   2> 	
[junit4:junit4]   2> 	"searcherExecutor-101-thread-1" ID=123 WAITING on java.util.concurrent.locks.AbstractQueuedSynchronizer$ConditionObject@636aa365
[junit4:junit4]   2> 		at sun.misc.Unsafe.park(Native Method)
[junit4:junit4]   2> 		- waiting on java.util.concurrent.locks.AbstractQueuedSynchronizer$ConditionObject@636aa365
[junit4:junit4]   2> 		at java.util.concurrent.locks.LockSupport.park(LockSupport.java:156)
[junit4:junit4]   2> 		at java.util.concurrent.locks.AbstractQueuedSynchronizer$ConditionObject.await(AbstractQueuedSynchronizer.java:1987)
[junit4:junit4]   2> 		at java.util.concurrent.LinkedBlockingQueue.take(LinkedBlockingQueue.java:399)
[junit4:junit4]   2> 		at java.util.concurrent.ThreadPoolExecutor.getTask(ThreadPoolExecutor.java:957)
[junit4:junit4]   2> 		at java.util.concurrent.ThreadPoolExecutor$Worker.run(ThreadPoolExecutor.java:917)
[junit4:junit4]   2> 		at java.lang.Thread.run(Thread.java:680)
[junit4:junit4]   2> 	
[junit4:junit4]   2> 	"searcherExecutor-99-thread-1" ID=122 WAITING on java.util.concurrent.locks.AbstractQueuedSynchronizer$ConditionObject@6e0d6ee0
[junit4:junit4]   2> 		at sun.misc.Unsafe.park(Native Method)
[junit4:junit4]   2> 		- waiting on java.util.concurrent.locks.AbstractQueuedSynchronizer$ConditionObject@6e0d6ee0
[junit4:junit4]   2> 		at java.util.concurrent.locks.LockSupport.park(LockSupport.java:156)
[junit4:junit4]   2> 		at java.util.concurrent.locks.AbstractQueuedSynchronizer$ConditionObject.await(AbstractQueuedSynchronizer.java:1987)
[junit4:junit4]   2> 		at java.util.concurrent.LinkedBlockingQueue.take(LinkedBlockingQueue.java:399)
[junit4:junit4]   2> 		at java.util.concurrent.ThreadPoolExecutor.getTask(ThreadPoolExecutor.java:957)
[junit4:junit4]   2> 		at java.util.concurrent.ThreadPoolExecutor$Worker.run(ThreadPoolExecutor.java:917)
[junit4:junit4]   2> 		at java.lang.Thread.run(Thread.java:680)
[junit4:junit4]   2> 	
[junit4:junit4]   2> 	"TEST-TestSolrProperties.testProperties-seed#[9AD7FA0840C60AC0]" ID=109 WAITING on org.apache.solr.core.CloserThread@33ea6c92
[junit4:junit4]   2> 		at java.lang.Object.wait(Native Method)
[junit4:junit4]   2> 		- waiting on org.apache.solr.core.CloserThread@33ea6c92
[junit4:junit4]   2> 		at java.lang.Thread.join(Thread.java:1210)
[junit4:junit4]   2> 		at java.lang.Thread.join(Thread.java:1263)
[junit4:junit4]   2> 		at org.apache.solr.core.CoreContainer.shutdown(CoreContainer.java:570)
[junit4:junit4]   2> 		at org.apache.solr.client.solrj.embedded.AbstractEmbeddedSolrServerTestCase.tearDown(AbstractEmbeddedSolrServerTestCase.java:73)
[junit4:junit4]   2> 		at org.apache.solr.client.solrj.embedded.TestSolrProperties.tearDown(TestSolrProperties.java:76)
[junit4:junit4]   2> 		at sun.reflect.NativeMethodAccessorImpl.invoke0(Native Method)
[junit4:junit4]   2> 		at sun.reflect.NativeMethodAccessorImpl.invoke(NativeMethodAccessorImpl.java:39)
[junit4:junit4]   2> 		at sun.reflect.DelegatingMethodAccessorImpl.invoke(DelegatingMethodAccessorImpl.java:25)
[junit4:junit4]   2> 		at java.lang.reflect.Method.invoke(Method.java:597)
[junit4:junit4]   2> 		at com.carrotsearch.randomizedtesting.RandomizedRunner.invoke(RandomizedRunner.java:1559)
[junit4:junit4]   2> 		at com.carrotsearch.randomizedtesting.RandomizedRunner.access$600(RandomizedRunner.java:79)
[junit4:junit4]   2> 		at com.carrotsearch.randomizedtesting.RandomizedRunner$8.evaluate(RandomizedRunner.java:795)
[junit4:junit4]   2> 		at com.carrotsearch.randomizedtesting.rules.SystemPropertiesRestoreRule$1.evaluate(SystemPropertiesRestoreRule.java:53)
[junit4:junit4]   2> 		at org.apache.lucene.util.TestRuleSetupTeardownChained$1.evaluate(TestRuleSetupTeardownChained.java:50)
[junit4:junit4]   2> 		at org.apache.lucene.util.TestRuleFieldCacheSanity$1.evaluate(TestRuleFieldCacheSanity.java:51)
[junit4:junit4]   2> 		at org.apache.lucene.util.AbstractBeforeAfterRule$1.evaluate(AbstractBeforeAfterRule.java:46)
[junit4:junit4]   2> 		at com.carrotsearch.randomizedtesting.rules.SystemPropertiesInvariantRule$1.evaluate(SystemPropertiesInvariantRule.java:55)
[junit4:junit4]   2> 		at org.apache.lucene.util.TestRuleThreadAndTestName$1.evaluate(TestRuleThreadAndTestName.java:49)
[junit4:junit4]   2> 		at org.apache.lucene.util.TestRuleIgnoreAfterMaxFailures$1.evaluate(TestRuleIgnoreAfterMaxFailures.java:70)
[junit4:junit4]   2> 		at org.apache.lucene.util.TestRuleMarkFailure$1.evaluate(TestRuleMarkFailure.java:48)
[junit4:junit4]   2> 		at com.carrotsearch.randomizedtesting.rules.StatementAdapter.evaluate(StatementAdapter.java:36)
[junit4:junit4]   2> 		at com.carrotsearch.randomizedtesting.ThreadLeakControl$StatementRunner.run(ThreadLeakControl.java:358)
[junit4:junit4]   2> 		at com.carrotsearch.randomizedtesting.ThreadLeakControl.forkTimeoutingTask(ThreadLeakControl.java:782)
[junit4:junit4]   2> 		at com.carrotsearch.randomizedtesting.ThreadLeakControl$3.evaluate(ThreadLeakControl.java:442)
[junit4:junit4]   2> 		at com.carrotsearch.randomizedtesting.RandomizedRunner.runSingleTest(RandomizedRunner.java:746)
[junit4:junit4]   2> 		at com.carrotsearch.randomizedtesting.RandomizedRunner$3.evaluate(RandomizedRunner.java:648)
[junit4:junit4]   2> 		at com.carrotsearch.randomizedtesting.RandomizedRunner$4.evaluate(RandomizedRunner.java:682)
[junit4:junit4]   2> 		at com.carrotsearch.randomizedtesting.RandomizedRunner$5.evaluate(RandomizedRunner.java:693)
[junit4:junit4]   2> 		at org.apache.lucene.util.AbstractBeforeAfterRule$1.evaluate(AbstractBeforeAfterRule.java:46)
[junit4:junit4]   2> 		at org.apache.lucene.util.TestRuleStoreClassName$1.evaluate(TestRuleStoreClassName.java:42)
[junit4:junit4]   2> 		at com.carrotsearch.randomizedtesting.rules.SystemPropertiesInvariantRule$1.evaluate(SystemPropertiesInvariantRule.java:55)
[junit4:junit4]   2> 		at com.carrotsearch.randomizedtesting.rules.NoShadowingOrOverridesOnMethodsRule$1.evaluate(NoShadowingOrOverridesOnMethodsRule.java:39)
[junit4:junit4]   2> 		at com.carrotsearch.randomizedtesting.rules.NoShadowingOrOverridesOnMethodsRule$1.evaluate(NoShadowingOrOverridesOnMethodsRule.java:39)
[junit4:junit4]   2> 		at com.carrotsearch.randomizedtesting.rules.StatementAdapter.evaluate(StatementAdapter.java:36)
[junit4:junit4]   2> 		at org.apache.lucene.util.TestRuleAssertionsRequired$1.evaluate(TestRuleAssertionsRequired.java:43)
[junit4:junit4]   2> 		at org.apache.lucene.util.TestRuleMarkFailure$1.evaluate(TestRuleMarkFailure.java:48)
[junit4:junit4]   2> 		at org.apache.lucene.util.TestRuleIgnoreAfterMaxFailures$1.evaluate(TestRuleIgnoreAfterMaxFailures.java:70)
[junit4:junit4]   2> 		at org.apache.lucene.util.TestRuleIgnoreTestSuites$1.evaluate(TestRuleIgnoreTestSuites.java:55)
[junit4:junit4]   2> 		at com.carrotsearch.randomizedtesting.rules.StatementAdapter.evaluate(StatementAdapter.java:36)
[junit4:junit4]   2> 		at com.carrotsearch.randomizedtesting.ThreadLeakControl$StatementRunner.run(ThreadLeakControl.java:358)
[junit4:junit4]   2> 		at java.lang.Thread.run(Thread.java:680)
[junit4:junit4]   2> 	
[junit4:junit4]   2> 	"SUITE-TestSolrProperties-seed#[9AD7FA0840C60AC0]" ID=108 RUNNABLE
[junit4:junit4]   2> 		at sun.management.ThreadImpl.dumpThreads0(Native Method)
[junit4:junit4]   2> 		at sun.management.ThreadImpl.dumpAllThreads(ThreadImpl.java:433)
[junit4:junit4]   2> 		at com.carrotsearch.randomizedtesting.ThreadLeakControl.formatThreadStacksFull(ThreadLeakControl.java:655)
[junit4:junit4]   2> 		at com.carrotsearch.randomizedtesting.ThreadLeakControl.access$800(ThreadLeakControl.java:60)
[junit4:junit4]   2> 		at com.carrotsearch.randomizedtesting.ThreadLeakControl$2.evaluate(ThreadLeakControl.java:396)
[junit4:junit4]   2> 		- locked java.lang.Object@637dffde
[junit4:junit4]   2> 		at com.carrotsearch.randomizedtesting.RandomizedRunner.runSuite(RandomizedRunner.java:556)
[junit4:junit4]   2> 		at com.carrotsearch.randomizedtesting.RandomizedRunner.access$200(RandomizedRunner.java:79)
[junit4:junit4]   2> 		at com.carrotsearch.randomizedtesting.RandomizedRunner$1.run(RandomizedRunner.java:492)
[junit4:junit4]   2> 	
[junit4:junit4]   2> 	"Signal Dispatcher" ID=5 RUNNABLE
[junit4:junit4]   2> 	
[junit4:junit4]   2> 	"Finalizer" ID=3 WAITING on java.lang.ref.ReferenceQueue$Lock@65297ad9
[junit4:junit4]   2> 		at java.lang.Object.wait(Native Method)
[junit4:junit4]   2> 		- waiting on java.lang.ref.ReferenceQueue$Lock@65297ad9
[junit4:junit4]   2> 		at java.lang.ref.ReferenceQueue.remove(ReferenceQueue.java:118)
[junit4:junit4]   2> 		at java.lang.ref.ReferenceQueue.remove(ReferenceQueue.java:134)
[junit4:junit4]   2> 		at java.lang.ref.Finalizer$FinalizerThread.run(Finalizer.java:171)
[junit4:junit4]   2> 	
[junit4:junit4]   2> 	"Reference Handler" ID=2 WAITING on java.lang.ref.Reference$Lock@6407072
[junit4:junit4]   2> 		at java.lang.Object.wait(Native Method)
[junit4:junit4]   2> 		- waiting on java.lang.ref.Reference$Lock@6407072
[junit4:junit4]   2> 		at java.lang.Object.wait(Object.java:485)
[junit4:junit4]   2> 		at java.lang.ref.Reference$ReferenceHandler.run(Reference.java:116)
[junit4:junit4]   2> 	
[junit4:junit4]   2> 	"main" ID=1 WAITING on com.carrotsearch.randomizedtesting.RandomizedRunner$1@66f3c66e
[junit4:junit4]   2> 		at java.lang.Object.wait(Native Method)
[junit4:junit4]   2> 		- waiting on com.carrotsearch.randomizedtesting.RandomizedRunner$1@66f3c66e
[junit4:junit4]   2> 		at java.lang.Thread.join(Thread.java:1210)
[junit4:junit4]   2> 		at java.lang.Thread.join(Thread.java:1263)
[junit4:junit4]   2> 		at com.carrotsearch.randomizedtesting.RandomizedRunner.runSuite(RandomizedRunner.java:502)
[junit4:junit4]   2> 		at com.carrotsearch.randomizedtesting.RandomizedRunner.run(RandomizedRunner.java:399)
[junit4:junit4]   2> 		at com.carrotsearch.ant.tasks.junit4.slave.SlaveMain.execute(SlaveMain.java:180)
[junit4:junit4]   2> 		at com.carrotsearch.ant.tasks.junit4.slave.SlaveMain.main(SlaveMain.java:275)
[junit4:junit4]   2> 		at com.carrotsearch.ant.tasks.junit4.slave.SlaveMainSafe.main(SlaveMainSafe.java:12)
[junit4:junit4]   2> 	
[junit4:junit4]   2> 	^^==============================================
[junit4:junit4]   2> 	
[junit4:junit4]   2> NOTE: reproduce with: ant test  -Dtestcase=TestSolrProperties -Dtests.method=testProperties -Dtests.seed=9AD7FA0840C60AC0 -Dtests.slow=true -Dtests.locale=sq -Dtests.timezone=NZ-CHAT -Dtests.file.encoding=US-ASCII
[junit4:junit4] ERROR   7200s | TestSolrProperties.testProperties <<<
[junit4:junit4]    > Throwable #1: java.lang.Exception: Test abandoned because suite timeout was reached.
[junit4:junit4]    > 	at __randomizedtesting.SeedInfo.seed([9AD7FA0840C60AC0]:0)
[junit4:junit4]   2> 7207942 T108 ccr.ThreadLeakControl.checkThreadLeaks WARNING Will linger awaiting termination of 5 leaked thread(s).
[junit4:junit4]   2> 7227998 T108 ccr.ThreadLeakControl.checkThreadLeaks SEVERE 5 threads leaked from SUITE scope at org.apache.solr.client.solrj.embedded.TestSolrProperties: 
[junit4:junit4]   2> 	   1) Thread[id=109, name=TEST-TestSolrProperties.testProperties-seed#[9AD7FA0840C60AC0], state=WAITING, group=TGRP-TestSolrProperties]
[junit4:junit4]   2> 	        at java.lang.Object.wait(Native Method)
[junit4:junit4]   2> 	        at java.lang.Thread.join(Thread.java:1210)
[junit4:junit4]   2> 	        at java.lang.Thread.join(Thread.java:1263)
[junit4:junit4]   2> 	        at org.apache.solr.core.CoreContainer.shutdown(CoreContainer.java:570)
[junit4:junit4]   2> 	        at org.apache.solr.client.solrj.embedded.AbstractEmbeddedSolrServerTestCase.tearDown(AbstractEmbeddedSolrServerTestCase.java:73)
[junit4:junit4]   2> 	        at org.apache.solr.client.solrj.embedded.TestSolrProperties.tearDown(TestSolrProperties.java:76)
[junit4:junit4]   2> 	        at sun.reflect.NativeMethodAccessorImpl.invoke0(Native Method)
[junit4:junit4]   2> 	        at sun.reflect.NativeMethodAccessorImpl.invoke(NativeMethodAccessorImpl.java:39)
[junit4:junit4]   2> 	        at sun.reflect.DelegatingMethodAccessorImpl.invoke(DelegatingMethodAccessorImpl.java:25)
[junit4:junit4]   2> 	        at java.lang.reflect.Method.invoke(Method.java:597)
[junit4:junit4]   2> 	        at com.carrotsearch.randomizedtesting.RandomizedRunner.invoke(RandomizedRunner.java:1559)
[junit4:junit4]   2> 	        at com.carrotsearch.randomizedtesting.RandomizedRunner.access$600(RandomizedRunner.java:79)
[junit4:junit4]   2> 	        at com.carrotsearch.randomizedtesting.RandomizedRunner$8.evaluate(RandomizedRunner.java:795)
[junit4:junit4]   2> 	        at com.carrotsearch.randomizedtesting.rules.SystemPropertiesRestoreRule$1.evaluate(SystemPropertiesRestoreRule.java:53)
[junit4:junit4]   2> 	        at org.apache.lucene.util.TestRuleSetupTeardownChained$1.evaluate(TestRuleSetupTeardownChained.java:50)
[junit4:junit4]   2> 	        at org.apache.lucene.util.TestRuleFieldCacheSanity$1.evaluate(TestRuleFieldCacheSanity.java:51)
[junit4:junit4]   2> 	        at org.apache.lucene.util.AbstractBeforeAfterRule$1.evaluate(AbstractBeforeAfterRule.java:46)
[junit4:junit4]   2> 	        at com.carrotsearch.randomizedtesting.rules.SystemPropertiesInvariantRule$1.evaluate(SystemPropertiesInvariantRule.java:55)
[junit4:junit4]   2> 	        at org.apache.lucene.util.TestRuleThreadAndTestName$1.evaluate(TestRuleThreadAndTestName.java:49)
[junit4:junit4]   2> 	        at org.apache.lucene.util.TestRuleIgnoreAfterMaxFailures$1.evaluate(TestRuleIgnoreAfterMaxFailures.java:70)
[junit4:junit4]   2> 	        at org.apache.lucene.util.TestRuleMarkFailure$1.evaluate(TestRuleMarkFailure.java:48)
[junit4:junit4]   2> 	        at com.carrotsearch.randomizedtesting.rules.StatementAdapter.evaluate(StatementAdapter.java:36)
[junit4:junit4]   2> 	        at com.carrotsearch.randomizedtesting.ThreadLeakControl$StatementRunner.run(ThreadLeakControl.java:358)
[junit4:junit4]   2> 	        at com.carrotsearch.randomizedtesting.ThreadLeakControl.forkTimeoutingTask(ThreadLeakControl.java:782)
[junit4:junit4]   2> 	        at com.carrotsearch.randomizedtesting.ThreadLeakControl$3.evaluate(ThreadLeakControl.java:442)
[junit4:junit4]   2> 	        at com.carrotsearch.randomizedtesting.RandomizedRunner.runSingleTest(RandomizedRunner.java:746)
[junit4:junit4]   2> 	        at com.carrotsearch.randomizedtesting.RandomizedRunner$3.evaluate(RandomizedRunner.java:648)
[junit4:junit4]   2> 	        at com.carrotsearch.randomizedtesting.RandomizedRunner$4.evaluate(RandomizedRunner.java:682)
[junit4:junit4]   2> 	        at com.carrotsearch.randomizedtesting.RandomizedRunner$5.evaluate(RandomizedRunner.java:693)
[junit4:junit4]   2> 	        at org.apache.lucene.util.AbstractBeforeAfterRule$1.evaluate(AbstractBeforeAfterRule.java:46)
[junit4:junit4]   2> 	        at org.apache.lucene.util.TestRuleStoreClassName$1.evaluate(TestRuleStoreClassName.java:42)
[junit4:junit4]   2> 	        at com.carrotsearch.randomizedtesting.rules.SystemPropertiesInvariantRule$1.evaluate(SystemPropertiesInvariantRule.java:55)
[junit4:junit4]   2> 	        at com.carrotsearch.randomizedtesting.rules.NoShadowingOrOverridesOnMethodsRule$1.evaluate(NoShadowingOrOverridesOnMethodsRule.java:39)
[junit4:junit4]   2> 	        at com.carrotsearch.randomizedtesting.rules.NoShadowingOrOverridesOnMethodsRule$1.evaluate(NoShadowingOrOverridesOnMethodsRule.java:39)
[junit4:junit4]   2> 	        at com.carrotsearch.randomizedtesting.rules.StatementAdapter.evaluate(StatementAdapter.java:36)
[junit4:junit4]   2> 	        at org.apache.lucene.util.TestRuleAssertionsRequired$1.evaluate(TestRuleAssertionsRequired.java:43)
[junit4:junit4]   2> 	        at org.apache.lucene.util.TestRuleMarkFailure$1.evaluate(TestRuleMarkFailure.java:48)
[junit4:junit4]   2> 	        at org.apache.lucene.util.TestRuleIgnoreAfterMaxFailures$1.evaluate(TestRuleIgnoreAfterMaxFailures.java:70)
[junit4:junit4]   2> 	        at org.apache.lucene.util.TestRuleIgnoreTestSuites$1.evaluate(TestRuleIgnoreTestSuites.java:55)
[junit4:junit4]   2> 	        at com.carrotsearch.randomizedtesting.rules.StatementAdapter.evaluate(StatementAdapter.java:36)
[junit4:junit4]   2> 	        at com.carrotsearch.randomizedtesting.ThreadLeakControl$StatementRunner.run(ThreadLeakControl.java:358)
[junit4:junit4]   2> 	        at java.lang.Thread.run(Thread.java:680)
[junit4:junit4]   2> 	   2) Thread[id=122, name=searcherExecutor-99-thread-1, state=WAITING, group=TGRP-TestSolrProperties]
[junit4:junit4]   2> 	        at sun.misc.Unsafe.park(Native Method)
[junit4:junit4]   2> 	        at java.util.concurrent.locks.LockSupport.park(LockSupport.java:156)
[junit4:junit4]   2> 	        at java.util.concurrent.locks.AbstractQueuedSynchronizer$ConditionObject.await(AbstractQueuedSynchronizer.java:1987)
[junit4:junit4]   2> 	        at java.util.concurrent.LinkedBlockingQueue.take(LinkedBlockingQueue.java:399)
[junit4:junit4]   2> 	        at java.util.concurrent.ThreadPoolExecutor.getTask(ThreadPoolExecutor.java:957)
[junit4:junit4]   2> 	        at java.util.concurrent.ThreadPoolExecutor$Worker.run(ThreadPoolExecutor.java:917)
[junit4:junit4]   2> 	        at java.lang.Thread.run(Thread.java:680)
[junit4:junit4]   2> 	   3) Thread[id=124, name=searcherExecutor-108-thread-1, state=WAITING, group=TGRP-TestSolrProperties]
[junit4:junit4]   2> 	        at sun.misc.Unsafe.park(Native Method)
[junit4:junit4]   2> 	        at java.util.concurrent.locks.LockSupport.park(LockSupport.java:156)
[junit4:junit4]   2> 	        at java.util.concurrent.locks.AbstractQueuedSynchronizer$ConditionObject.await(AbstractQueuedSynchronizer.java:1987)
[junit4:junit4]   2> 	        at java.util.concurrent.LinkedBlockingQueue.take(LinkedBlockingQueue.java:399)
[junit4:junit4]   2> 	        at java.util.concurrent.ThreadPoolExecutor.getTask(ThreadPoolExecutor.java:957)
[junit4:junit4]   2> 	        at java.util.concurrent.ThreadPoolExecutor$Worker.run(ThreadPoolExecutor.java:917)
[junit4:junit4]   2> 	        at java.lang.Thread.run(Thread.java:680)
[junit4:junit4]   2> 	   4) Thread[id=125, name=Thread-52, state=WAITING, group=TGRP-TestSolrProperties]
[junit4:junit4]   2> 	        at java.lang.Object.wait(Native Method)
[junit4:junit4]   2> 	        at java.lang.Object.wait(Object.java:485)
[junit4:junit4]   2> 	        at org.apache.solr.core.CloserThread.run(CoreContainer.java:1260)
[junit4:junit4]   2> 	   5) Thread[id=123, name=searcherExecutor-101-thread-1, state=WAITING, group=TGRP-TestSolrProperties]
[junit4:junit4]   2> 	        at sun.misc.Unsafe.park(Native Method)
[junit4:junit4]   2> 	        at java.util.concurrent.locks.LockSupport.park(LockSupport.java:156)
[junit4:junit4]   2> 	        at java.util.concurrent.locks.AbstractQueuedSynchronizer$ConditionObject.await(AbstractQueuedSynchronizer.java:1987)
[junit4:junit4]   2> 	        at java.util.concurrent.LinkedBlockingQueue.take(LinkedBlockingQueue.java:399)
[junit4:junit4]   2> 	        at java.util.concurrent.ThreadPoolExecutor.getTask(ThreadPoolExecutor.java:957)
[junit4:junit4]   2> 	        at java.util.concurrent.ThreadPoolExecutor$Worker.run(ThreadPoolExecutor.java:917)
[junit4:junit4]   2> 	        at java.lang.Thread.run(Thread.java:680)
[junit4:junit4]   2> 7228000 T108 ccr.ThreadLeakControl.tryToInterruptAll Starting to interrupt leaked threads:
[junit4:junit4]   2> 	   1) Thread[id=109, name=TEST-TestSolrProperties.testProperties-seed#[9AD7FA0840C60AC0], state=WAITING, group=TGRP-TestSolrProperties]
[junit4:junit4]   2> 	   2) Thread[id=122, name=searcherExecutor-99-thread-1, state=WAITING, group=TGRP-TestSolrProperties]
[junit4:junit4]   2> 	   3) Thread[id=124, name=searcherExecutor-108-thread-1, state=WAITING, group=TGRP-TestSolrProperties]
[junit4:junit4]   2> 	   4) Thread[id=125, name=Thread-52, state=WAITING, group=TGRP-TestSolrProperties]
[junit4:junit4]   2> 	   5) Thread[id=123, name=searcherExecutor-101-thread-1, state=WAITING, group=TGRP-TestSolrProperties]
[junit4:junit4]   1> 7344261 [TEST-TestSolrProperties.testProperties-seed#[9AD7FA0840C60AC0]] INFO  org.apache.solr.core.SolrCore  ? [core1]  CLOSING SolrCore org.apache.solr.core.SolrCore@15a6d5e1
[junit4:junit4]   1> 7344263 [TEST-TestSolrProperties.testProperties-seed#[9AD7FA0840C60AC0]] INFO  org.apache.solr.update.UpdateHandler  ? closing DirectUpdateHandler2{commits=0,autocommits=0,soft autocommits=0,optimizes=0,rollbacks=0,expungeDeletes=0,docsPending=0,adds=0,deletesById=0,deletesByQuery=0,errors=0,cumulative_adds=0,cumulative_deletesById=0,cumulative_deletesByQuery=0,cumulative_errors=0}
[junit4:junit4]   1> 7344264 [TEST-TestSolrProperties.testProperties-seed#[9AD7FA0840C60AC0]] INFO  org.apache.solr.update.SolrCoreState  ? Closing SolrCoreState
[junit4:junit4]   1> 7344265 [TEST-TestSolrProperties.testProperties-seed#[9AD7FA0840C60AC0]] INFO  org.apache.solr.update.DefaultSolrCoreState  ? SolrCoreState ref count has reached 0 - closing IndexWriter
[junit4:junit4]   1> 7344265 [TEST-TestSolrProperties.testProperties-seed#[9AD7FA0840C60AC0]] INFO  org.apache.solr.update.DefaultSolrCoreState  ? closing IndexWriter with IndexWriterCloser
[junit4:junit4]   1> 7344267 [TEST-TestSolrProperties.testProperties-seed#[9AD7FA0840C60AC0]] INFO  org.apache.solr.core.SolrCore  ? [core1] Closing main searcher on request.
[junit4:junit4]   1> 7344268 [TEST-TestSolrProperties.testProperties-seed#[9AD7FA0840C60AC0]] INFO  org.apache.solr.core.CachingDirectoryFactory  ? Closing MockDirectoryFactory - 2 directories currently being tracked
[junit4:junit4]   1> 7344269 [TEST-TestSolrProperties.testProperties-seed#[9AD7FA0840C60AC0]] INFO  org.apache.solr.core.CachingDirectoryFactory  ? looking to close /Users/jenkins/jenkins-slave/workspace/Lucene-Solr-4.x-MacOSX/solr/build/solr-solrj/test/J0/./solrtest-TestSolrProperties-1370959821259/data2 [CachedDir<<refCount=0;path=/Users/jenkins/jenkins-slave/workspace/Lucene-Solr-4.x-MacOSX/solr/build/solr-solrj/test/J0/./solrtest-TestSolrProperties-1370959821259/data2;done=false>>]
[junit4:junit4]   1> 7344270 [TEST-TestSolrProperties.testProperties-seed#[9AD7FA0840C60AC0]] INFO  org.apache.solr.core.CachingDirectoryFactory  ? Closing directory: /Users/jenkins/jenkins-slave/workspace/Lucene-Solr-4.x-MacOSX/solr/build/solr-solrj/test/J0/./solrtest-TestSolrProperties-1370959821259/data2
[junit4:junit4]   1> 7344271 [TEST-TestSolrProperties.testProperties-seed#[9AD7FA0840C60AC0]] INFO  org.apache.solr.core.CachingDirectoryFactory  ? looking to close /Users/jenkins/jenkins-slave/workspace/Lucene-Solr-4.x-MacOSX/solr/build/solr-solrj/test/J0/./solrtest-TestSolrProperties-1370959821259/data2/index [CachedDir<<refCount=0;path=/Users/jenkins/jenkins-slave/workspace/Lucene-Solr-4.x-MacOSX/solr/build/solr-solrj/test/J0/./solrtest-TestSolrProperties-1370959821259/data2/index;done=false>>]
[junit4:junit4]   1> 7344272 [TEST-TestSolrProperties.testProperties-seed#[9AD7FA0840C60AC0]] INFO  org.apache.solr.core.CachingDirectoryFactory  ? Closing directory: /Users/jenkins/jenkins-slave/workspace/Lucene-Solr-4.x-MacOSX/solr/build/solr-solrj/test/J0/./solrtest-TestSolrProperties-1370959821259/data2/index
[junit4:junit4]   1> 7344273 [TEST-TestSolrProperties.testProperties-seed#[9AD7FA0840C60AC0]] INFO  org.apache.solr.core.SolrCore  ? [renamed_core]  CLOSING SolrCore org.apache.solr.core.SolrCore@3d69084f
[junit4:junit4]   1> 7344274 [TEST-TestSolrProperties.testProperties-seed#[9AD7FA0840C60AC0]] INFO  org.apache.solr.update.UpdateHandler  ? closing DirectUpdateHandler2{commits=0,autocommits=0,soft autocommits=0,optimizes=0,rollbacks=0,expungeDeletes=0,docsPending=0,adds=0,deletesById=0,deletesByQuery=0,errors=0,cumulative_adds=0,cumulative_deletesById=0,cumulative_deletesByQuery=0,cumulative_errors=0}
[junit4:junit4]   1> 7344275 [TEST-TestSolrProperties.testProperties-seed#[9AD7FA0840C60AC0]] INFO  org.apache.solr.update.SolrCoreState  ? Closing SolrCoreState
[junit4:junit4]   1> 7344276 [TEST-TestSolrProperties.testProperties-seed#[9AD7FA0840C60AC0]] INFO  org.apache.solr.update.DefaultSolrCoreState  ? SolrCoreState ref count has reached 0 - closing IndexWriter
[junit4:junit4]   1> 7344277 [TEST-TestSolrProperties.testProperties-seed#[9AD7FA0840C60AC0]] INFO  org.apache.solr.update.DefaultSolrCoreState  ? closing IndexWriter with IndexWriterCloser
[junit4:junit4]   1> 7344301 [TEST-TestSolrProperties.testProperties-seed#[9AD7FA0840C60AC0]] INFO  org.apache.solr.core.SolrCore  ? [renamed_core] Closing main searcher on request.
[junit4:junit4]   1> 7344303 [TEST-TestSolrProperties.testProperties-seed#[9AD7FA0840C60AC0]] INFO  org.apache.solr.core.CachingDirectoryFactory  ? Closing MockDirectoryFactory - 2 directories currently being tracked
[junit4:junit4]   1> 7344304 [TEST-TestSolrProperties.testProperties-seed#[9AD7FA0840C60AC0]] INFO  org.apache.solr.core.CachingDirectoryFactory  ? looking to close /Users/jenkins/jenkins-slave/workspace/Lucene-Solr-4.x-MacOSX/solr/build/solr-solrj/test/J0/./solrtest-TestSolrProperties-1370959821259/data1/index [CachedDir<<refCount=0;path=/Users/jenkins/jenkins-slave/workspace/Lucene-Solr-4.x-MacOSX/solr/build/solr-solrj/test/J0/./solrtest-TestSolrProperties-1370959821259/data1/index;done=false>>]
[junit4:junit4]   1> 7344304 [TEST-TestSolrProperties.testProperties-seed#[9AD7FA0840C60AC0]] INFO  org.apache.solr.core.CachingDirectoryFactory  ? Closing directory: /Users/jenkins/jenkins-slave/workspace/Lucene-Solr-4.x-MacOSX/solr/build/solr-solrj/test/J0/./solrtest-TestSolrProperties-1370959821259/data1/index
[junit4:junit4]   1> 7344305 [TEST-TestSolrProperties.testProperties-seed#[9AD7FA0840C60AC0]] INFO  org.apache.solr.core.CachingDirectoryFactory  ? looking to close /Users/jenkins/jenkins-slave/workspace/Lucene-Solr-4.x-MacOSX/solr/build/solr-solrj/test/J0/./solrtest-TestSolrProperties-1370959821259/data1 [CachedDir<<refCount=0;path=/Users/jenkins/jenkins-slave/workspace/Lucene-Solr-4.x-MacOSX/solr/build/solr-solrj/test/J0/./solrtest-TestSolrProperties-1370959821259/data1;done=false>>]
[junit4:junit4]   1> 7344306 [TEST-TestSolrProperties.testProperties-seed#[9AD7FA0840C60AC0]] INFO  org.apache.solr.core.CachingDirectoryFactory  ? Closing directory: /Users/jenkins/jenkins-slave/workspace/Lucene-Solr-4.x-MacOSX/solr/build/solr-solrj/test/J0/./solrtest-TestSolrProperties-1370959821259/data1
[junit4:junit4]   1> 7344307 [TEST-TestSolrProperties.testProperties-seed#[9AD7FA0840C60AC0]] INFO  org.apache.solr.core.SolrCore  ? [newCore]  CLOSING SolrCore org.apache.solr.core.SolrCore@1b0cff6b
[junit4:junit4]   1> 7344307 [TEST-TestSolrProperties.testProperties-seed#[9AD7FA0840C60AC0]] INFO  org.apache.solr.update.UpdateHandler  ? closing DirectUpdateHandler2{commits=0,autocommits=0,soft autocommits=0,optimizes=0,rollbacks=0,expungeDeletes=0,docsPending=0,adds=0,deletesById=0,deletesByQuery=0,errors=0,cumulative_adds=0,cumulative_deletesById=0,cumulative_deletesByQuery=0,cumulative_errors=0}
[junit4:junit4]   1> 7344308 [TEST-TestSolrProperties.testProperties-seed#[9AD7FA0840C60AC0]] INFO  org.apache.solr.update.SolrCoreState  ? Closing SolrCoreState
[junit4:junit4]   1> 7344309 [TEST-TestSolrProperties.testProperties-seed#[9AD7FA0840C60AC0]] INFO  org.apache.solr.update.DefaultSolrCoreState  ? SolrCoreState ref count has reached 0 - closing IndexWriter
[junit4:junit4]   1> 7344309 [TEST-TestSolrProperties.testProperties-seed#[9AD7FA0840C60AC0]] INFO  org.apache.solr.update.DefaultSolrCoreState  ? closing IndexWriter with IndexWriterCloser
[junit4:junit4]   1> 7344337 [TEST-TestSolrProperties.testProperties-seed#[9AD7FA0840C60AC0]] INFO  org.apache.solr.core.SolrCore  ? [newCore] Closing main searcher on request.
[junit4:junit4]   1> 7344351 [TEST-TestSolrProperties.testProperties-seed#[9AD7FA0840C60AC0]] INFO  org.apache.solr.core.CachingDirectoryFactory  ? Closing MockDirectoryFactory - 2 directories currently being tracked
[junit4:junit4]   1> 7344352 [TEST-TestSolrProperties.testProperties-seed#[9AD7FA0840C60AC0]] INFO  org.apache.solr.core.CachingDirectoryFactory  ? looking to close /Users/jenkins/jenkins-slave/workspace/Lucene-Solr-4.x-MacOSX/solr/build/solr-solrj/test/J0/./solrtest-TestSolrProperties-1370959821259/data3 [CachedDir<<refCount=0;path=/Users/jenkins/jenkins-slave/workspace/Lucene-Solr-4.x-MacOSX/solr/build/solr-solrj/test/J0/./solrtest-TestSolrProperties-1370959821259/data3;done=false>>]
[junit4:junit4]   1> 7344353 [TEST-TestSolrProperties.testProperties-seed#[9AD7FA0840C60AC0]] INFO  org.apache.solr.core.CachingDirectoryFactory  ? Closing directory: /Users/jenkins/jenkins-slave/workspace/Lucene-Solr-4.x-MacOSX/solr/build/solr-solrj/test/J0/./solrtest-TestSolrProperties-1370959821259/data3
[junit4:junit4]   1> 7344354 [TEST-TestSolrProperties.testProperties-seed#[9AD7FA0840C60AC0]] INFO  org.apache.solr.core.CachingDirectoryFactory  ? looking to close /Users/jenkins/jenkins-slave/workspace/Lucene-Solr-4.x-MacOSX/solr/build/solr-solrj/test/J0/./solrtest-TestSolrProperties-1370959821259/data3/index [CachedDir<<refCount=0;path=/Users/jenkins/jenkins-slave/workspace/Lucene-Solr-4.x-MacOSX/solr/build/solr-solrj/test/J0/./solrtest-TestSolrProperties-1370959821259/data3/index;done=false>>]
[junit4:junit4]   1> 7344355 [TEST-TestSolrProperties.testProperties-seed#[9AD7FA0840C60AC0]] INFO  org.apache.solr.core.CachingDirectoryFactory  ? Closing directory: /Users/jenkins/jenkins-slave/workspace/Lucene-Solr-4.x-MacOSX/solr/build/solr-solrj/test/J0/./solrtest-TestSolrProperties-1370959821259/data3/index
[junit4:junit4]   2> 7228119 T108 ccr.ThreadLeakControl.tryToInterruptAll All leaked threads terminated.
[junit4:junit4]   2> NOTE: test params are: codec=Lucene42: {id=MockVariableIntBlock(baseBlockSize=58), _version_=PostingsFormat(name=Memory doPackFST= true), core1=PostingsFormat(name=Memory doPackFST= true), core0=Lucene41(blocksize=128)}, docValues:{}, sim=RandomSimilarityProvider(queryNorm=true,coord=no): {}, locale=sq, timezone=NZ-CHAT
[junit4:junit4]   2> NOTE: Mac OS X 10.8.3 x86_64/Apple Inc. 1.6.0_45 (64-bit)/cpus=2,threads=1,free=21724776,total=80932864
[junit4:junit4]   2> NOTE: All tests run in this JVM: [TestCoreAdmin, SolrExampleBinaryTest, SolrExampleXMLTest, DocumentAnalysisResponseTest, JettyWebappTest, SolrExampleEmbeddedTest, TestSpellCheckResponse, SolrQueryTest, BasicHttpSolrServerTest, TestSolrProperties]
[junit4:junit4]   2> NOTE: reproduce with: ant test  -Dtestcase=TestSolrProperties -Dtests.seed=9AD7FA0840C60AC0 -Dtests.slow=true -Dtests.locale=sq -Dtests.timezone=NZ-CHAT -Dtests.file.encoding=US-ASCII
[junit4:junit4] ERROR   0.00s | TestSolrProperties (suite) <<<
[junit4:junit4]    > Throwable #1: java.lang.Exception: Suite timeout exceeded (>= 7200000 msec).
[junit4:junit4]    > 	at __randomizedtesting.SeedInfo.seed([9AD7FA0840C60AC0]:0)
[junit4:junit4] Completed in 7220.56s, 1 test, 2 errors <<< FAILURES!

[...truncated 118 lines...]
BUILD FAILED
/Users/jenkins/jenkins-slave/workspace/Lucene-Solr-4.x-MacOSX/build.xml:391: The following error occurred while executing this line:
/Users/jenkins/jenkins-slave/workspace/Lucene-Solr-4.x-MacOSX/build.xml:371: The following error occurred while executing this line:
/Users/jenkins/jenkins-slave/workspace/Lucene-Solr-4.x-MacOSX/build.xml:39: The following error occurred while executing this line:
/Users/jenkins/jenkins-slave/workspace/Lucene-Solr-4.x-MacOSX/solr/build.xml:194: The following error occurred while executing this line:
/Users/jenkins/jenkins-slave/workspace/Lucene-Solr-4.x-MacOSX/solr/common-build.xml:437: The following error occurred while executing this line:
/Users/jenkins/jenkins-slave/workspace/Lucene-Solr-4.x-MacOSX/lucene/common-build.xml:1243: The following error occurred while executing this line:
/Users/jenkins/jenkins-slave/workspace/Lucene-Solr-4.x-MacOSX/lucene/common-build.xml:887: There were test failures: 46 suites, 272 tests, 1 suite-level error, 1 error

Total time: 255 minutes 24 seconds
Build step 'Invoke Ant' marked build as failure
Description set: Java: 64bit/jdk1.6.0 -XX:-UseCompressedOops -XX:+UseSerialGC
Archiving artifacts
Recording test results
Email was triggered for: Failure
Sending email for trigger: Failure