You are viewing a plain text version of this content. The canonical link for it is here.
Posted to dev@jclouds.apache.org by je...@cloudbees.com on 2013/10/21 16:51:26 UTC
Build failed in Jenkins: jclouds #2382
See <https://jclouds.ci.cloudbees.com/job/jclouds/2382/changes>
Changes:
[Everett Toews] JCLOUDS-353 openstack list availability zones for NOVA
[Everett Toews] JCLOUDS-348
------------------------------------------
[...truncated 14407 lines...]
Starting test testIfETagMatchesStatic(org.jclouds.blobstore.options.GetOptionsTest)
[pool-19-thread-3] Test testIfETagMatchesStatic(org.jclouds.blobstore.options.GetOptionsTest) succeeded: 0ms
Test suite progress: tests succeeded: 48, failed: 0, skipped: 0.
Starting test testIfModifiedAfterETagDoesntMatch(org.jclouds.blobstore.options.GetOptionsTest)
[pool-19-thread-3] Test testIfModifiedAfterETagDoesntMatch(org.jclouds.blobstore.options.GetOptionsTest) succeeded: 6ms
Test suite progress: tests succeeded: 49, failed: 0, skipped: 0.
Starting test testIfModifiedAfterETagMatches(org.jclouds.blobstore.options.GetOptionsTest)
[pool-19-thread-3] Test testIfModifiedAfterETagMatches(org.jclouds.blobstore.options.GetOptionsTest) succeeded: 0ms
Test suite progress: tests succeeded: 50, failed: 0, skipped: 0.
Starting test testIfModifiedAfterUnmodified(org.jclouds.blobstore.options.GetOptionsTest)
[pool-19-thread-3] Test testIfModifiedAfterUnmodified(org.jclouds.blobstore.options.GetOptionsTest) succeeded: 1ms
Test suite progress: tests succeeded: 51, failed: 0, skipped: 0.
Starting test testIfModifiedSince(org.jclouds.blobstore.options.GetOptionsTest)
[pool-19-thread-3] Test testIfModifiedSince(org.jclouds.blobstore.options.GetOptionsTest) succeeded: 1ms
Test suite progress: tests succeeded: 52, failed: 0, skipped: 0.
Starting test testIfModifiedSinceNPE(org.jclouds.blobstore.options.GetOptionsTest)
[pool-19-thread-3] Test testIfModifiedSinceNPE(org.jclouds.blobstore.options.GetOptionsTest) succeeded: 0ms
Test suite progress: tests succeeded: 53, failed: 0, skipped: 0.
Starting test testIfModifiedSinceStatic(org.jclouds.blobstore.options.GetOptionsTest)
[pool-19-thread-3] Test testIfModifiedSinceStatic(org.jclouds.blobstore.options.GetOptionsTest) succeeded: 0ms
Test suite progress: tests succeeded: 54, failed: 0, skipped: 0.
[pool-19-thread-4] Test testIfETagMatches(org.jclouds.blobstore.options.GetOptionsTest) succeeded: 185ms
Test suite progress: tests succeeded: 55, failed: 0, skipped: 0.
Starting test testIfUnmodifiedAfterETagMatches(org.jclouds.blobstore.options.GetOptionsTest)
[pool-19-thread-4] Test testIfUnmodifiedAfterETagMatches(org.jclouds.blobstore.options.GetOptionsTest) succeeded: 0ms
Test suite progress: tests succeeded: 56, failed: 0, skipped: 0.
Starting test testIfUnmodifiedAfterModified(org.jclouds.blobstore.options.GetOptionsTest)
[pool-19-thread-4] Test testIfUnmodifiedAfterModified(org.jclouds.blobstore.options.GetOptionsTest) succeeded: 0ms
Test suite progress: tests succeeded: 57, failed: 0, skipped: 0.
Starting test testIfUnmodifiedSince(org.jclouds.blobstore.options.GetOptionsTest)
[pool-19-thread-4] Test testIfUnmodifiedSince(org.jclouds.blobstore.options.GetOptionsTest) succeeded: 0ms
Test suite progress: tests succeeded: 58, failed: 0, skipped: 0.
Starting test testIfUnmodifiedSinceNPE(org.jclouds.blobstore.options.GetOptionsTest)
[pool-19-thread-4] Test testIfUnmodifiedSinceNPE(org.jclouds.blobstore.options.GetOptionsTest) succeeded: 0ms
Test suite progress: tests succeeded: 59, failed: 0, skipped: 0.
Starting test testIfUnmodifiedSinceStatic(org.jclouds.blobstore.options.GetOptionsTest)
[pool-19-thread-4] Test testIfUnmodifiedSinceStatic(org.jclouds.blobstore.options.GetOptionsTest) succeeded: 0ms
Test suite progress: tests succeeded: 60, failed: 0, skipped: 0.
Starting test testModifiedSinceAndRange(org.jclouds.blobstore.options.GetOptionsTest)
[pool-19-thread-4] Test testModifiedSinceAndRange(org.jclouds.blobstore.options.GetOptionsTest) succeeded: 1ms
Test suite progress: tests succeeded: 61, failed: 0, skipped: 0.
Starting test testNoRange(org.jclouds.blobstore.options.GetOptionsTest)
[pool-19-thread-4] Test testNoRange(org.jclouds.blobstore.options.GetOptionsTest) succeeded: 0ms
Test suite progress: tests succeeded: 62, failed: 0, skipped: 0.
Starting test testNullIfETagDoesntMatch(org.jclouds.blobstore.options.GetOptionsTest)
[pool-19-thread-4] Test testNullIfETagDoesntMatch(org.jclouds.blobstore.options.GetOptionsTest) succeeded: 0ms
Test suite progress: tests succeeded: 63, failed: 0, skipped: 0.
Starting test testNullIfETagMatches(org.jclouds.blobstore.options.GetOptionsTest)
[pool-19-thread-4] Test testNullIfETagMatches(org.jclouds.blobstore.options.GetOptionsTest) succeeded: 0ms
Test suite progress: tests succeeded: 64, failed: 0, skipped: 0.
Starting test testNullIfModifiedSince(org.jclouds.blobstore.options.GetOptionsTest)
[pool-19-thread-4] Test testNullIfModifiedSince(org.jclouds.blobstore.options.GetOptionsTest) succeeded: 4ms
Test suite progress: tests succeeded: 65, failed: 0, skipped: 0.
Starting test testNullIfUnmodifiedSince(org.jclouds.blobstore.options.GetOptionsTest)
[pool-19-thread-4] Test testNullIfUnmodifiedSince(org.jclouds.blobstore.options.GetOptionsTest) succeeded: 0ms
Test suite progress: tests succeeded: 66, failed: 0, skipped: 0.
Starting test testRange(org.jclouds.blobstore.options.GetOptionsTest)
[pool-19-thread-4] Test testRange(org.jclouds.blobstore.options.GetOptionsTest) succeeded: 0ms
Test suite progress: tests succeeded: 67, failed: 0, skipped: 0.
Starting test testIfUnmodifiedAfterETagDoesntMatch(org.jclouds.blobstore.options.GetOptionsTest)
[pool-19-thread-3] Test testIfUnmodifiedAfterETagDoesntMatch(org.jclouds.blobstore.options.GetOptionsTest) succeeded: 0ms
Test suite progress: tests succeeded: 68, failed: 0, skipped: 0.
Starting test testRangeNegative1(org.jclouds.blobstore.options.GetOptionsTest)
[pool-19-thread-3] Test testRangeNegative1(org.jclouds.blobstore.options.GetOptionsTest) succeeded: 0ms
Test suite progress: tests succeeded: 69, failed: 0, skipped: 0.
Starting test testRangeNegative2(org.jclouds.blobstore.options.GetOptionsTest)
[pool-19-thread-3] Test testRangeNegative2(org.jclouds.blobstore.options.GetOptionsTest) succeeded: 1ms
Test suite progress: tests succeeded: 70, failed: 0, skipped: 0.
Starting test testRangeNegative(org.jclouds.blobstore.options.GetOptionsTest)
Starting test testRangeStartAt(org.jclouds.blobstore.options.GetOptionsTest)
[pool-19-thread-4] Test testRangeNegative(org.jclouds.blobstore.options.GetOptionsTest) succeeded: 2ms
Test suite progress: tests succeeded: 71, failed: 0, skipped: 0.
Starting test testRangeStatic(org.jclouds.blobstore.options.GetOptionsTest)
[pool-19-thread-4] Test testRangeStatic(org.jclouds.blobstore.options.GetOptionsTest) succeeded: 0ms
Test suite progress: tests succeeded: 72, failed: 0, skipped: 0.
Starting test testRangeTail(org.jclouds.blobstore.options.GetOptionsTest)
[pool-19-thread-4] Test testRangeTail(org.jclouds.blobstore.options.GetOptionsTest) succeeded: 0ms
Test suite progress: tests succeeded: 73, failed: 0, skipped: 0.
Starting test testRangeZeroToFive(org.jclouds.blobstore.options.GetOptionsTest)
[pool-19-thread-3] Test testRangeStartAt(org.jclouds.blobstore.options.GetOptionsTest) succeeded: 26ms
Test suite progress: tests succeeded: 74, failed: 0, skipped: 0.
Starting test testRangeZeroToFiveAnd10through100(org.jclouds.blobstore.options.GetOptionsTest)
[pool-19-thread-3] Test testRangeZeroToFiveAnd10through100(org.jclouds.blobstore.options.GetOptionsTest) succeeded: 1ms
Test suite progress: tests succeeded: 75, failed: 0, skipped: 0.
Starting test testMarker(org.jclouds.blobstore.options.ListOptionsTest)
[pool-19-thread-3] Test testMarker(org.jclouds.blobstore.options.ListOptionsTest) succeeded: 0ms
Test suite progress: tests succeeded: 76, failed: 0, skipped: 0.
Starting test testMarkerNPE(org.jclouds.blobstore.options.ListOptionsTest)
[pool-19-thread-4] Test testRangeZeroToFive(org.jclouds.blobstore.options.GetOptionsTest) succeeded: 1ms
Test suite progress: tests succeeded: 77, failed: 0, skipped: 0.
Starting test testMarkerStatic(org.jclouds.blobstore.options.ListOptionsTest)
[pool-19-thread-4] Test testMarkerStatic(org.jclouds.blobstore.options.ListOptionsTest) succeeded: 0ms
Test suite progress: tests succeeded: 78, failed: 0, skipped: 0.
Starting test testMaxResults(org.jclouds.blobstore.options.ListOptionsTest)
[pool-19-thread-4] Test testMaxResults(org.jclouds.blobstore.options.ListOptionsTest) succeeded: 0ms
Test suite progress: tests succeeded: 79, failed: 0, skipped: 0.
Starting test testMaxResultsNegative(org.jclouds.blobstore.options.ListOptionsTest)
[pool-19-thread-3] Test testMarkerNPE(org.jclouds.blobstore.options.ListOptionsTest) succeeded: 0ms
Test suite progress: tests succeeded: 80, failed: 0, skipped: 0.
Starting test testMaxResultsStatic(org.jclouds.blobstore.options.ListOptionsTest)
[pool-19-thread-3] Test testMaxResultsStatic(org.jclouds.blobstore.options.ListOptionsTest) succeeded: 0ms
Test suite progress: tests succeeded: 81, failed: 0, skipped: 0.
Starting test testNullMarker(org.jclouds.blobstore.options.ListOptionsTest)
[pool-19-thread-3] Test testNullMarker(org.jclouds.blobstore.options.ListOptionsTest) succeeded: 0ms
Test suite progress: tests succeeded: 82, failed: 0, skipped: 0.
Starting test testNullMaxResults(org.jclouds.blobstore.options.ListOptionsTest)
[pool-19-thread-4] Test testMaxResultsNegative(org.jclouds.blobstore.options.ListOptionsTest) succeeded: 1ms
Test suite progress: tests succeeded: 83, failed: 0, skipped: 0.
Starting test testNullPath(org.jclouds.blobstore.options.ListOptionsTest)
[pool-19-thread-4] Test testNullPath(org.jclouds.blobstore.options.ListOptionsTest) succeeded: 0ms
Test suite progress: tests succeeded: 84, failed: 0, skipped: 0.
Starting test testPath(org.jclouds.blobstore.options.ListOptionsTest)
[pool-19-thread-4] Test testPath(org.jclouds.blobstore.options.ListOptionsTest) succeeded: 0ms
Test suite progress: tests succeeded: 85, failed: 0, skipped: 0.
Starting test testPathNPE(org.jclouds.blobstore.options.ListOptionsTest)
[pool-19-thread-3] Test testNullMaxResults(org.jclouds.blobstore.options.ListOptionsTest) succeeded: 4ms
Test suite progress: tests succeeded: 86, failed: 0, skipped: 0.
Starting test testPathStatic(org.jclouds.blobstore.options.ListOptionsTest)
[pool-19-thread-3] Test testPathStatic(org.jclouds.blobstore.options.ListOptionsTest) succeeded: 0ms
Test suite progress: tests succeeded: 87, failed: 0, skipped: 0.
Starting test testRecursive(org.jclouds.blobstore.options.ListOptionsTest)
[pool-19-thread-3] Test testRecursive(org.jclouds.blobstore.options.ListOptionsTest) succeeded: 0ms
Test suite progress: tests succeeded: 88, failed: 0, skipped: 0.
Starting test testRecursiveStatic(org.jclouds.blobstore.options.ListOptionsTest)
[pool-19-thread-4] Test testPathNPE(org.jclouds.blobstore.options.ListOptionsTest) succeeded: 0ms
Test suite progress: tests succeeded: 89, failed: 0, skipped: 0.
Starting test testTwoOptions(org.jclouds.blobstore.options.ListOptionsTest)
[pool-19-thread-4] Test testTwoOptions(org.jclouds.blobstore.options.ListOptionsTest) succeeded: 0ms
Test suite progress: tests succeeded: 90, failed: 0, skipped: 0.
Starting test testAlreadyHasMD5(org.jclouds.blobstore.functions.ObjectMD5Test)
[pool-19-thread-4] Test testAlreadyHasMD5(org.jclouds.blobstore.functions.ObjectMD5Test) succeeded: 0ms
Test suite progress: tests succeeded: 91, failed: 0, skipped: 0.
Starting test testMD5PayloadEnclosing(org.jclouds.blobstore.functions.ObjectMD5Test)
[pool-19-thread-3] Test testRecursiveStatic(org.jclouds.blobstore.options.ListOptionsTest) succeeded: 4ms
Test suite progress: tests succeeded: 92, failed: 0, skipped: 0.
Starting test testMD5String(org.jclouds.blobstore.functions.ObjectMD5Test)
[pool-19-thread-3] Test testMD5String(org.jclouds.blobstore.functions.ObjectMD5Test) succeeded: 1ms
Test suite progress: tests succeeded: 93, failed: 0, skipped: 0.
Starting test testNullIsBad(org.jclouds.blobstore.functions.ObjectMD5Test)
[pool-19-thread-3] Test testNullIsBad(org.jclouds.blobstore.functions.ObjectMD5Test) succeeded: 0ms
Test suite progress: tests succeeded: 94, failed: 0, skipped: 0.
Starting test testCall(org.jclouds.blobstore.functions.ParseBlobFromHeadersAndHttpContentTest)
[pool-19-thread-4] Test testMD5PayloadEnclosing(org.jclouds.blobstore.functions.ObjectMD5Test) succeeded: 1ms
Test suite progress: tests succeeded: 95, failed: 0, skipped: 0.
Starting test testParseContentLengthWhenContentRangeSet(org.jclouds.blobstore.functions.ParseBlobFromHeadersAndHttpContentTest)
[pool-19-thread-3] Test testCall(org.jclouds.blobstore.functions.ParseBlobFromHeadersAndHttpContentTest) succeeded: 1004ms
Test suite progress: tests succeeded: 96, failed: 0, skipped: 0.
Starting test testAddETagTo(org.jclouds.blobstore.functions.ParseSystemAndUserMetadataFromHeadersTest)
[pool-19-thread-3] Test testAddETagTo(org.jclouds.blobstore.functions.ParseSystemAndUserMetadataFromHeadersTest) succeeded: 1ms
Test suite progress: tests succeeded: 97, failed: 0, skipped: 0.
Starting test testAddUserMetadataTo(org.jclouds.blobstore.functions.ParseSystemAndUserMetadataFromHeadersTest)
[pool-19-thread-3] Test testAddUserMetadataTo(org.jclouds.blobstore.functions.ParseSystemAndUserMetadataFromHeadersTest) succeeded: 1ms
Test suite progress: tests succeeded: 98, failed: 0, skipped: 0.
Starting test testApplySetsName(org.jclouds.blobstore.functions.ParseSystemAndUserMetadataFromHeadersTest)
[pool-19-thread-3] Test testApplySetsName(org.jclouds.blobstore.functions.ParseSystemAndUserMetadataFromHeadersTest) succeeded: 1ms
Test suite progress: tests succeeded: 99, failed: 0, skipped: 0.
Starting test testNoContentOn204IsOk(org.jclouds.blobstore.functions.ParseSystemAndUserMetadataFromHeadersTest)
[pool-19-thread-4] Test testParseContentLengthWhenContentRangeSet(org.jclouds.blobstore.functions.ParseBlobFromHeadersAndHttpContentTest) succeeded: 1138ms
Test suite progress: tests succeeded: 100, failed: 0, skipped: 0.
Starting test testCorrect(org.jclouds.blobstore.functions.PrefixToResourceMetadataTest)
[pool-19-thread-4] Test testCorrect(org.jclouds.blobstore.functions.PrefixToResourceMetadataTest) succeeded: 0ms
Test suite progress: tests succeeded: 101, failed: 0, skipped: 0.
Starting test testNullIsBad(org.jclouds.blobstore.functions.PrefixToResourceMetadataTest)
[pool-19-thread-4] Test testNullIsBad(org.jclouds.blobstore.functions.PrefixToResourceMetadataTest) succeeded: 0ms
Test suite progress: tests succeeded: 102, failed: 0, skipped: 0.
Starting test test1(org.jclouds.blobstore.functions.ResourceMetadataToRelativePathResourceMetadataTest)
[pool-19-thread-3] Test testNoContentOn204IsOk(org.jclouds.blobstore.functions.ParseSystemAndUserMetadataFromHeadersTest) succeeded: 12ms
Test suite progress: tests succeeded: 103, failed: 0, skipped: 0.
Starting test testSetLastModified(org.jclouds.blobstore.functions.ParseSystemAndUserMetadataFromHeadersTest)
[pool-19-thread-3] Test testSetLastModified(org.jclouds.blobstore.functions.ParseSystemAndUserMetadataFromHeadersTest) succeeded: 27ms
Test suite progress: tests succeeded: 104, failed: 0, skipped: 0.
Starting test testSetLastModifiedException(org.jclouds.blobstore.functions.ParseSystemAndUserMetadataFromHeadersTest)
[pool-19-thread-3] Test testSetLastModifiedException(org.jclouds.blobstore.functions.ParseSystemAndUserMetadataFromHeadersTest) succeeded: 1ms
Test suite progress: tests succeeded: 105, failed: 0, skipped: 0.
Starting test testSetLastModifiedIso8601(org.jclouds.blobstore.functions.ParseSystemAndUserMetadataFromHeadersTest)
[pool-19-thread-4] Test test1(org.jclouds.blobstore.functions.ResourceMetadataToRelativePathResourceMetadataTest) succeeded: 41ms
Test suite progress: tests succeeded: 106, failed: 0, skipped: 0.
Starting test test2(org.jclouds.blobstore.functions.ResourceMetadataToRelativePathResourceMetadataTest)
[pool-19-thread-4] Test test2(org.jclouds.blobstore.functions.ResourceMetadataToRelativePathResourceMetadataTest) succeeded: 1ms
Test suite progress: tests succeeded: 107, failed: 0, skipped: 0.
Starting test testNoNameChange(org.jclouds.blobstore.functions.ResourceMetadataToRelativePathResourceMetadataTest)
[pool-19-thread-4] Test testNoNameChange(org.jclouds.blobstore.functions.ResourceMetadataToRelativePathResourceMetadataTest) succeeded: 0ms
Test suite progress: tests succeeded: 108, failed: 0, skipped: 0.
[pool-19-thread-3] Test testSetLastModifiedIso8601(org.jclouds.blobstore.functions.ParseSystemAndUserMetadataFromHeadersTest) succeeded: 39ms
Test suite progress: tests succeeded: 109, failed: 0, skipped: 0.
[pool-19-thread-5] Test testCorrect(org.jclouds.blobstore.binders.BindUserMetadataToHeadersWithPrefixTest) succeeded: 2673ms
Test suite progress: tests succeeded: 110, failed: 0, skipped: 0.
[pool-19-thread-2] Test testStrategies(org.jclouds.blobstore.strategy.internal.BiggerThanPageSizeTest) succeeded: 9174ms
Test suite progress: tests succeeded: 111, failed: 0, skipped: 0.
[pool-19-thread-1] Test test(org.jclouds.blobstore.strategy.internal.BiggerThanPageSizeTest) succeeded: 9782ms
Test suite progress: tests succeeded: 112, failed: 0, skipped: 0.
Starting test testMustBeBlob(org.jclouds.blobstore.binders.BindBlobToMultipartFormTest)
[pool-22-thread-1] Test testMustBeBlob(org.jclouds.blobstore.binders.BindBlobToMultipartFormTest) succeeded: 1ms
Starting test testNullIsBad(org.jclouds.blobstore.binders.BindBlobToMultipartFormTest)
Test suite progress: tests succeeded: 113, failed: 0, skipped: 0.
[pool-22-thread-2] Test testNullIsBad(org.jclouds.blobstore.binders.BindBlobToMultipartFormTest) succeeded: 2ms
Test suite progress: tests succeeded: 114, failed: 0, skipped: 0.
Starting test testSinglePart(org.jclouds.blobstore.binders.BindBlobToMultipartFormTest)
[pool-22-thread-3] Test testSinglePart(org.jclouds.blobstore.binders.BindBlobToMultipartFormTest) succeeded: 85ms
Test suite progress: tests succeeded: 115, failed: 0, skipped: 0.
Starting test testExecuteInDirectory(org.jclouds.blobstore.strategy.internal.DeleteAllKeysInListTest)
[pool-23-thread-1] Test testExecuteInDirectory(org.jclouds.blobstore.strategy.internal.DeleteAllKeysInListTest) succeeded: 3122ms
Test suite progress: tests succeeded: 116, failed: 0, skipped: 0.
ERROR: Failed to parse POMs
hudson.remoting.ChannelClosedException: channel is already closed
at hudson.remoting.Channel.send(Channel.java:520)
at hudson.remoting.Request.call(Request.java:129)
at hudson.remoting.Channel.call(Channel.java:718)
at hudson.remoting.RemoteInvocationHandler.invoke(RemoteInvocationHandler.java:162)
at $Proxy47.isAlive(Unknown Source)
at hudson.Launcher$RemoteLauncher$ProcImpl.isAlive(Launcher.java:930)
at hudson.maven.ProcessCache$MavenProcess.call(ProcessCache.java:161)
at hudson.maven.MavenModuleSetBuild$MavenModuleSetBuildExecution.doRun(MavenModuleSetBuild.java:765)
at hudson.model.AbstractBuild$AbstractBuildExecution.run(AbstractBuild.java:594)
at hudson.model.Run.execute(Run.java:1575)
at hudson.maven.MavenModuleSetBuild.run(MavenModuleSetBuild.java:485)
at hudson.model.ResourceController.execute(ResourceController.java:88)
at hudson.model.Executor.run(Executor.java:237)
Caused by: java.io.IOException: Unexpected termination of the channel
at hudson.remoting.SynchronousCommandTransport$ReaderThread.run(SynchronousCommandTransport.java:50)
Caused by: java.io.EOFException
at java.io.ObjectInputStream$BlockDataInputStream.peekByte(Unknown Source)
at java.io.ObjectInputStream.readObject0(Unknown Source)
at java.io.ObjectInputStream.readObject(Unknown Source)
at hudson.remoting.Command.readFrom(Command.java:92)
at hudson.remoting.ClassicCommandTransport.read(ClassicCommandTransport.java:72)
at hudson.remoting.SynchronousCommandTransport$ReaderThread.run(SynchronousCommandTransport.java:48)
Looks like the node went offline during the build. Check the slave log for the details.
FATAL: channel is already closed
hudson.remoting.ChannelClosedException: channel is already closed
at hudson.remoting.Channel.send(Channel.java:520)
at hudson.remoting.Request.call(Request.java:129)
at hudson.remoting.Channel.call(Channel.java:718)
at hudson.Launcher$RemoteLauncher.kill(Launcher.java:887)
at hudson.Launcher$2.kill(Launcher.java:745)
at hudson.model.AbstractBuild$AbstractBuildExecution.run(AbstractBuild.java:617)
at hudson.model.Run.execute(Run.java:1575)
at hudson.maven.MavenModuleSetBuild.run(MavenModuleSetBuild.java:485)
at hudson.model.ResourceController.execute(ResourceController.java:88)
at hudson.model.Executor.run(Executor.java:237)
Caused by: java.io.IOException: Unexpected termination of the channel
at hudson.remoting.SynchronousCommandTransport$ReaderThread.run(SynchronousCommandTransport.java:50)
Caused by: java.io.EOFException
at java.io.ObjectInputStream$BlockDataInputStream.peekByte(Unknown Source)
at java.io.ObjectInputStream.readObject0(Unknown Source)
at java.io.ObjectInputStream.readObject(Unknown Source)
at hudson.remoting.Command.readFrom(Command.java:92)
at hudson.remoting.ClassicCommandTransport.read(ClassicCommandTransport.java:72)
at hudson.remoting.SynchronousCommandTransport$ReaderThread.run(SynchronousCommandTransport.java:48)
Build failed in Jenkins: jclouds #2383
Posted by je...@cloudbees.com.
See <https://jclouds.ci.cloudbees.com/job/jclouds/2383/changes>
Changes:
[Everett Toews] JCLOUDS-350 rebuild server for Openstack NOVA added more options: password, name, ipv6 and ipv4 addresses.
------------------------------------------
[...truncated 8728 lines...]
Starting test testTemplateBuilderCanFind(org.jclouds.compute.StubTemplateBuilderIntegrationTest)
[TestNG] Test testTemplateBuilderCanFind(org.jclouds.compute.StubTemplateBuilderIntegrationTest) succeeded: 2ms
Test suite progress: tests succeeded: 59, failed: 0, skipped: 0.
Starting test testTemplateBuilderCanFind(org.jclouds.compute.StubTemplateBuilderIntegrationTest)
[TestNG] Test testTemplateBuilderCanFind(org.jclouds.compute.StubTemplateBuilderIntegrationTest) succeeded: 2ms
Test suite progress: tests succeeded: 60, failed: 0, skipped: 0.
Starting test testTemplateBuilderCanFind(org.jclouds.compute.StubTemplateBuilderIntegrationTest)
[TestNG] Test testTemplateBuilderCanFind(org.jclouds.compute.StubTemplateBuilderIntegrationTest) succeeded: 2ms
Test suite progress: tests succeeded: 61, failed: 0, skipped: 0.
Starting test testTemplateBuilderCanFind(org.jclouds.compute.StubTemplateBuilderIntegrationTest)
[TestNG] Test testTemplateBuilderCanFind(org.jclouds.compute.StubTemplateBuilderIntegrationTest) succeeded: 2ms
Test suite progress: tests succeeded: 62, failed: 0, skipped: 0.
Starting test testTemplateBuilderCanFind(org.jclouds.compute.StubTemplateBuilderIntegrationTest)
[TestNG] Test testTemplateBuilderCanFind(org.jclouds.compute.StubTemplateBuilderIntegrationTest) succeeded: 2ms
Test suite progress: tests succeeded: 63, failed: 0, skipped: 0.
Starting test testTemplateBuilderCanFind(org.jclouds.compute.StubTemplateBuilderIntegrationTest)
[TestNG] Test testTemplateBuilderCanFind(org.jclouds.compute.StubTemplateBuilderIntegrationTest) succeeded: 2ms
Test suite progress: tests succeeded: 64, failed: 0, skipped: 0.
Starting test testTemplateBuilderCanFind(org.jclouds.compute.StubTemplateBuilderIntegrationTest)
[TestNG] Test testTemplateBuilderCanFind(org.jclouds.compute.StubTemplateBuilderIntegrationTest) succeeded: 2ms
Test suite progress: tests succeeded: 65, failed: 0, skipped: 0.
Starting test testTemplateBuilderCanFind(org.jclouds.compute.StubTemplateBuilderIntegrationTest)
[TestNG] Test testTemplateBuilderCanFind(org.jclouds.compute.StubTemplateBuilderIntegrationTest) succeeded: 2ms
Test suite progress: tests succeeded: 66, failed: 0, skipped: 0.
Starting test testTemplateBuilderCanFind(org.jclouds.compute.StubTemplateBuilderIntegrationTest)
[TestNG] Test testTemplateBuilderCanFind(org.jclouds.compute.StubTemplateBuilderIntegrationTest) succeeded: 3ms
Test suite progress: tests succeeded: 67, failed: 0, skipped: 0.
Starting test testTemplateBuilderCanFind(org.jclouds.compute.StubTemplateBuilderIntegrationTest)
[TestNG] Test testTemplateBuilderCanFind(org.jclouds.compute.StubTemplateBuilderIntegrationTest) succeeded: 1ms
Test suite progress: tests succeeded: 68, failed: 0, skipped: 0.
Starting test testTemplateBuilderCanFind(org.jclouds.compute.StubTemplateBuilderIntegrationTest)
[TestNG] Test testTemplateBuilderCanFind(org.jclouds.compute.StubTemplateBuilderIntegrationTest) succeeded: 4ms
Test suite progress: tests succeeded: 69, failed: 0, skipped: 0.
Starting test testTemplateBuilderCanFind(org.jclouds.compute.StubTemplateBuilderIntegrationTest)
[TestNG] Test testTemplateBuilderCanFind(org.jclouds.compute.StubTemplateBuilderIntegrationTest) succeeded: 3ms
Test suite progress: tests succeeded: 70, failed: 0, skipped: 0.
Starting test testTemplateBuilderCanFind(org.jclouds.compute.StubTemplateBuilderIntegrationTest)
[TestNG] Test testTemplateBuilderCanFind(org.jclouds.compute.StubTemplateBuilderIntegrationTest) succeeded: 2ms
Test suite progress: tests succeeded: 71, failed: 0, skipped: 0.
Starting test testTemplateBuilderCanFind(org.jclouds.compute.StubTemplateBuilderIntegrationTest)
[TestNG] Test testTemplateBuilderCanFind(org.jclouds.compute.StubTemplateBuilderIntegrationTest) succeeded: 3ms
Test suite progress: tests succeeded: 72, failed: 0, skipped: 0.
Starting test testTemplateBuilderCanFind(org.jclouds.compute.StubTemplateBuilderIntegrationTest)
[TestNG] Test testTemplateBuilderCanFind(org.jclouds.compute.StubTemplateBuilderIntegrationTest) succeeded: 5ms
Test suite progress: tests succeeded: 73, failed: 0, skipped: 0.
Starting test testTemplateBuilderCanFind(org.jclouds.compute.StubTemplateBuilderIntegrationTest)
[TestNG] Test testTemplateBuilderCanFind(org.jclouds.compute.StubTemplateBuilderIntegrationTest) succeeded: 3ms
Test suite progress: tests succeeded: 74, failed: 0, skipped: 0.
Starting test testTemplateBuilderCanFind(org.jclouds.compute.StubTemplateBuilderIntegrationTest)
[TestNG] Test testTemplateBuilderCanFind(org.jclouds.compute.StubTemplateBuilderIntegrationTest) succeeded: 4ms
Test suite progress: tests succeeded: 75, failed: 0, skipped: 0.
Starting test testTemplateBuilderCanFind(org.jclouds.compute.StubTemplateBuilderIntegrationTest)
[TestNG] Test testTemplateBuilderCanFind(org.jclouds.compute.StubTemplateBuilderIntegrationTest) succeeded: 4ms
Test suite progress: tests succeeded: 76, failed: 0, skipped: 0.
Starting test testTemplateBuilderCanFind(org.jclouds.compute.StubTemplateBuilderIntegrationTest)
[TestNG] Test testTemplateBuilderCanFind(org.jclouds.compute.StubTemplateBuilderIntegrationTest) succeeded: 1ms
Test suite progress: tests succeeded: 77, failed: 0, skipped: 0.
Starting test testTemplateBuilderCanFind(org.jclouds.compute.StubTemplateBuilderIntegrationTest)
[TestNG] Test testTemplateBuilderCanFind(org.jclouds.compute.StubTemplateBuilderIntegrationTest) succeeded: 3ms
Test suite progress: tests succeeded: 78, failed: 0, skipped: 0.
Starting test testTemplateBuilderCanFind(org.jclouds.compute.StubTemplateBuilderIntegrationTest)
[TestNG] Test testTemplateBuilderCanFind(org.jclouds.compute.StubTemplateBuilderIntegrationTest) succeeded: 3ms
Test suite progress: tests succeeded: 79, failed: 0, skipped: 0.
Starting test testTemplateBuilderCanFind(org.jclouds.compute.StubTemplateBuilderIntegrationTest)
[TestNG] Test testTemplateBuilderCanFind(org.jclouds.compute.StubTemplateBuilderIntegrationTest) succeeded: 2ms
Test suite progress: tests succeeded: 80, failed: 0, skipped: 0.
Starting test testTemplateBuilderCanFind(org.jclouds.compute.StubTemplateBuilderIntegrationTest)
[TestNG] Test testTemplateBuilderCanFind(org.jclouds.compute.StubTemplateBuilderIntegrationTest) succeeded: 3ms
Test suite progress: tests succeeded: 81, failed: 0, skipped: 0.
Starting test testTemplateBuilderCanFind(org.jclouds.compute.StubTemplateBuilderIntegrationTest)
[TestNG] Test testTemplateBuilderCanFind(org.jclouds.compute.StubTemplateBuilderIntegrationTest) succeeded: 0ms
Test suite progress: tests succeeded: 82, failed: 0, skipped: 0.
Starting test testTemplateBuilderCanFind(org.jclouds.compute.StubTemplateBuilderIntegrationTest)
[TestNG] Test testTemplateBuilderCanFind(org.jclouds.compute.StubTemplateBuilderIntegrationTest) succeeded: 2ms
Test suite progress: tests succeeded: 83, failed: 0, skipped: 0.
Starting test testTemplateBuilderCanFind(org.jclouds.compute.StubTemplateBuilderIntegrationTest)
[TestNG] Test testTemplateBuilderCanFind(org.jclouds.compute.StubTemplateBuilderIntegrationTest) succeeded: 1ms
Test suite progress: tests succeeded: 84, failed: 0, skipped: 0.
Starting test testTemplateBuilderCanFind(org.jclouds.compute.StubTemplateBuilderIntegrationTest)
[TestNG] Test testTemplateBuilderCanFind(org.jclouds.compute.StubTemplateBuilderIntegrationTest) succeeded: 1ms
Test suite progress: tests succeeded: 85, failed: 0, skipped: 0.
Starting test testTemplateBuilderCanFind(org.jclouds.compute.StubTemplateBuilderIntegrationTest)
[TestNG] Test testTemplateBuilderCanFind(org.jclouds.compute.StubTemplateBuilderIntegrationTest) succeeded: 4ms
Test suite progress: tests succeeded: 86, failed: 0, skipped: 0.
Starting test testTemplateBuilderCanFind(org.jclouds.compute.StubTemplateBuilderIntegrationTest)
[TestNG] Test testTemplateBuilderCanFind(org.jclouds.compute.StubTemplateBuilderIntegrationTest) succeeded: 5ms
Test suite progress: tests succeeded: 87, failed: 0, skipped: 0.
Starting test testTemplateBuilderCanFind(org.jclouds.compute.StubTemplateBuilderIntegrationTest)
[TestNG] Test testTemplateBuilderCanFind(org.jclouds.compute.StubTemplateBuilderIntegrationTest) succeeded: 4ms
Test suite progress: tests succeeded: 88, failed: 0, skipped: 0.
Starting test testTemplateBuilderCanFind(org.jclouds.compute.StubTemplateBuilderIntegrationTest)
[TestNG] Test testTemplateBuilderCanFind(org.jclouds.compute.StubTemplateBuilderIntegrationTest) succeeded: 2ms
Test suite progress: tests succeeded: 89, failed: 0, skipped: 0.
Starting test testTemplateBuilderCanFind(org.jclouds.compute.StubTemplateBuilderIntegrationTest)
[TestNG] Test testTemplateBuilderCanFind(org.jclouds.compute.StubTemplateBuilderIntegrationTest) succeeded: 3ms
Test suite progress: tests succeeded: 90, failed: 0, skipped: 0.
Starting test testTemplateBuilderCanFind(org.jclouds.compute.StubTemplateBuilderIntegrationTest)
[TestNG] Test testTemplateBuilderCanFind(org.jclouds.compute.StubTemplateBuilderIntegrationTest) succeeded: 0ms
Test suite progress: tests succeeded: 91, failed: 0, skipped: 0.
Starting test testTemplateBuilderCanFind(org.jclouds.compute.StubTemplateBuilderIntegrationTest)
[TestNG] Test testTemplateBuilderCanFind(org.jclouds.compute.StubTemplateBuilderIntegrationTest) succeeded: 3ms
Test suite progress: tests succeeded: 92, failed: 0, skipped: 0.
Starting test testTemplateBuilderCanFind(org.jclouds.compute.StubTemplateBuilderIntegrationTest)
[TestNG] Test testTemplateBuilderCanFind(org.jclouds.compute.StubTemplateBuilderIntegrationTest) succeeded: 2ms
Test suite progress: tests succeeded: 93, failed: 0, skipped: 0.
Starting test testTemplateBuilderCanFind(org.jclouds.compute.StubTemplateBuilderIntegrationTest)
[TestNG] Test testTemplateBuilderCanFind(org.jclouds.compute.StubTemplateBuilderIntegrationTest) succeeded: 1ms
Test suite progress: tests succeeded: 94, failed: 0, skipped: 0.
Starting test testTemplateBuilderCanFind(org.jclouds.compute.StubTemplateBuilderIntegrationTest)
[TestNG] Test testTemplateBuilderCanFind(org.jclouds.compute.StubTemplateBuilderIntegrationTest) succeeded: 1ms
Test suite progress: tests succeeded: 95, failed: 0, skipped: 0.
Starting test testTemplateBuilderCanFind(org.jclouds.compute.StubTemplateBuilderIntegrationTest)
[TestNG] Test testTemplateBuilderCanFind(org.jclouds.compute.StubTemplateBuilderIntegrationTest) succeeded: 1ms
Test suite progress: tests succeeded: 96, failed: 0, skipped: 0.
Starting test testTemplateBuilderCanFind(org.jclouds.compute.StubTemplateBuilderIntegrationTest)
Oct 22, 2013 7:23:13 PM org.jclouds.compute.internal.BaseComputeServiceLiveTest createAndRunAServiceInGroup
INFO: << available node(1) os({family=ubuntu, name=stub ubuntu true, version=12.04, description=stub ubuntu true, is64Bit=true}) in 0s
[TestNG] Test testTemplateBuilderCanFind(org.jclouds.compute.StubTemplateBuilderIntegrationTest) succeeded: 1ms
Test suite progress: tests succeeded: 97, failed: 0, skipped: 0.
Starting test testTemplateBuilderCanFind(org.jclouds.compute.StubTemplateBuilderIntegrationTest)
[TestNG] Test testTemplateBuilderCanFind(org.jclouds.compute.StubTemplateBuilderIntegrationTest) succeeded: 1ms
Test suite progress: tests succeeded: 98, failed: 0, skipped: 0.
Starting test testTemplateBuilderCanFind(org.jclouds.compute.StubTemplateBuilderIntegrationTest)
[TestNG] Test testTemplateBuilderCanFind(org.jclouds.compute.StubTemplateBuilderIntegrationTest) succeeded: 1ms
Test suite progress: tests succeeded: 99, failed: 0, skipped: 0.
Starting test testTemplateBuilderCanFind(org.jclouds.compute.StubTemplateBuilderIntegrationTest)
[TestNG] Test testTemplateBuilderCanFind(org.jclouds.compute.StubTemplateBuilderIntegrationTest) succeeded: 1ms
Test suite progress: tests succeeded: 100, failed: 0, skipped: 0.
Starting test testTemplateBuilderCanFind(org.jclouds.compute.StubTemplateBuilderIntegrationTest)
[TestNG] Test testTemplateBuilderCanFind(org.jclouds.compute.StubTemplateBuilderIntegrationTest) succeeded: 1ms
Test suite progress: tests succeeded: 101, failed: 0, skipped: 0.
Starting test testTemplateBuilderCanFind(org.jclouds.compute.StubTemplateBuilderIntegrationTest)
[TestNG] Test testTemplateBuilderCanFind(org.jclouds.compute.StubTemplateBuilderIntegrationTest) succeeded: 1ms
Test suite progress: tests succeeded: 102, failed: 0, skipped: 0.
Starting test testTemplateBuilderCanFind(org.jclouds.compute.StubTemplateBuilderIntegrationTest)
[TestNG] Test testTemplateBuilderCanFind(org.jclouds.compute.StubTemplateBuilderIntegrationTest) succeeded: 1ms
Test suite progress: tests succeeded: 103, failed: 0, skipped: 0.
Starting test testTemplateBuilderCanUseImageId(org.jclouds.compute.StubTemplateBuilderIntegrationTest)
[TestNG] Test testTemplateBuilderCanUseImageId(org.jclouds.compute.StubTemplateBuilderIntegrationTest) succeeded: 223ms
Test suite progress: tests succeeded: 104, failed: 0, skipped: 0.
Starting test testTemplateBuilderWithImageIdSpecified(org.jclouds.compute.StubTemplateBuilderIntegrationTest)
Oct 22, 2013 7:23:13 PM org.jclouds.compute.internal.BaseComputeServiceLiveTest createAndRunAServiceInGroup
INFO: << configured node(1) with and jetty in 0s
Oct 22, 2013 7:23:13 PM org.jclouds.compute.internal.BaseComputeServiceLiveTest trackAvailabilityOfProcessOnNode
INFO: << start jetty on node(1)[144.175.1.1:8080] [backgroundProcessMilliseconds=1, socketOpenMilliseconds=0]
Oct 22, 2013 7:23:13 PM org.jclouds.compute.internal.BaseComputeServiceLiveTest trackAvailabilityOfProcessOnNode
INFO: << start jetty on node(1)[144.175.1.1:8080] [backgroundProcessMilliseconds=0, socketOpenMilliseconds=0]
[TestNG] Test testTemplateBuilderWithImageIdSpecified(org.jclouds.compute.StubTemplateBuilderIntegrationTest) succeeded: 384ms
Test suite progress: tests succeeded: 105, failed: 0, skipped: 0.
Starting test testTemplateBuilderWithLoginUserSpecified(org.jclouds.compute.StubTemplateBuilderIntegrationTest)
[TestNG] Test testCreateAndRunAService(org.jclouds.compute.StubComputeServiceIntegrationTest) succeeded: 1005ms
Test suite progress: tests succeeded: 106, failed: 0, skipped: 0.
Starting test testAScriptExecutionAfterBootWithBasicTemplate(org.jclouds.compute.StubComputeServiceIntegrationTest)
[TestNG] Test testTemplateBuilderWithLoginUserSpecified(org.jclouds.compute.StubTemplateBuilderIntegrationTest) succeeded: 342ms
Test suite progress: tests succeeded: 107, failed: 0, skipped: 0.
[TestNG] Test testAScriptExecutionAfterBootWithBasicTemplate(org.jclouds.compute.StubComputeServiceIntegrationTest) succeeded: 1395ms
Test suite progress: tests succeeded: 108, failed: 0, skipped: 0.
Starting test testTemplateMatch(org.jclouds.compute.StubComputeServiceIntegrationTest)
[TestNG] Test testTemplateMatch(org.jclouds.compute.StubComputeServiceIntegrationTest) succeeded: 2ms
Test suite progress: tests succeeded: 109, failed: 0, skipped: 0.
Starting test testConcurrentUseOfComputeServiceToCreateNodes(org.jclouds.compute.StubComputeServiceIntegrationTest)
Oct 22, 2013 7:23:15 PM org.jclouds.compute.internal.BaseComputeServiceLiveTest$1 call
INFO: Started node 3
Oct 22, 2013 7:23:15 PM org.jclouds.compute.internal.BaseComputeServiceLiveTest$1 call
INFO: Started node 4
[TestNG] Test testConcurrentUseOfComputeServiceToCreateNodes(org.jclouds.compute.StubComputeServiceIntegrationTest) succeeded: 712ms
Test suite progress: tests succeeded: 110, failed: 0, skipped: 0.
Starting test testCreateTwoNodesWithRunScript(org.jclouds.compute.StubComputeServiceIntegrationTest)
[TestNG] Test testCreateTwoNodesWithRunScript(org.jclouds.compute.StubComputeServiceIntegrationTest) succeeded: 1229ms
Test suite progress: tests succeeded: 111, failed: 0, skipped: 0.
Starting test testCreateAnotherNodeWithANewContextToEnsureSharedMemIsntRequired(org.jclouds.compute.StubComputeServiceIntegrationTest)
Oct 22, 2013 7:23:17 PM org.jclouds.compute.internal.BaseComputeServiceLiveTest testCreateAnotherNodeWithANewContextToEnsureSharedMemIsntRequired
INFO: creating another node based on existing nodes' location: {scope=PROVIDER, id=stub, description=stub}
[TestNG] Test testCreateAnotherNodeWithANewContextToEnsureSharedMemIsntRequired(org.jclouds.compute.StubComputeServiceIntegrationTest) succeeded: 718ms
Test suite progress: tests succeeded: 112, failed: 0, skipped: 0.
Starting test testCredentialsCache(org.jclouds.compute.StubComputeServiceIntegrationTest)
[TestNG] Test testCredentialsCache(org.jclouds.compute.StubComputeServiceIntegrationTest) succeeded: 83ms
Test suite progress: tests succeeded: 113, failed: 0, skipped: 0.
Starting test testGet(org.jclouds.compute.StubComputeServiceIntegrationTest)
[TestNG] Test testGet(org.jclouds.compute.StubComputeServiceIntegrationTest) succeeded: 2ms
Test suite progress: tests succeeded: 114, failed: 0, skipped: 0.
Starting test testOptionToNotBlock(org.jclouds.compute.StubComputeServiceIntegrationTest)
[TestNG] Test testOptionToNotBlock(org.jclouds.compute.StubComputeServiceIntegrationTest) succeeded: 361ms
Test suite progress: tests succeeded: 115, failed: 0, skipped: 0.
Starting test testReboot(org.jclouds.compute.StubComputeServiceIntegrationTest)
[TestNG] Test testReboot(org.jclouds.compute.StubComputeServiceIntegrationTest) succeeded: 154ms
Test suite progress: tests succeeded: 116, failed: 0, skipped: 0.
Starting test testSuspendResume(org.jclouds.compute.StubComputeServiceIntegrationTest)
[TestNG] Test testSuspendResume(org.jclouds.compute.StubComputeServiceIntegrationTest) succeeded: 308ms
Test suite progress: tests succeeded: 117, failed: 0, skipped: 0.
Starting test testGetNodesWithDetails(org.jclouds.compute.StubComputeServiceIntegrationTest)
[TestNG] Test testGetNodesWithDetails(org.jclouds.compute.StubComputeServiceIntegrationTest) succeeded: 1ms
Test suite progress: tests succeeded: 118, failed: 0, skipped: 0.
Starting test testListNodes(org.jclouds.compute.StubComputeServiceIntegrationTest)
[TestNG] Test testListNodes(org.jclouds.compute.StubComputeServiceIntegrationTest) succeeded: 1ms
Test suite progress: tests succeeded: 119, failed: 0, skipped: 0.
Starting test testListNodesByIds(org.jclouds.compute.StubComputeServiceIntegrationTest)
[TestNG] Test testListNodesByIds(org.jclouds.compute.StubComputeServiceIntegrationTest) succeeded: 6ms
Test suite progress: tests succeeded: 120, failed: 0, skipped: 0.
Starting test testDestroyNodes(org.jclouds.compute.StubComputeServiceIntegrationTest)
[TestNG] Test testDestroyNodes(org.jclouds.compute.StubComputeServiceIntegrationTest) succeeded: 755ms
Test suite progress: tests succeeded: 121, failed: 0, skipped: 0.
Tests run: 121, Failures: 0, Errors: 0, Skipped: 0, Time elapsed: 9.473 sec
ERROR: Failed to parse POMs
hudson.remoting.ChannelClosedException: channel is already closed
at hudson.remoting.Channel.send(Channel.java:520)
at hudson.remoting.Request.call(Request.java:129)
at hudson.remoting.Channel.call(Channel.java:718)
at hudson.remoting.RemoteInvocationHandler.invoke(RemoteInvocationHandler.java:162)
at $Proxy47.isAlive(Unknown Source)
at hudson.Launcher$RemoteLauncher$ProcImpl.isAlive(Launcher.java:930)
at hudson.maven.ProcessCache$MavenProcess.call(ProcessCache.java:161)
at hudson.maven.MavenModuleSetBuild$MavenModuleSetBuildExecution.doRun(MavenModuleSetBuild.java:765)
at hudson.model.AbstractBuild$AbstractBuildExecution.run(AbstractBuild.java:594)
at hudson.model.Run.execute(Run.java:1575)
at hudson.maven.MavenModuleSetBuild.run(MavenModuleSetBuild.java:485)
at hudson.model.ResourceController.execute(ResourceController.java:88)
at hudson.model.Executor.run(Executor.java:237)
Caused by: java.io.IOException: Unexpected termination of the channel
at hudson.remoting.SynchronousCommandTransport$ReaderThread.run(SynchronousCommandTransport.java:50)
Caused by: java.io.EOFException
at java.io.ObjectInputStream$BlockDataInputStream.peekByte(Unknown Source)
at java.io.ObjectInputStream.readObject0(Unknown Source)
at java.io.ObjectInputStream.readObject(Unknown Source)
at hudson.remoting.Command.readFrom(Command.java:92)
at hudson.remoting.ClassicCommandTransport.read(ClassicCommandTransport.java:72)
at hudson.remoting.SynchronousCommandTransport$ReaderThread.run(SynchronousCommandTransport.java:48)
Looks like the node went offline during the build. Check the slave log for the details.
FATAL: channel is already closed
hudson.remoting.ChannelClosedException: channel is already closed
at hudson.remoting.Channel.send(Channel.java:520)
at hudson.remoting.Request.call(Request.java:129)
at hudson.remoting.Channel.call(Channel.java:718)
at hudson.Launcher$RemoteLauncher.kill(Launcher.java:887)
at hudson.Launcher$2.kill(Launcher.java:745)
at hudson.model.AbstractBuild$AbstractBuildExecution.run(AbstractBuild.java:617)
at hudson.model.Run.execute(Run.java:1575)
at hudson.maven.MavenModuleSetBuild.run(MavenModuleSetBuild.java:485)
at hudson.model.ResourceController.execute(ResourceController.java:88)
at hudson.model.Executor.run(Executor.java:237)
Caused by: java.io.IOException: Unexpected termination of the channel
at hudson.remoting.SynchronousCommandTransport$ReaderThread.run(SynchronousCommandTransport.java:50)
Caused by: java.io.EOFException
at java.io.ObjectInputStream$BlockDataInputStream.peekByte(Unknown Source)
at java.io.ObjectInputStream.readObject0(Unknown Source)
at java.io.ObjectInputStream.readObject(Unknown Source)
at hudson.remoting.Command.readFrom(Command.java:92)
at hudson.remoting.ClassicCommandTransport.read(ClassicCommandTransport.java:72)
at hudson.remoting.SynchronousCommandTransport$ReaderThread.run(SynchronousCommandTransport.java:48)