You are viewing a plain text version of this content. The canonical link for it is here.
Posted to builds@cassandra.apache.org by Apache Jenkins Server <je...@builds.apache.org> on 2025/04/12 10:26:18 UTC

Build complete: Cassandra-trunk #2112 [UNSTABLE] d3658f0491a7c01490be49270d468f5602c3baf7

-------------------------------------------------------------------------------
  Build Cassandra-trunk #2112 Still Unstable
  URL: https://ci-cassandra.apache.org/job/Cassandra-trunk/2112/
  -------------------------------------------------------------------------------
  Changes:
  No changes

  -------------------------------------------------------------------------------
  Failed Tests:
  13 tests failed.
FAILED:  dtest-latest.global_row_key_cache_test.TestGlobalRowKeyCache.Tests / dtest-latest jdk17 57/64 / test_functional
FAILED:  dtest-novnode.repair_tests.repair_test.TestRepair.Tests / dtest-novnode jdk11 2/64 / test_multiple_concurrent_repairs
FAILED:  dtest-upgrade-large.upgrade_tests.upgrade_through_versions_test.TestProtoV3Upgrade_AllVersions_EndsAt_Trunk_HEAD.Tests / dtest-upgrade-large jdk11 7/32 / test_parallel_upgrade_with_internode_ssl
FAILED:  dtest-upgrade-large.upgrade_tests.upgrade_through_versions_test.TestUpgrade_current_4_1_x_To_indev_trunk.Tests / dtest-upgrade-large jdk11 3/32 / test_bootstrap
FAILED:  dtest-upgrade-large.upgrade_tests.upgrade_through_versions_test.TestUpgrade_current_4_1_x_To_indev_trunk.Tests / dtest-upgrade-large jdk11 7/32 / test_parallel_upgrade_with_internode_ssl
FAILED:  dtest.replace_address_test.TestReplaceAddress.Tests / dtest jdk11 18/64 / test_fail_without_replace
FAILED:  org.apache.cassandra.net.ProxyHandlerConnectionsTest.Tests / test-cdc jdk17 2/8 / testExpireSome-cdc_jdk17_x86_64
FAILED:  org.apache.cassandra.simulator.test.HarrySimulatorTest.Tests / simulator-dtest jdk11 / test-cassandra.testtag_IS_UNDEFINED
FAILED:  dtest-latest.largecolumn_test.TestLargeColumn.Tests / dtest-latest jdk11 34/64 / test_cleanup
FAILED:  dtest-latest.largecolumn_test.TestLargeColumn.Tests / dtest-latest jdk17 34/64 / test_cleanup
FAILED:  org.apache.cassandra.distributed.upgrade.ClusterMetadataUpgradeHarryTest.Tests / jvm-dtest-upgrade jdk11 6/6 / simpleUpgradeTest-cassandra.testtag_IS_UNDEFINED
FAILED:  org.apache.cassandra.fuzz.sai.MultiNodeSAITest.Tests / jvm-dtest jdk11 4/12 / indexOnlySaiTest-cassandra.testtag_IS_UNDEFINED
FAILED:  org.apache.cassandra.fuzz.sai.MultiNodeSAITest.Tests / jvm-dtest jdk17 4/12 / indexOnlySaiTest-cassandra.testtag_IS_UNDEFINED

  -------------------------------------------------------------------------------
  For complete test report and logs see https://nightlies.apache.org/cassandra/Cassandra-trunk/2112/