You are viewing a plain text version of this content. The canonical link for it is here.
Posted to builds@beam.apache.org by Apache Jenkins Server <je...@builds.apache.org> on 2023/10/15 04:19:17 UTC
Build failed in Jenkins: beam_PostCommit_XVR_Flink #7470
See <https://ci-beam.apache.org/job/beam_PostCommit_XVR_Flink/7470/display/redirect>
Changes:
------------------------------------------
[...truncated 224.32 KB...]
> Get more help at https://help.gradle.org.
==============================================================================
13: Task failed with an exception.
-----------
* What went wrong:
Execution failed for task ':sdks:java:extensions:schemaio-expansion-service:test'.
> Could not resolve all dependencies for configuration ':sdks:java:extensions:schemaio-expansion-service:testRuntimeClasspath'.
> Problems writing to Binary store in /home/jenkins/.gradle/.tmp/gradle1923582768351122796.bin (exist: true)
* Try:
> Run with --stacktrace option to get the stack trace.
> Run with --info or --debug option to get more log output.
> Run with --scan to get full insights.
> Get more help at https://help.gradle.org.
==============================================================================
14: Task failed with an exception.
-----------
* What went wrong:
Execution failed for task ':runners:flink:1.15:copyTestSourceOverrides'.
> Failed to create parent directory '<https://ci-beam.apache.org/job/beam_PostCommit_XVR_Flink/ws/src/runners/flink/1.15/build/source-overrides/src/test'> when creating directory '<https://ci-beam.apache.org/job/beam_PostCommit_XVR_Flink/ws/src/runners/flink/1.15/build/source-overrides/src/test/java'>
* Try:
> Run with --stacktrace option to get the stack trace.
> Run with --info or --debug option to get more log output.
> Run with --scan to get full insights.
> Get more help at https://help.gradle.org.
==============================================================================
15: Task failed with an exception.
-----------
* What went wrong:
Execution failed for task ':runners:portability:java:createCheckerFrameworkManifest'.
> Failed to create parent directory '<https://ci-beam.apache.org/job/beam_PostCommit_XVR_Flink/ws/src/runners/portability/java/build'> when creating directory '<https://ci-beam.apache.org/job/beam_PostCommit_XVR_Flink/ws/src/runners/portability/java/build/checkerframework/META-INF/gradle'>
* Try:
> Run with --stacktrace option to get the stack trace.
> Run with --info or --debug option to get more log output.
> Run with --scan to get full insights.
> Get more help at https://help.gradle.org.
==============================================================================
16: Task failed with an exception.
-----------
* What went wrong:
Execution failed for task ':runners:flink:1.15:processTestResources'.
> Failed to create directory '<https://ci-beam.apache.org/job/beam_PostCommit_XVR_Flink/ws/src/runners/flink/1.15/build/resources/test'>
* Try:
> Run with --stacktrace option to get the stack trace.
> Run with --info or --debug option to get more log output.
> Run with --scan to get full insights.
> Get more help at https://help.gradle.org.
==============================================================================
17: Task failed with an exception.
-----------
* What went wrong:
Execution failed for task ':sdks:java:extensions:python:createCheckerFrameworkManifest'.
> Failed to create parent directory '<https://ci-beam.apache.org/job/beam_PostCommit_XVR_Flink/ws/src/sdks/java/extensions/python/build'> when creating directory '<https://ci-beam.apache.org/job/beam_PostCommit_XVR_Flink/ws/src/sdks/java/extensions/python/build/checkerframework/META-INF/gradle'>
* Try:
> Run with --stacktrace option to get the stack trace.
> Run with --info or --debug option to get more log output.
> Run with --scan to get full insights.
> Get more help at https://help.gradle.org.
==============================================================================
18: Task failed with an exception.
-----------
* What went wrong:
Execution failed for task ':sdks:java:io:debezium:expansion-service:spotlessJava'.
> Failed to load cache entry abb13776787d0835a691c3aac8bada26 for task ':sdks:java:io:debezium:expansion-service:spotlessJava': Could not load from local cache: Couldn't create directory: <https://ci-beam.apache.org/job/beam_PostCommit_XVR_Flink/ws/src/sdks/java/io/debezium/expansion-service/build/spotless/spotlessJava>
* Try:
> Run with --stacktrace option to get the stack trace.
> Run with --info or --debug option to get more log output.
> Run with --scan to get full insights.
> Get more help at https://help.gradle.org.
==============================================================================
19: Task failed with an exception.
-----------
* What went wrong:
Execution failed for task ':sdks:java:extensions:python:processResources'.
> Failed to create parent directory '<https://ci-beam.apache.org/job/beam_PostCommit_XVR_Flink/ws/src/sdks/java/extensions/python/build'> when creating directory '<https://ci-beam.apache.org/job/beam_PostCommit_XVR_Flink/ws/src/sdks/java/extensions/python/build/resources/main'>
* Try:
> Run with --stacktrace option to get the stack trace.
> Run with --info or --debug option to get more log output.
> Run with --scan to get full insights.
> Get more help at https://help.gradle.org.
==============================================================================
20: Task failed with an exception.
-----------
* What went wrong:
Execution failed for task ':runners:core-java:compileTestJava'.
> Could not resolve all dependencies for configuration ':runners:core-java:testCompileClasspath'.
> Problems writing to Binary store in /home/jenkins/.gradle/.tmp/gradle2738320975029286988.bin (exist: true)
* Try:
> Run with --stacktrace option to get the stack trace.
> Run with --info or --debug option to get more log output.
> Run with --scan to get full insights.
> Get more help at https://help.gradle.org.
==============================================================================
21: Task failed with an exception.
-----------
* What went wrong:
Execution failed for task ':sdks:java:io:expansion-service:startScripts'.
> Could not write to file '<https://ci-beam.apache.org/job/beam_PostCommit_XVR_Flink/ws/src/sdks/java/io/expansion-service/build/scripts/expansion-service'.>
* Try:
> Run with --stacktrace option to get the stack trace.
> Run with --info or --debug option to get more log output.
> Run with --scan to get full insights.
> Get more help at https://help.gradle.org.
==============================================================================
22: Task failed with an exception.
-----------
* What went wrong:
Execution failed for task ':sdks:java:io:expansion-service:packageTests'.
> Cannot access input property 'rootSpec$2$1' of task ':sdks:java:io:expansion-service:packageTests'. Accessing unreadable inputs or outputs is not supported. Declare the task as untracked by using Task.doNotTrackState(). For more information, please refer to https://docs.gradle.org/8.3/userguide/incremental_build.html#disable-state-tracking in the Gradle documentation.
> Failed to create directory '<https://ci-beam.apache.org/job/beam_PostCommit_XVR_Flink/ws/src/sdks/java/io/expansion-service/build/tmp/packageTests'>
* Try:
> Run with --stacktrace option to get the stack trace.
> Run with --info or --debug option to get more log output.
> Run with --scan to get full insights.
> Get more help at https://help.gradle.org.
==============================================================================
23: Task failed with an exception.
-----------
* What went wrong:
Execution failed for task ':sdks:java:io:expansion-service:shadowJar'.
> Cannot access input property 'rootSpec$2$1' of task ':sdks:java:io:expansion-service:shadowJar'. Accessing unreadable inputs or outputs is not supported. Declare the task as untracked by using Task.doNotTrackState(). For more information, please refer to https://docs.gradle.org/8.3/userguide/incremental_build.html#disable-state-tracking in the Gradle documentation.
> Failed to create directory '<https://ci-beam.apache.org/job/beam_PostCommit_XVR_Flink/ws/src/sdks/java/io/expansion-service/build/tmp/shadowJar'>
* Try:
> Run with --stacktrace option to get the stack trace.
> Run with --info or --debug option to get more log output.
> Run with --scan to get full insights.
> Get more help at https://help.gradle.org.
==============================================================================
24: Task failed with an exception.
-----------
* What went wrong:
Execution failed for task ':sdks:java:io:expansion-service:analyzeClassesDependencies'.
> Could not resolve all dependencies for configuration ':sdks:java:io:expansion-service:permitUnusedDeclared'.
> Problems writing to Binary store in /home/jenkins/.gradle/.tmp/gradle2793266038311731012.bin (exist: true)
* Try:
> Run with --stacktrace option to get the stack trace.
> Run with --info or --debug option to get more log output.
> Run with --scan to get full insights.
> Get more help at https://help.gradle.org.
==============================================================================
25: Task failed with an exception.
-----------
* What went wrong:
Execution failed for task ':sdks:java:io:expansion-service:spotlessJava'.
> Failed to create parent directory '<https://ci-beam.apache.org/job/beam_PostCommit_XVR_Flink/ws/src/sdks/java/io/expansion-service/build/spotless'> when creating directory '<https://ci-beam.apache.org/job/beam_PostCommit_XVR_Flink/ws/src/sdks/java/io/expansion-service/build/spotless/spotlessJava'>
* Try:
> Run with --stacktrace option to get the stack trace.
> Run with --info or --debug option to get more log output.
> Run with --scan to get full insights.
> Get more help at https://help.gradle.org.
==============================================================================
26: Task failed with an exception.
-----------
* What went wrong:
Execution failed for task ':release:go-licenses:py:dockerRun'.
> Process 'command 'docker'' finished with non-zero exit value 1
* Try:
> Run with --stacktrace option to get the stack trace.
> Run with --info or --debug option to get more log output.
> Run with --scan to get full insights.
> Get more help at https://help.gradle.org.
==============================================================================
27: Task failed with an exception.
-----------
* What went wrong:
Execution failed for task ':release:go-licenses:go:dockerRun'.
> Process 'command 'docker'' finished with non-zero exit value 1
* Try:
> Run with --stacktrace option to get the stack trace.
> Run with --info or --debug option to get more log output.
> Run with --scan to get full insights.
> Get more help at https://help.gradle.org.
==============================================================================
28: Task failed with an exception.
-----------
* What went wrong:
Execution failed for task ':release:go-licenses:java:dockerRun'.
> Process 'command 'docker'' finished with non-zero exit value 1
* Try:
> Run with --stacktrace option to get the stack trace.
> Run with --info or --debug option to get more log output.
> Run with --scan to get full insights.
> Get more help at https://help.gradle.org.
==============================================================================
29: Task failed with an exception.
-----------
* What went wrong:
Could not add entry ':sdks:java:core:jar' to cache executionHistory.bin (<https://ci-beam.apache.org/job/beam_PostCommit_XVR_Flink/ws/src/.gradle/8.3/executionHistory/executionHistory.bin).>
> java.io.IOException: No space left on device
* Try:
> Run with --stacktrace option to get the stack trace.
> Run with --info or --debug option to get more log output.
> Run with --scan to get full insights.
> Get more help at https://help.gradle.org.
==============================================================================
Deprecated Gradle features were used in this build, making it incompatible with Gradle 9.0.
You can use '--warning-mode all' to show the individual deprecation warnings and determine if they come from your own scripts or plugins.
For more on this, please refer to https://docs.gradle.org/8.3/userguide/command_line_interface.html#sec:command_line_warnings in the Gradle documentation.
BUILD FAILED in 46s
FAILURE: Build failed with an exception.
* What went wrong:
Could not receive a message from the daemon.
* Try:
> Run with --stacktrace option to get the stack trace.
> Run with --info or --debug option to get more log output.
> Run with --scan to get full insights.
> Get more help at https://help.gradle.org.
Build step 'Invoke Gradle script' changed build result to FAILURE
Build step 'Invoke Gradle script' marked build as failure
---------------------------------------------------------------------
To unsubscribe, e-mail: builds-unsubscribe@beam.apache.org
For additional commands, e-mail: builds-help@beam.apache.org
Jenkins build is back to normal : beam_PostCommit_XVR_Flink #7471
Posted by Apache Jenkins Server <je...@builds.apache.org>.
See <https://ci-beam.apache.org/job/beam_PostCommit_XVR_Flink/7471/display/redirect>
---------------------------------------------------------------------
To unsubscribe, e-mail: builds-unsubscribe@beam.apache.org
For additional commands, e-mail: builds-help@beam.apache.org