You are viewing a plain text version of this content. The canonical link for it is here.
Posted to dev@lucene.apache.org by Policeman Jenkins Server <je...@thetaphi.de> on 2014/06/13 17:18:02 UTC
[JENKINS] Lucene-Solr-4.x-Linux (32bit/jdk1.8.0_05) - Build # 10431
- Still Failing!
Build: http://jenkins.thetaphi.de/job/Lucene-Solr-4.x-Linux/10431/
Java: 32bit/jdk1.8.0_05 -client -XX:+UseParallelGC
1 tests failed.
REGRESSION: org.apache.solr.cloud.AliasIntegrationTest.testDistribSearch
Error Message:
collection already exists: collection2
Stack Trace:
org.apache.solr.client.solrj.impl.HttpSolrServer$RemoteSolrException: collection already exists: collection2
at __randomizedtesting.SeedInfo.seed([FFB4B510D6EAFD27:7E523B08A1B59D1B]:0)
at org.apache.solr.client.solrj.impl.HttpSolrServer.executeMethod(HttpSolrServer.java:554)
at org.apache.solr.client.solrj.impl.HttpSolrServer.request(HttpSolrServer.java:210)
at org.apache.solr.client.solrj.impl.HttpSolrServer.request(HttpSolrServer.java:206)
at org.apache.solr.cloud.AbstractFullDistribZkTestBase.createCollection(AbstractFullDistribZkTestBase.java:1508)
at org.apache.solr.cloud.AbstractFullDistribZkTestBase.createCollection(AbstractFullDistribZkTestBase.java:1468)
at org.apache.solr.cloud.AbstractFullDistribZkTestBase.createCollection(AbstractFullDistribZkTestBase.java:1527)
at org.apache.solr.cloud.AbstractFullDistribZkTestBase.createCollection(AbstractFullDistribZkTestBase.java:1464)
at org.apache.solr.cloud.AliasIntegrationTest.doTest(AliasIntegrationTest.java:91)
at org.apache.solr.BaseDistributedSearchTestCase.testDistribSearch(BaseDistributedSearchTestCase.java:865)
at sun.reflect.NativeMethodAccessorImpl.invoke0(Native Method)
at sun.reflect.NativeMethodAccessorImpl.invoke(NativeMethodAccessorImpl.java:62)
at sun.reflect.DelegatingMethodAccessorImpl.invoke(DelegatingMethodAccessorImpl.java:43)
at java.lang.reflect.Method.invoke(Method.java:483)
at com.carrotsearch.randomizedtesting.RandomizedRunner.invoke(RandomizedRunner.java:1618)
at com.carrotsearch.randomizedtesting.RandomizedRunner$6.evaluate(RandomizedRunner.java:827)
at com.carrotsearch.randomizedtesting.RandomizedRunner$7.evaluate(RandomizedRunner.java:863)
at com.carrotsearch.randomizedtesting.RandomizedRunner$8.evaluate(RandomizedRunner.java:877)
at com.carrotsearch.randomizedtesting.rules.SystemPropertiesRestoreRule$1.evaluate(SystemPropertiesRestoreRule.java:53)
at org.apache.lucene.util.TestRuleSetupTeardownChained$1.evaluate(TestRuleSetupTeardownChained.java:50)
at org.apache.lucene.util.TestRuleFieldCacheSanity$1.evaluate(TestRuleFieldCacheSanity.java:51)
at org.apache.lucene.util.AbstractBeforeAfterRule$1.evaluate(AbstractBeforeAfterRule.java:46)
at com.carrotsearch.randomizedtesting.rules.SystemPropertiesInvariantRule$1.evaluate(SystemPropertiesInvariantRule.java:55)
at org.apache.lucene.util.TestRuleThreadAndTestName$1.evaluate(TestRuleThreadAndTestName.java:49)
at org.apache.lucene.util.TestRuleIgnoreAfterMaxFailures$1.evaluate(TestRuleIgnoreAfterMaxFailures.java:65)
at org.apache.lucene.util.TestRuleMarkFailure$1.evaluate(TestRuleMarkFailure.java:48)
at com.carrotsearch.randomizedtesting.rules.StatementAdapter.evaluate(StatementAdapter.java:36)
at com.carrotsearch.randomizedtesting.ThreadLeakControl$StatementRunner.run(ThreadLeakControl.java:360)
at com.carrotsearch.randomizedtesting.ThreadLeakControl.forkTimeoutingTask(ThreadLeakControl.java:793)
at com.carrotsearch.randomizedtesting.ThreadLeakControl$3.evaluate(ThreadLeakControl.java:453)
at com.carrotsearch.randomizedtesting.RandomizedRunner.runSingleTest(RandomizedRunner.java:836)
at com.carrotsearch.randomizedtesting.RandomizedRunner$3.evaluate(RandomizedRunner.java:738)
at com.carrotsearch.randomizedtesting.RandomizedRunner$4.evaluate(RandomizedRunner.java:772)
at com.carrotsearch.randomizedtesting.RandomizedRunner$5.evaluate(RandomizedRunner.java:783)
at com.carrotsearch.randomizedtesting.rules.StatementAdapter.evaluate(StatementAdapter.java:36)
at com.carrotsearch.randomizedtesting.rules.SystemPropertiesRestoreRule$1.evaluate(SystemPropertiesRestoreRule.java:53)
at org.apache.lucene.util.AbstractBeforeAfterRule$1.evaluate(AbstractBeforeAfterRule.java:46)
at org.apache.lucene.util.TestRuleStoreClassName$1.evaluate(TestRuleStoreClassName.java:42)
at com.carrotsearch.randomizedtesting.rules.SystemPropertiesInvariantRule$1.evaluate(SystemPropertiesInvariantRule.java:55)
at com.carrotsearch.randomizedtesting.rules.NoShadowingOrOverridesOnMethodsRule$1.evaluate(NoShadowingOrOverridesOnMethodsRule.java:39)
at com.carrotsearch.randomizedtesting.rules.NoShadowingOrOverridesOnMethodsRule$1.evaluate(NoShadowingOrOverridesOnMethodsRule.java:39)
at com.carrotsearch.randomizedtesting.rules.StatementAdapter.evaluate(StatementAdapter.java:36)
at com.carrotsearch.randomizedtesting.rules.StatementAdapter.evaluate(StatementAdapter.java:36)
at com.carrotsearch.randomizedtesting.rules.StatementAdapter.evaluate(StatementAdapter.java:36)
at org.apache.lucene.util.TestRuleAssertionsRequired$1.evaluate(TestRuleAssertionsRequired.java:43)
at org.apache.lucene.util.TestRuleMarkFailure$1.evaluate(TestRuleMarkFailure.java:48)
at org.apache.lucene.util.TestRuleIgnoreAfterMaxFailures$1.evaluate(TestRuleIgnoreAfterMaxFailures.java:65)
at org.apache.lucene.util.TestRuleIgnoreTestSuites$1.evaluate(TestRuleIgnoreTestSuites.java:55)
at com.carrotsearch.randomizedtesting.rules.StatementAdapter.evaluate(StatementAdapter.java:36)
at com.carrotsearch.randomizedtesting.ThreadLeakControl$StatementRunner.run(ThreadLeakControl.java:360)
at java.lang.Thread.run(Thread.java:745)
Build Log:
[...truncated 11273 lines...]
[junit4] Suite: org.apache.solr.cloud.AliasIntegrationTest
[junit4] 2> Creating dataDir: /mnt/ssd/jenkins/workspace/Lucene-Solr-4.x-Linux/solr/build/solr-core/test/J0/./solr.cloud.AliasIntegrationTest-FFB4B510D6EAFD27-001/init-core-data-001
[junit4] 2> 634666 T2911 oas.SolrTestCaseJ4.buildSSLConfig Randomized ssl (true) and clientAuth (true)
[junit4] 2> 634667 T2911 oas.BaseDistributedSearchTestCase.initHostContext Setting hostContext system property: /_uw/vb
[junit4] 2> 634669 T2911 oas.SolrTestCaseJ4.setUp ###Starting testDistribSearch
[junit4] 2> 634670 T2911 oasc.ZkTestServer.run STARTING ZK TEST SERVER
[junit4] 1> client port:0.0.0.0/0.0.0.0:0
[junit4] 2> 634670 T2912 oasc.ZkTestServer$ZKServerMain.runFromConfig Starting server
[junit4] 2> 634770 T2911 oasc.ZkTestServer.run start zk server on port:46104
[junit4] 2> 634772 T2911 oascc.ConnectionManager.waitForConnected Waiting for client to connect to ZooKeeper
[junit4] 2> 634930 T2918 oascc.ConnectionManager.process Watcher org.apache.solr.common.cloud.ConnectionManager@13aba96 name:ZooKeeperConnection Watcher:127.0.0.1:46104 got event WatchedEvent state:SyncConnected type:None path:null path:null type:None
[junit4] 2> 634930 T2911 oascc.ConnectionManager.waitForConnected Client is connected to ZooKeeper
[junit4] 2> 634931 T2911 oascc.SolrZkClient.makePath makePath: /solr
[junit4] 2> 634938 T2911 oascc.ConnectionManager.waitForConnected Waiting for client to connect to ZooKeeper
[junit4] 2> 634939 T2920 oascc.ConnectionManager.process Watcher org.apache.solr.common.cloud.ConnectionManager@e548c7 name:ZooKeeperConnection Watcher:127.0.0.1:46104/solr got event WatchedEvent state:SyncConnected type:None path:null path:null type:None
[junit4] 2> 634940 T2911 oascc.ConnectionManager.waitForConnected Client is connected to ZooKeeper
[junit4] 2> 634940 T2911 oascc.SolrZkClient.makePath makePath: /collections/collection1
[junit4] 2> 634944 T2911 oascc.SolrZkClient.makePath makePath: /collections/collection1/shards
[junit4] 2> 634949 T2911 oascc.SolrZkClient.makePath makePath: /collections/control_collection
[junit4] 2> 634953 T2911 oascc.SolrZkClient.makePath makePath: /collections/control_collection/shards
[junit4] 2> 634957 T2911 oasc.AbstractZkTestCase.putConfig put /mnt/ssd/jenkins/workspace/Lucene-Solr-4.x-Linux/solr/core/src/test-files/solr/collection1/conf/solrconfig-tlog.xml to /configs/conf1/solrconfig.xml
[junit4] 2> 634957 T2911 oascc.SolrZkClient.makePath makePath: /configs/conf1/solrconfig.xml
[junit4] 2> 634964 T2911 oasc.AbstractZkTestCase.putConfig put /mnt/ssd/jenkins/workspace/Lucene-Solr-4.x-Linux/solr/core/src/test-files/solr/collection1/conf/schema.xml to /configs/conf1/schema.xml
[junit4] 2> 634965 T2911 oascc.SolrZkClient.makePath makePath: /configs/conf1/schema.xml
[junit4] 2> 634970 T2911 oasc.AbstractZkTestCase.putConfig put /mnt/ssd/jenkins/workspace/Lucene-Solr-4.x-Linux/solr/core/src/test-files/solr/collection1/conf/solrconfig.snippet.randomindexconfig.xml to /configs/conf1/solrconfig.snippet.randomindexconfig.xml
[junit4] 2> 634971 T2911 oascc.SolrZkClient.makePath makePath: /configs/conf1/solrconfig.snippet.randomindexconfig.xml
[junit4] 2> 634975 T2911 oasc.AbstractZkTestCase.putConfig put /mnt/ssd/jenkins/workspace/Lucene-Solr-4.x-Linux/solr/core/src/test-files/solr/collection1/conf/stopwords.txt to /configs/conf1/stopwords.txt
[junit4] 2> 634976 T2911 oascc.SolrZkClient.makePath makePath: /configs/conf1/stopwords.txt
[junit4] 2> 634979 T2911 oasc.AbstractZkTestCase.putConfig put /mnt/ssd/jenkins/workspace/Lucene-Solr-4.x-Linux/solr/core/src/test-files/solr/collection1/conf/protwords.txt to /configs/conf1/protwords.txt
[junit4] 2> 634980 T2911 oascc.SolrZkClient.makePath makePath: /configs/conf1/protwords.txt
[junit4] 2> 634984 T2911 oasc.AbstractZkTestCase.putConfig put /mnt/ssd/jenkins/workspace/Lucene-Solr-4.x-Linux/solr/core/src/test-files/solr/collection1/conf/currency.xml to /configs/conf1/currency.xml
[junit4] 2> 634985 T2911 oascc.SolrZkClient.makePath makePath: /configs/conf1/currency.xml
[junit4] 2> 634989 T2911 oasc.AbstractZkTestCase.putConfig put /mnt/ssd/jenkins/workspace/Lucene-Solr-4.x-Linux/solr/core/src/test-files/solr/collection1/conf/enumsConfig.xml to /configs/conf1/enumsConfig.xml
[junit4] 2> 634990 T2911 oascc.SolrZkClient.makePath makePath: /configs/conf1/enumsConfig.xml
[junit4] 2> 634995 T2911 oasc.AbstractZkTestCase.putConfig put /mnt/ssd/jenkins/workspace/Lucene-Solr-4.x-Linux/solr/core/src/test-files/solr/collection1/conf/open-exchange-rates.json to /configs/conf1/open-exchange-rates.json
[junit4] 2> 634995 T2911 oascc.SolrZkClient.makePath makePath: /configs/conf1/open-exchange-rates.json
[junit4] 2> 634999 T2911 oasc.AbstractZkTestCase.putConfig put /mnt/ssd/jenkins/workspace/Lucene-Solr-4.x-Linux/solr/core/src/test-files/solr/collection1/conf/mapping-ISOLatin1Accent.txt to /configs/conf1/mapping-ISOLatin1Accent.txt
[junit4] 2> 635000 T2911 oascc.SolrZkClient.makePath makePath: /configs/conf1/mapping-ISOLatin1Accent.txt
[junit4] 2> 635004 T2911 oasc.AbstractZkTestCase.putConfig put /mnt/ssd/jenkins/workspace/Lucene-Solr-4.x-Linux/solr/core/src/test-files/solr/collection1/conf/old_synonyms.txt to /configs/conf1/old_synonyms.txt
[junit4] 2> 635005 T2911 oascc.SolrZkClient.makePath makePath: /configs/conf1/old_synonyms.txt
[junit4] 2> 635009 T2911 oasc.AbstractZkTestCase.putConfig put /mnt/ssd/jenkins/workspace/Lucene-Solr-4.x-Linux/solr/core/src/test-files/solr/collection1/conf/synonyms.txt to /configs/conf1/synonyms.txt
[junit4] 2> 635010 T2911 oascc.SolrZkClient.makePath makePath: /configs/conf1/synonyms.txt
[junit4] 2> 635015 T2911 oascc.ConnectionManager.waitForConnected Waiting for client to connect to ZooKeeper
[junit4] 2> 635017 T2922 oascc.ConnectionManager.process Watcher org.apache.solr.common.cloud.ConnectionManager@99ac66 name:ZooKeeperConnection Watcher:127.0.0.1:46104/solr got event WatchedEvent state:SyncConnected type:None path:null path:null type:None
[junit4] 2> 635017 T2911 oascc.ConnectionManager.waitForConnected Client is connected to ZooKeeper
[junit4] 2> 635022 T2913 oazs.NIOServerCnxn.doIO WARN caught end of stream exception EndOfStreamException: Unable to read additional data from client sessionid 0x14695ba8c750002, likely client has closed socket
[junit4] 2> at org.apache.zookeeper.server.NIOServerCnxn.doIO(NIOServerCnxn.java:228)
[junit4] 2> at org.apache.zookeeper.server.NIOServerCnxnFactory.run(NIOServerCnxnFactory.java:208)
[junit4] 2> at java.lang.Thread.run(Thread.java:745)
[junit4] 2>
[junit4] 2> 635295 T2911 oejs.Server.doStart jetty-8.1.10.v20130312
[junit4] 2> 635299 T2911 oejus.SslContextFactory.doStart Enabled Protocols [SSLv2Hello, SSLv3, TLSv1, TLSv1.1, TLSv1.2] of [SSLv2Hello, SSLv3, TLSv1, TLSv1.1, TLSv1.2]
[junit4] 2> 635324 T2911 oejs.AbstractConnector.doStart Started SslSelectChannelConnector@127.0.0.1:58016
[junit4] 2> 635326 T2911 oass.SolrDispatchFilter.init SolrDispatchFilter.init()
[junit4] 2> 635326 T2911 oasc.SolrResourceLoader.locateSolrHome JNDI not configured for solr (NoInitialContextEx)
[junit4] 2> 635327 T2911 oasc.SolrResourceLoader.locateSolrHome using system property solr.solr.home: ./solr.cloud.AliasIntegrationTest-FFB4B510D6EAFD27-001/tempDir-002
[junit4] 2> 635327 T2911 oasc.SolrResourceLoader.<init> new SolrResourceLoader for directory: './solr.cloud.AliasIntegrationTest-FFB4B510D6EAFD27-001/tempDir-002/'
[junit4] 2> 635343 T2911 oasc.ConfigSolr.fromFile Loading container configuration from /mnt/ssd/jenkins/workspace/Lucene-Solr-4.x-Linux/solr/build/solr-core/test/J0/./solr.cloud.AliasIntegrationTest-FFB4B510D6EAFD27-001/tempDir-002/solr.xml
[junit4] 2> 635351 T2911 oasc.CoreContainer.<init> New CoreContainer 13244840
[junit4] 2> 635352 T2911 oasc.CoreContainer.load Loading cores into CoreContainer [instanceDir=./solr.cloud.AliasIntegrationTest-FFB4B510D6EAFD27-001/tempDir-002/]
[junit4] 2> 635352 T2911 oashc.HttpShardHandlerFactory.getParameter Setting socketTimeout to: 90000
[junit4] 2> 635352 T2911 oashc.HttpShardHandlerFactory.getParameter Setting urlScheme to:
[junit4] 2> 635353 T2911 oashc.HttpShardHandlerFactory.getParameter Setting connTimeout to: 15000
[junit4] 2> 635353 T2911 oashc.HttpShardHandlerFactory.getParameter Setting maxConnectionsPerHost to: 20
[junit4] 2> 635353 T2911 oashc.HttpShardHandlerFactory.getParameter Setting corePoolSize to: 0
[junit4] 2> 635354 T2911 oashc.HttpShardHandlerFactory.getParameter Setting maximumPoolSize to: 2147483647
[junit4] 2> 635354 T2911 oashc.HttpShardHandlerFactory.getParameter Setting maxThreadIdleTime to: 5
[junit4] 2> 635354 T2911 oashc.HttpShardHandlerFactory.getParameter Setting sizeOfQueue to: -1
[junit4] 2> 635354 T2911 oashc.HttpShardHandlerFactory.getParameter Setting fairnessPolicy to: false
[junit4] 2> 635356 T2911 oasl.LogWatcher.createWatcher SLF4J impl is org.slf4j.impl.Log4jLoggerFactory
[junit4] 2> 635357 T2911 oasl.LogWatcher.newRegisteredLogWatcher Registering Log Listener [Log4j (org.slf4j.impl.Log4jLoggerFactory)]
[junit4] 2> 635357 T2911 oasc.CoreContainer.load Host Name: 127.0.0.1
[junit4] 2> 635357 T2911 oasc.ZkContainer.initZooKeeper Zookeeper client=127.0.0.1:46104/solr
[junit4] 2> 635358 T2911 oasc.ZkController.checkChrootPath zkHost includes chroot
[junit4] 2> 635358 T2911 oascc.ConnectionManager.waitForConnected Waiting for client to connect to ZooKeeper
[junit4] 2> 635360 T2933 oascc.ConnectionManager.process Watcher org.apache.solr.common.cloud.ConnectionManager@6bbfda name:ZooKeeperConnection Watcher:127.0.0.1:46104 got event WatchedEvent state:SyncConnected type:None path:null path:null type:None
[junit4] 2> 635360 T2911 oascc.ConnectionManager.waitForConnected Client is connected to ZooKeeper
[junit4] 2> 635363 T2911 oascc.ConnectionManager.waitForConnected Waiting for client to connect to ZooKeeper
[junit4] 2> 635364 T2935 oascc.ConnectionManager.process Watcher org.apache.solr.common.cloud.ConnectionManager@c3bcf3 name:ZooKeeperConnection Watcher:127.0.0.1:46104/solr got event WatchedEvent state:SyncConnected type:None path:null path:null type:None
[junit4] 2> 635365 T2911 oascc.ConnectionManager.waitForConnected Client is connected to ZooKeeper
[junit4] 2> 635366 T2911 oascc.SolrZkClient.makePath makePath: /overseer/queue
[junit4] 2> 635370 T2911 oascc.SolrZkClient.makePath makePath: /overseer/collection-queue-work
[junit4] 2> 635374 T2911 oascc.SolrZkClient.makePath makePath: /overseer/collection-map-running
[junit4] 2> 635377 T2911 oascc.SolrZkClient.makePath makePath: /overseer/collection-map-completed
[junit4] 2> 635386 T2911 oascc.SolrZkClient.makePath makePath: /overseer/collection-map-failure
[junit4] 2> 635390 T2911 oascc.SolrZkClient.makePath makePath: /live_nodes
[junit4] 2> 635392 T2911 oasc.ZkController.createEphemeralLiveNode Register node as live in ZooKeeper:/live_nodes/127.0.0.1:58016__uw%2Fvb
[junit4] 2> 635394 T2911 oascc.SolrZkClient.makePath makePath: /live_nodes/127.0.0.1:58016__uw%2Fvb
[junit4] 2> 635397 T2911 oascc.SolrZkClient.makePath makePath: /overseer_elect
[junit4] 2> 635401 T2911 oascc.SolrZkClient.makePath makePath: /overseer_elect/election
[junit4] 2> 635407 T2911 oasc.OverseerElectionContext.runLeaderProcess I am going to be the leader 127.0.0.1:58016__uw%2Fvb
[junit4] 2> 635408 T2911 oascc.SolrZkClient.makePath makePath: /overseer_elect/leader
[junit4] 2> 635411 T2911 oasc.Overseer.start Overseer (id=91925470860607492-127.0.0.1:58016__uw%2Fvb-n_0000000000) starting
[junit4] 2> 635416 T2911 oascc.SolrZkClient.makePath makePath: /overseer/queue-work
[junit4] 2> 635429 T2937 oasc.OverseerCollectionProcessor.run Process current queue of collection creations
[junit4] 2> 635430 T2911 oascc.SolrZkClient.makePath makePath: /clusterstate.json
[junit4] 2> 635433 T2911 oascc.SolrZkClient.makePath makePath: /aliases.json
[junit4] 2> 635435 T2911 oascc.ZkStateReader.createClusterStateWatchersAndUpdate Updating cluster state from ZooKeeper...
[junit4] 2> 635439 T2936 oasc.Overseer$ClusterStateUpdater.run Starting to work on the main queue
[junit4] 2> 635442 T2938 oasc.ZkController.publish publishing core=collection1 state=down collection=control_collection
[junit4] 2> 635442 T2938 oasc.ZkController.publish numShards not found on descriptor - reading it from system property
[junit4] 2> 635444 T2935 oasc.DistributedQueue$LatchChildWatcher.process LatchChildWatcher fired on path: /overseer/queue state: SyncConnected type NodeChildrenChanged
[junit4] 2> 635444 T2938 oasc.ZkController.waitForCoreNodeName look for our core node name
[junit4] 2> 635446 T2936 oascc.ZkStateReader.updateClusterState Updating cloud state from ZooKeeper...
[junit4] 2> 635447 T2936 oasc.Overseer$ClusterStateUpdater.updateState Update state numShards=1 message={
[junit4] 2> "operation":"state",
[junit4] 2> "state":"down",
[junit4] 2> "base_url":"https://127.0.0.1:58016/_uw/vb",
[junit4] 2> "core":"collection1",
[junit4] 2> "roles":null,
[junit4] 2> "node_name":"127.0.0.1:58016__uw%2Fvb",
[junit4] 2> "shard":null,
[junit4] 2> "collection":"control_collection",
[junit4] 2> "numShards":"1",
[junit4] 2> "core_node_name":null}
[junit4] 2> 635448 T2936 oasc.Overseer$ClusterStateUpdater.createCollection Create collection control_collection with shards [shard1]
[junit4] 2> 635448 T2936 oasc.Overseer$ClusterStateUpdater.updateState Assigning new node to shard shard=shard1
[junit4] 2> 635453 T2935 oasc.DistributedQueue$LatchChildWatcher.process LatchChildWatcher fired on path: /overseer/queue state: SyncConnected type NodeChildrenChanged
[junit4] 2> 635454 T2935 oascc.ZkStateReader$2.process A cluster state change: WatchedEvent state:SyncConnected type:NodeDataChanged path:/clusterstate.json, has occurred - updating... (live nodes size: 1)
[junit4] 2> 636445 T2938 oasc.ZkController.waitForShardId waiting to find shard id in clusterstate for collection1
[junit4] 2> 636445 T2938 oasc.ZkController.createCollectionZkNode Check for collection zkNode:control_collection
[junit4] 2> 636446 T2938 oasc.ZkController.createCollectionZkNode Collection zkNode exists
[junit4] 2> 636447 T2938 oascc.ZkStateReader.readConfigName Load collection config from:/collections/control_collection
[junit4] 2> 636449 T2938 oascc.ZkStateReader.readConfigName path=/collections/control_collection configName=conf1 specified config exists in ZooKeeper
[junit4] 2> 636449 T2938 oasc.SolrResourceLoader.<init> new SolrResourceLoader for directory: './solr.cloud.AliasIntegrationTest-FFB4B510D6EAFD27-001/tempDir-002/collection1/'
[junit4] 2> 636450 T2938 oasc.SolrResourceLoader.replaceClassLoader Adding 'file:/mnt/ssd/jenkins/workspace/Lucene-Solr-4.x-Linux/solr/build/solr-core/test/J0/solr.cloud.AliasIntegrationTest-FFB4B510D6EAFD27-001/tempDir-002/collection1/lib/.svn/' to classloader
[junit4] 2> 636451 T2938 oasc.SolrResourceLoader.replaceClassLoader Adding 'file:/mnt/ssd/jenkins/workspace/Lucene-Solr-4.x-Linux/solr/build/solr-core/test/J0/solr.cloud.AliasIntegrationTest-FFB4B510D6EAFD27-001/tempDir-002/collection1/lib/classes/' to classloader
[junit4] 2> 636452 T2938 oasc.SolrResourceLoader.replaceClassLoader Adding 'file:/mnt/ssd/jenkins/workspace/Lucene-Solr-4.x-Linux/solr/build/solr-core/test/J0/solr.cloud.AliasIntegrationTest-FFB4B510D6EAFD27-001/tempDir-002/collection1/lib/README' to classloader
[junit4] 2> 636488 T2938 oasc.SolrConfig.<init> Using Lucene MatchVersion: LUCENE_4_9
[junit4] 2> 636497 T2938 oasc.SolrConfig.<init> Loaded SolrConfig: solrconfig.xml
[junit4] 2> 636499 T2938 oass.IndexSchema.readSchema Reading Solr Schema from schema.xml
[junit4] 2> 636505 T2938 oass.IndexSchema.readSchema [collection1] Schema name=test
[junit4] 2> 636623 T2938 oass.ByteField.init WARN ByteField is deprecated and will be removed in 5.0. You should use TrieIntField instead.
[junit4] 2> 636623 T2938 oass.ShortField.init WARN ShortField is deprecated and will be removed in 5.0. You should use TrieIntField instead.
[junit4] 2> 636624 T2938 oass.OpenExchangeRatesOrgProvider.init Initialized with rates=open-exchange-rates.json, refreshInterval=1440.
[junit4] 2> 636628 T2938 oass.IndexSchema.readSchema default search field in schema is text
[junit4] 2> 636630 T2938 oass.IndexSchema.readSchema unique key field: id
[junit4] 2> 636643 T2938 oass.FileExchangeRateProvider.reload Reloading exchange rates from file currency.xml
[junit4] 2> 636647 T2938 oass.FileExchangeRateProvider.reload Reloading exchange rates from file currency.xml
[junit4] 2> 636650 T2938 oass.OpenExchangeRatesOrgProvider.reload Reloading exchange rates from open-exchange-rates.json
[junit4] 2> 636651 T2938 oass.OpenExchangeRatesOrgProvider$OpenExchangeRates.<init> WARN Unknown key IMPORTANT NOTE
[junit4] 2> 636651 T2938 oass.OpenExchangeRatesOrgProvider$OpenExchangeRates.<init> WARN Expected key, got STRING
[junit4] 2> 636651 T2938 oass.OpenExchangeRatesOrgProvider.reload Reloading exchange rates from open-exchange-rates.json
[junit4] 2> 636652 T2938 oass.OpenExchangeRatesOrgProvider$OpenExchangeRates.<init> WARN Unknown key IMPORTANT NOTE
[junit4] 2> 636652 T2938 oass.OpenExchangeRatesOrgProvider$OpenExchangeRates.<init> WARN Expected key, got STRING
[junit4] 2> 636652 T2938 oasc.CoreContainer.create Creating SolrCore 'collection1' using configuration from collection control_collection
[junit4] 2> 636652 T2938 oasc.SolrCore.initDirectoryFactory org.apache.solr.core.MockDirectoryFactory
[junit4] 2> 636653 T2938 oasc.SolrCore.<init> [collection1] Opening new SolrCore at ./solr.cloud.AliasIntegrationTest-FFB4B510D6EAFD27-001/tempDir-002/collection1/, dataDir=./solr.cloud.AliasIntegrationTest-FFB4B510D6EAFD27-001/tempDir-001/control/data/
[junit4] 2> 636653 T2938 oasc.JmxMonitoredMap.<init> JMX monitoring is enabled. Adding Solr mbeans to JMX Server: com.sun.jmx.mbeanserver.JmxMBeanServer@115b4c
[junit4] 2> 636654 T2938 oasc.CachingDirectoryFactory.get return new directory for ./solr.cloud.AliasIntegrationTest-FFB4B510D6EAFD27-001/tempDir-001/control/data
[junit4] 2> 636655 T2938 oasc.SolrCore.getNewIndexDir New index directory detected: old=null new=./solr.cloud.AliasIntegrationTest-FFB4B510D6EAFD27-001/tempDir-001/control/data/index/
[junit4] 2> 636655 T2938 oasc.SolrCore.initIndex WARN [collection1] Solr index directory './solr.cloud.AliasIntegrationTest-FFB4B510D6EAFD27-001/tempDir-001/control/data/index' doesn't exist. Creating new index...
[junit4] 2> 636656 T2938 oasc.CachingDirectoryFactory.get return new directory for ./solr.cloud.AliasIntegrationTest-FFB4B510D6EAFD27-001/tempDir-001/control/data/index
[junit4] 2> 636656 T2938 oasu.RandomMergePolicy.<init> RandomMergePolicy wrapping class org.apache.lucene.index.LogByteSizeMergePolicy: [LogByteSizeMergePolicy: minMergeSize=1677721, mergeFactor=25, maxMergeSize=2147483648, maxMergeSizeForForcedMerge=9223372036854775807, calibrateSizeByDeletes=false, maxMergeDocs=2147483647, maxCFSSegmentSizeMB=8.796093022207999E12, noCFSRatio=0.37450410636813114]
[junit4] 2> 636657 T2938 oasc.SolrDeletionPolicy.onCommit SolrDeletionPolicy.onCommit: commits: num=1
[junit4] 2> commit{dir=MockDirectoryWrapper(RAMDirectory@629486 lockFactory=org.apache.lucene.store.SingleInstanceLockFactory@1224eaa),segFN=segments_1,generation=1}
[junit4] 2> 636658 T2938 oasc.SolrDeletionPolicy.updateCommits newest commit generation = 1
[junit4] 2> 636663 T2938 oasup.UpdateRequestProcessorChain.init creating updateRequestProcessorChain "nodistrib"
[junit4] 2> 636663 T2938 oasup.UpdateRequestProcessorChain.init creating updateRequestProcessorChain "dedupe"
[junit4] 2> 636664 T2938 oasup.UpdateRequestProcessorChain.init inserting DistributedUpdateProcessorFactory into updateRequestProcessorChain "dedupe"
[junit4] 2> 636664 T2938 oasup.UpdateRequestProcessorChain.init creating updateRequestProcessorChain "stored_sig"
[junit4] 2> 636665 T2938 oasup.UpdateRequestProcessorChain.init inserting DistributedUpdateProcessorFactory into updateRequestProcessorChain "stored_sig"
[junit4] 2> 636665 T2938 oasup.UpdateRequestProcessorChain.init creating updateRequestProcessorChain "distrib-dup-test-chain-explicit"
[junit4] 2> 636666 T2938 oasup.UpdateRequestProcessorChain.init creating updateRequestProcessorChain "distrib-dup-test-chain-implicit"
[junit4] 2> 636666 T2938 oasup.UpdateRequestProcessorChain.init inserting DistributedUpdateProcessorFactory into updateRequestProcessorChain "distrib-dup-test-chain-implicit"
[junit4] 2> 636667 T2938 oasc.SolrCore.loadUpdateProcessorChains no updateRequestProcessorChain defined as default, creating implicit default
[junit4] 2> 636668 T2938 oasc.RequestHandlers.initHandlersFromConfig created standard: solr.StandardRequestHandler
[junit4] 2> 636669 T2938 oasc.RequestHandlers.initHandlersFromConfig created /get: solr.RealTimeGetHandler
[junit4] 2> 636669 T2938 oasc.RequestHandlers.initHandlersFromConfig adding lazy requestHandler: solr.ReplicationHandler
[junit4] 2> 636669 T2938 oasc.RequestHandlers.initHandlersFromConfig created /replication: solr.ReplicationHandler
[junit4] 2> 636670 T2938 oasc.RequestHandlers.initHandlersFromConfig created /update: solr.UpdateRequestHandler
[junit4] 2> 636671 T2938 oasc.RequestHandlers.initHandlersFromConfig created /admin/: org.apache.solr.handler.admin.AdminHandlers
[junit4] 2> 636672 T2938 oasc.RequestHandlers.initHandlersFromConfig created /admin/file: solr.admin.ShowFileRequestHandler
[junit4] 2> 636674 T2938 oashl.XMLLoader.init xsltCacheLifetimeSeconds=60
[junit4] 2> 636675 T2938 oasu.CommitTracker.<init> Hard AutoCommit: disabled
[junit4] 2> 636675 T2938 oasu.CommitTracker.<init> Soft AutoCommit: disabled
[junit4] 2> 636676 T2938 oasu.RandomMergePolicy.<init> RandomMergePolicy wrapping class org.apache.lucene.index.LogByteSizeMergePolicy: [LogByteSizeMergePolicy: minMergeSize=1677721, mergeFactor=11, maxMergeSize=2147483648, maxMergeSizeForForcedMerge=9223372036854775807, calibrateSizeByDeletes=true, maxMergeDocs=2147483647, maxCFSSegmentSizeMB=8.796093022207999E12, noCFSRatio=0.5747052978639718]
[junit4] 2> 636676 T2938 oasc.SolrDeletionPolicy.onInit SolrDeletionPolicy.onInit: commits: num=1
[junit4] 2> commit{dir=MockDirectoryWrapper(RAMDirectory@629486 lockFactory=org.apache.lucene.store.SingleInstanceLockFactory@1224eaa),segFN=segments_1,generation=1}
[junit4] 2> 636677 T2938 oasc.SolrDeletionPolicy.updateCommits newest commit generation = 1
[junit4] 2> 636677 T2938 oass.SolrIndexSearcher.<init> Opening Searcher@5fa503[collection1] main
[junit4] 2> 636677 T2938 oascc.ZkStateReader.readConfigName Load collection config from:/collections/control_collection
[junit4] 2> 636678 T2938 oascc.ZkStateReader.readConfigName path=/collections/control_collection configName=conf1 specified config exists in ZooKeeper
[junit4] 2> 636678 T2938 oasr.ManagedResourceStorage.newStorageIO Setting up ZooKeeper-based storage for the RestManager with znodeBase: /configs/conf1
[junit4] 2> 636678 T2938 oasr.ManagedResourceStorage$ZooKeeperStorageIO.configure Configured ZooKeeperStorageIO with znodeBase: /configs/conf1
[junit4] 2> 636679 T2938 oasr.RestManager.init Initializing RestManager with initArgs: {}
[junit4] 2> 636679 T2938 oasr.ManagedResourceStorage.load Reading _rest_managed.json using ZooKeeperStorageIO:path=/configs/conf1
[junit4] 2> 636679 T2938 oasr.ManagedResourceStorage$ZooKeeperStorageIO.openInputStream No data found for znode /configs/conf1/_rest_managed.json
[junit4] 2> 636679 T2938 oasr.ManagedResourceStorage.load Loaded null at path _rest_managed.json using ZooKeeperStorageIO:path=/configs/conf1
[junit4] 2> 636680 T2938 oasr.ManagedResource.notifyObserversDuringInit WARN No registered observers for /rest/managed
[junit4] 2> 636680 T2938 oasr.RestManager.init Initializing 0 registered ManagedResources
[junit4] 2> 636682 T2939 oasc.SolrCore.registerSearcher [collection1] Registered new searcher Searcher@5fa503[collection1] main{StandardDirectoryReader(segments_1:1:nrt)}
[junit4] 2> 636683 T2938 oasc.CoreContainer.registerCore registering core: collection1
[junit4] 2> 636683 T2942 oasc.ZkController.register Register replica - core:collection1 address:https://127.0.0.1:58016/_uw/vb collection:control_collection shard:shard1
[junit4] 2> 636684 T2911 oass.SolrDispatchFilter.init user.dir=/mnt/ssd/jenkins/workspace/Lucene-Solr-4.x-Linux/solr/build/solr-core/test/J0
[junit4] 2> 636684 T2911 oass.SolrDispatchFilter.init SolrDispatchFilter.init() done
[junit4] 2> 636684 T2942 oascc.SolrZkClient.makePath makePath: /collections/control_collection/leader_elect/shard1/election
[junit4] 2> 636686 T2911 oascc.ConnectionManager.waitForConnected Waiting for client to connect to ZooKeeper
[junit4] 2> 636704 T2944 oascc.ConnectionManager.process Watcher org.apache.solr.common.cloud.ConnectionManager@d0c654 name:ZooKeeperConnection Watcher:127.0.0.1:46104/solr got event WatchedEvent state:SyncConnected type:None path:null path:null type:None
[junit4] 2> 636704 T2911 oascc.ConnectionManager.waitForConnected Client is connected to ZooKeeper
[junit4] 2> 636706 T2911 oascc.ZkStateReader.createClusterStateWatchersAndUpdate Updating cluster state from ZooKeeper...
[junit4] 2> 636707 T2942 oasc.ShardLeaderElectionContext.runLeaderProcess Running the leader process for shard shard1
[junit4] 2> 636708 T2911 oasc.ChaosMonkey.monkeyLog monkey: init - expire sessions:false cause connection loss:false
[junit4] 2> 636709 T2935 oasc.DistributedQueue$LatchChildWatcher.process LatchChildWatcher fired on path: /overseer/queue state: SyncConnected type NodeChildrenChanged
[junit4] 2> 636709 T2942 oasc.ShardLeaderElectionContext.waitForReplicasToComeUp Enough replicas found to continue.
[junit4] 2> 636710 T2942 oasc.ShardLeaderElectionContext.runLeaderProcess I may be the new leader - try and sync
[junit4] 2> ASYNC NEW_CORE C463 name=collection1 org.apache.solr.core.SolrCore@ece58f url=https://127.0.0.1:58016/_uw/vb/collection1 node=127.0.0.1:58016__uw%2Fvb C463_STATE=coll:control_collection core:collection1 props:{state=down, base_url=https://127.0.0.1:58016/_uw/vb, core=collection1, node_name=127.0.0.1:58016__uw%2Fvb}
[junit4] 2> 636710 T2942 C463 P58016 oasc.SyncStrategy.sync Sync replicas to https://127.0.0.1:58016/_uw/vb/collection1/
[junit4] 2> 636710 T2942 C463 P58016 oasc.SyncStrategy.syncReplicas Sync Success - now sync replicas to me
[junit4] 2> 636711 T2942 C463 P58016 oasc.SyncStrategy.syncToMe https://127.0.0.1:58016/_uw/vb/collection1/ has no replicas
[junit4] 2> 636711 T2936 oascc.ZkStateReader.updateClusterState Updating cloud state from ZooKeeper...
[junit4] 2> 636711 T2942 oasc.ShardLeaderElectionContext.runLeaderProcess I am the new leader: https://127.0.0.1:58016/_uw/vb/collection1/ shard1
[junit4] 2> 636711 T2942 oascc.SolrZkClient.makePath makePath: /collections/control_collection/leaders/shard1
[junit4] 2> 636713 T2935 oasc.DistributedQueue$LatchChildWatcher.process LatchChildWatcher fired on path: /overseer/queue state: SyncConnected type NodeChildrenChanged
[junit4] 2> 636714 T2935 oasc.DistributedQueue$LatchChildWatcher.process LatchChildWatcher fired on path: /overseer/queue state: SyncConnected type NodeChildrenChanged
[junit4] 2> 636716 T2935 oasc.DistributedQueue$LatchChildWatcher.process LatchChildWatcher fired on path: /overseer/queue state: SyncConnected type NodeChildrenChanged
[junit4] 2> 636818 T2944 oascc.ZkStateReader$2.process A cluster state change: WatchedEvent state:SyncConnected type:NodeDataChanged path:/clusterstate.json, has occurred - updating... (live nodes size: 1)
[junit4] 2> 636818 T2935 oascc.ZkStateReader$2.process A cluster state change: WatchedEvent state:SyncConnected type:NodeDataChanged path:/clusterstate.json, has occurred - updating... (live nodes size: 1)
[junit4] 2> 636865 T2942 oasc.ZkController.register We are https://127.0.0.1:58016/_uw/vb/collection1/ and leader is https://127.0.0.1:58016/_uw/vb/collection1/
[junit4] 2> 636866 T2942 oasc.ZkController.register No LogReplay needed for core=collection1 baseURL=https://127.0.0.1:58016/_uw/vb
[junit4] 2> 636866 T2942 oasc.ZkController.checkRecovery I am the leader, no recovery necessary
[junit4] 2> 636866 T2942 oasc.ZkController.publish publishing core=collection1 state=active collection=control_collection
[junit4] 2> 636866 T2942 oasc.ZkController.publish numShards not found on descriptor - reading it from system property
[junit4] 2> 636867 T2935 oasc.DistributedQueue$LatchChildWatcher.process LatchChildWatcher fired on path: /overseer/queue state: SyncConnected type NodeChildrenChanged
[junit4] 2> 636868 T2935 oasc.DistributedQueue$LatchChildWatcher.process LatchChildWatcher fired on path: /overseer/queue state: SyncConnected type NodeChildrenChanged
[junit4] 2> 636868 T2935 oasc.DistributedQueue$LatchChildWatcher.process LatchChildWatcher fired on path: /overseer/queue state: SyncConnected type NodeChildrenChanged
[junit4] 2> 636868 T2942 oascc.ZkStateReader.updateClusterState Updating cloud state from ZooKeeper...
[junit4] 2> 636869 T2936 oascc.ZkStateReader.updateClusterState Updating cloud state from ZooKeeper...
[junit4] 2> 636869 T2936 oasc.Overseer$ClusterStateUpdater.updateState Update state numShards=1 message={
[junit4] 2> "operation":"state",
[junit4] 2> "state":"active",
[junit4] 2> "base_url":"https://127.0.0.1:58016/_uw/vb",
[junit4] 2> "core":"collection1",
[junit4] 2> "roles":null,
[junit4] 2> "node_name":"127.0.0.1:58016__uw%2Fvb",
[junit4] 2> "shard":"shard1",
[junit4] 2> "collection":"control_collection",
[junit4] 2> "numShards":"1",
[junit4] 2> "core_node_name":"core_node1"}
[junit4] 2> 636871 T2935 oasc.DistributedQueue$LatchChildWatcher.process LatchChildWatcher fired on path: /overseer/queue state: SyncConnected type NodeChildrenChanged
[junit4] 2> 636972 T2935 oascc.ZkStateReader$2.process A cluster state change: WatchedEvent state:SyncConnected type:NodeDataChanged path:/clusterstate.json, has occurred - updating... (live nodes size: 1)
[junit4] 2> 636972 T2944 oascc.ZkStateReader$2.process A cluster state change: WatchedEvent state:SyncConnected type:NodeDataChanged path:/clusterstate.json, has occurred - updating... (live nodes size: 1)
[junit4] 2> 636974 T2911 oasc.AbstractFullDistribZkTestBase.createJettys create jetty 1
[junit4] 2> 636974 T2911 oejs.Server.doStart jetty-8.1.10.v20130312
[junit4] 2> 636977 T2911 oejus.SslContextFactory.doStart Enabled Protocols [SSLv2Hello, SSLv3, TLSv1, TLSv1.1, TLSv1.2] of [SSLv2Hello, SSLv3, TLSv1, TLSv1.1, TLSv1.2]
[junit4] 2> 636980 T2911 oejs.AbstractConnector.doStart Started SslSelectChannelConnector@127.0.0.1:57620
[junit4] 2> 636983 T2911 oass.SolrDispatchFilter.init SolrDispatchFilter.init()
[junit4] 2> 636983 T2911 oasc.SolrResourceLoader.locateSolrHome JNDI not configured for solr (NoInitialContextEx)
[junit4] 2> 636984 T2911 oasc.SolrResourceLoader.locateSolrHome using system property solr.solr.home: ./solr.cloud.AliasIntegrationTest-FFB4B510D6EAFD27-001/tempDir-003
[junit4] 2> 636985 T2911 oasc.SolrResourceLoader.<init> new SolrResourceLoader for directory: './solr.cloud.AliasIntegrationTest-FFB4B510D6EAFD27-001/tempDir-003/'
[junit4] 2> 637013 T2911 oasc.ConfigSolr.fromFile Loading container configuration from /mnt/ssd/jenkins/workspace/Lucene-Solr-4.x-Linux/solr/build/solr-core/test/J0/./solr.cloud.AliasIntegrationTest-FFB4B510D6EAFD27-001/tempDir-003/solr.xml
[junit4] 2> 637022 T2911 oasc.CoreContainer.<init> New CoreContainer 1326035
[junit4] 2> 637022 T2911 oasc.CoreContainer.load Loading cores into CoreContainer [instanceDir=./solr.cloud.AliasIntegrationTest-FFB4B510D6EAFD27-001/tempDir-003/]
[junit4] 2> 637023 T2911 oashc.HttpShardHandlerFactory.getParameter Setting socketTimeout to: 90000
[junit4] 2> 637023 T2911 oashc.HttpShardHandlerFactory.getParameter Setting urlScheme to:
[junit4] 2> 637023 T2911 oashc.HttpShardHandlerFactory.getParameter Setting connTimeout to: 15000
[junit4] 2> 637023 T2911 oashc.HttpShardHandlerFactory.getParameter Setting maxConnectionsPerHost to: 20
[junit4] 2> 637024 T2911 oashc.HttpShardHandlerFactory.getParameter Setting corePoolSize to: 0
[junit4] 2> 637024 T2911 oashc.HttpShardHandlerFactory.getParameter Setting maximumPoolSize to: 2147483647
[junit4] 2> 637024 T2911 oashc.HttpShardHandlerFactory.getParameter Setting maxThreadIdleTime to: 5
[junit4] 2> 637025 T2911 oashc.HttpShardHandlerFactory.getParameter Setting sizeOfQueue to: -1
[junit4] 2> 637025 T2911 oashc.HttpShardHandlerFactory.getParameter Setting fairnessPolicy to: false
[junit4] 2> 637027 T2911 oasl.LogWatcher.createWatcher SLF4J impl is org.slf4j.impl.Log4jLoggerFactory
[junit4] 2> 637027 T2911 oasl.LogWatcher.newRegisteredLogWatcher Registering Log Listener [Log4j (org.slf4j.impl.Log4jLoggerFactory)]
[junit4] 2> 637027 T2911 oasc.CoreContainer.load Host Name: 127.0.0.1
[junit4] 2> 637028 T2911 oasc.ZkContainer.initZooKeeper Zookeeper client=127.0.0.1:46104/solr
[junit4] 2> 637028 T2911 oasc.ZkController.checkChrootPath zkHost includes chroot
[junit4] 2> 637029 T2911 oascc.ConnectionManager.waitForConnected Waiting for client to connect to ZooKeeper
[junit4] 2> 637030 T2955 oascc.ConnectionManager.process Watcher org.apache.solr.common.cloud.ConnectionManager@6ca21c name:ZooKeeperConnection Watcher:127.0.0.1:46104 got event WatchedEvent state:SyncConnected type:None path:null path:null type:None
[junit4] 2> 637030 T2911 oascc.ConnectionManager.waitForConnected Client is connected to ZooKeeper
[junit4] 2> 637033 T2911 oascc.ConnectionManager.waitForConnected Waiting for client to connect to ZooKeeper
[junit4] 2> 637038 T2957 oascc.ConnectionManager.process Watcher org.apache.solr.common.cloud.ConnectionManager@b31564 name:ZooKeeperConnection Watcher:127.0.0.1:46104/solr got event WatchedEvent state:SyncConnected type:None path:null path:null type:None
[junit4] 2> 637038 T2911 oascc.ConnectionManager.waitForConnected Client is connected to ZooKeeper
[junit4] 2> 637048 T2911 oascc.ZkStateReader.createClusterStateWatchersAndUpdate Updating cluster state from ZooKeeper...
[junit4] 2> 638050 T2911 oasc.ZkController.createEphemeralLiveNode Register node as live in ZooKeeper:/live_nodes/127.0.0.1:57620__uw%2Fvb
[junit4] 2> 638052 T2911 oascc.SolrZkClient.makePath makePath: /live_nodes/127.0.0.1:57620__uw%2Fvb
[junit4] 2> 638055 T2944 oascc.ZkStateReader$3.process Updating live nodes... (2)
[junit4] 2> 638055 T2935 oascc.ZkStateReader$3.process Updating live nodes... (2)
[junit4] 2> 638055 T2957 oascc.ZkStateReader$3.process Updating live nodes... (2)
[junit4] 2> 638063 T2958 oasc.ZkController.publish publishing core=collection1 state=down collection=collection1
[junit4] 2> 638064 T2958 oasc.ZkController.publish numShards not found on descriptor - reading it from system property
[junit4] 2> 638065 T2935 oasc.DistributedQueue$LatchChildWatcher.process LatchChildWatcher fired on path: /overseer/queue state: SyncConnected type NodeChildrenChanged
[junit4] 2> 638065 T2958 oasc.ZkController.waitForCoreNodeName look for our core node name
[junit4] 2> 638065 T2935 oasc.DistributedQueue$LatchChildWatcher.process LatchChildWatcher fired on path: /overseer/queue state: SyncConnected type NodeChildrenChanged
[junit4] 2> 638066 T2935 oasc.DistributedQueue$LatchChildWatcher.process LatchChildWatcher fired on path: /overseer/queue state: SyncConnected type NodeChildrenChanged
[junit4] 2> 638068 T2936 oascc.ZkStateReader.updateClusterState Updating cloud state from ZooKeeper...
[junit4] 2> 638069 T2936 oasc.Overseer$ClusterStateUpdater.updateState Update state numShards=1 message={
[junit4] 2> "operation":"state",
[junit4] 2> "state":"down",
[junit4] 2> "base_url":"https://127.0.0.1:57620/_uw/vb",
[junit4] 2> "core":"collection1",
[junit4] 2> "roles":null,
[junit4] 2> "node_name":"127.0.0.1:57620__uw%2Fvb",
[junit4] 2> "shard":null,
[junit4] 2> "collection":"collection1",
[junit4] 2> "numShards":"1",
[junit4] 2> "core_node_name":null}
[junit4] 2> 638070 T2936 oasc.Overseer$ClusterStateUpdater.createCollection Create collection collection1 with shards [shard1]
[junit4] 2> 638070 T2936 oasc.Overseer$ClusterStateUpdater.updateState Assigning new node to shard shard=shard1
[junit4] 2> 638074 T2935 oasc.DistributedQueue$LatchChildWatcher.process LatchChildWatcher fired on path: /overseer/queue state: SyncConnected type NodeChildrenChanged
[junit4] 2> 638176 T2935 oascc.ZkStateReader$2.process A cluster state change: WatchedEvent state:SyncConnected type:NodeDataChanged path:/clusterstate.json, has occurred - updating... (live nodes size: 2)
[junit4] 2> 638177 T2957 oascc.ZkStateReader$2.process A cluster state change: WatchedEvent state:SyncConnected type:NodeDataChanged path:/clusterstate.json, has occurred - updating... (live nodes size: 2)
[junit4] 2> 638176 T2944 oascc.ZkStateReader$2.process A cluster state change: WatchedEvent state:SyncConnected type:NodeDataChanged path:/clusterstate.json, has occurred - updating... (live nodes size: 2)
[junit4] 2> 639066 T2958 oasc.ZkController.waitForShardId waiting to find shard id in clusterstate for collection1
[junit4] 2> 639066 T2958 oasc.ZkController.createCollectionZkNode Check for collection zkNode:collection1
[junit4] 2> 639068 T2958 oasc.ZkController.createCollectionZkNode Collection zkNode exists
[junit4] 2> 639068 T2958 oascc.ZkStateReader.readConfigName Load collection config from:/collections/collection1
[junit4] 2> 639069 T2958 oascc.ZkStateReader.readConfigName path=/collections/collection1 configName=conf1 specified config exists in ZooKeeper
[junit4] 2> 639070 T2958 oasc.SolrResourceLoader.<init> new SolrResourceLoader for directory: './solr.cloud.AliasIntegrationTest-FFB4B510D6EAFD27-001/tempDir-003/collection1/'
[junit4] 2> 639071 T2958 oasc.SolrResourceLoader.replaceClassLoader Adding 'file:/mnt/ssd/jenkins/workspace/Lucene-Solr-4.x-Linux/solr/build/solr-core/test/J0/solr.cloud.AliasIntegrationTest-FFB4B510D6EAFD27-001/tempDir-003/collection1/lib/.svn/' to classloader
[junit4] 2> 639072 T2958 oasc.SolrResourceLoader.replaceClassLoader Adding 'file:/mnt/ssd/jenkins/workspace/Lucene-Solr-4.x-Linux/solr/build/solr-core/test/J0/solr.cloud.AliasIntegrationTest-FFB4B510D6EAFD27-001/tempDir-003/collection1/lib/classes/' to classloader
[junit4] 2> 639073 T2958 oasc.SolrResourceLoader.replaceClassLoader Adding 'file:/mnt/ssd/jenkins/workspace/Lucene-Solr-4.x-Linux/solr/build/solr-core/test/J0/solr.cloud.AliasIntegrationTest-FFB4B510D6EAFD27-001/tempDir-003/collection1/lib/README' to classloader
[junit4] 2> 639106 T2958 oasc.SolrConfig.<init> Using Lucene MatchVersion: LUCENE_4_9
[junit4] 2> 639116 T2958 oasc.SolrConfig.<init> Loaded SolrConfig: solrconfig.xml
[junit4] 2> 639118 T2958 oass.IndexSchema.readSchema Reading Solr Schema from schema.xml
[junit4] 2> 639124 T2958 oass.IndexSchema.readSchema [collection1] Schema name=test
[junit4] 2> 639238 T2958 oass.ByteField.init WARN ByteField is deprecated and will be removed in 5.0. You should use TrieIntField instead.
[junit4] 2> 639238 T2958 oass.ShortField.init WARN ShortField is deprecated and will be removed in 5.0. You should use TrieIntField instead.
[junit4] 2> 639238 T2958 oass.OpenExchangeRatesOrgProvider.init Initialized with rates=open-exchange-rates.json, refreshInterval=1440.
[junit4] 2> 639243 T2958 oass.IndexSchema.readSchema default search field in schema is text
[junit4] 2> 639244 T2958 oass.IndexSchema.readSchema unique key field: id
[junit4] 2> 639261 T2958 oass.FileExchangeRateProvider.reload Reloading exchange rates from file currency.xml
[junit4] 2> 639264 T2958 oass.FileExchangeRateProvider.reload Reloading exchange rates from file currency.xml
[junit4] 2> 639268 T2958 oass.OpenExchangeRatesOrgProvider.reload Reloading exchange rates from open-exchange-rates.json
[junit4] 2> 639270 T2958 oass.OpenExchangeRatesOrgProvider$OpenExchangeRates.<init> WARN Unknown key IMPORTANT NOTE
[junit4] 2> 639270 T2958 oass.OpenExchangeRatesOrgProvider$OpenExchangeRates.<init> WARN Expected key, got STRING
[junit4] 2> 639270 T2958 oass.OpenExchangeRatesOrgProvider.reload Reloading exchange rates from open-exchange-rates.json
[junit4] 2> 639272 T2958 oass.OpenExchangeRatesOrgProvider$OpenExchangeRates.<init> WARN Unknown key IMPORTANT NOTE
[junit4] 2> 639273 T2958 oass.OpenExchangeRatesOrgProvider$OpenExchangeRates.<init> WARN Expected key, got STRING
[junit4] 2> 639273 T2958 oasc.CoreContainer.create Creating SolrCore 'collection1' using configuration from collection collection1
[junit4] 2> 639273 T2958 oasc.SolrCore.initDirectoryFactory org.apache.solr.core.MockDirectoryFactory
[junit4] 2> 639274 T2958 oasc.SolrCore.<init> [collection1] Opening new SolrCore at ./solr.cloud.AliasIntegrationTest-FFB4B510D6EAFD27-001/tempDir-003/collection1/, dataDir=./solr.cloud.AliasIntegrationTest-FFB4B510D6EAFD27-001/tempDir-001/jetty1/
[junit4] 2> 639274 T2958 oasc.JmxMonitoredMap.<init> JMX monitoring is enabled. Adding Solr mbeans to JMX Server: com.sun.jmx.mbeanserver.JmxMBeanServer@115b4c
[junit4] 2> 639275 T2958 oasc.CachingDirectoryFactory.get return new directory for ./solr.cloud.AliasIntegrationTest-FFB4B510D6EAFD27-001/tempDir-001/jetty1
[junit4] 2> 639276 T2958 oasc.SolrCore.getNewIndexDir New index directory detected: old=null new=./solr.cloud.AliasIntegrationTest-FFB4B510D6EAFD27-001/tempDir-001/jetty1/index/
[junit4] 2> 639276 T2958 oasc.SolrCore.initIndex WARN [collection1] Solr index directory './solr.cloud.AliasIntegrationTest-FFB4B510D6EAFD27-001/tempDir-001/jetty1/index' doesn't exist. Creating new index...
[junit4] 2> 639277 T2958 oasc.CachingDirectoryFactory.get return new directory for ./solr.cloud.AliasIntegrationTest-FFB4B510D6EAFD27-001/tempDir-001/jetty1/index
[junit4] 2> 639277 T2958 oasu.RandomMergePolicy.<init> RandomMergePolicy wrapping class org.apache.lucene.index.LogByteSizeMergePolicy: [LogByteSizeMergePolicy: minMergeSize=1677721, mergeFactor=25, maxMergeSize=2147483648, maxMergeSizeForForcedMerge=9223372036854775807, calibrateSizeByDeletes=false, maxMergeDocs=2147483647, maxCFSSegmentSizeMB=8.796093022207999E12, noCFSRatio=0.37450410636813114]
[junit4] 2> 639279 T2958 oasc.SolrDeletionPolicy.onCommit SolrDeletionPolicy.onCommit: commits: num=1
[junit4] 2> commit{dir=MockDirectoryWrapper(RAMDirectory@10482e0 lockFactory=org.apache.lucene.store.SingleInstanceLockFactory@1554904),segFN=segments_1,generation=1}
[junit4] 2> 639279 T2958 oasc.SolrDeletionPolicy.updateCommits newest commit generation = 1
[junit4] 2> 639285 T2958 oasup.UpdateRequestProcessorChain.init creating updateRequestProcessorChain "nodistrib"
[junit4] 2> 639285 T2958 oasup.UpdateRequestProcessorChain.init creating updateRequestProcessorChain "dedupe"
[junit4] 2> 639286 T2958 oasup.UpdateRequestProcessorChain.init inserting DistributedUpdateProcessorFactory into updateRequestProcessorChain "dedupe"
[junit4] 2> 639286 T2958 oasup.UpdateRequestProcessorChain.init creating updateRequestProcessorChain "stored_sig"
[junit4] 2> 639287 T2958 oasup.UpdateRequestProcessorChain.init inserting DistributedUpdateProcessorFactory into updateRequestProcessorChain "stored_sig"
[junit4] 2> 639287 T2958 oasup.UpdateRequestProcessorChain.init creating updateRequestProcessorChain "distrib-dup-test-chain-explicit"
[junit4] 2> 639289 T2958 oasup.UpdateRequestProcessorChain.init creating updateRequestProcessorChain "distrib-dup-test-chain-implicit"
[junit4] 2> 639289 T2958 oasup.UpdateRequestProcessorChain.init inserting DistributedUpdateProcessorFactory into updateRequestProcessorChain "distrib-dup-test-chain-implicit"
[junit4] 2> 639289 T2958 oasc.SolrCore.loadUpdateProcessorChains no updateRequestProcessorChain defined as default, creating implicit default
[junit4] 2> 639291 T2958 oasc.RequestHandlers.initHandlersFromConfig created standard: solr.StandardRequestHandler
[junit4] 2> 639292 T2958 oasc.RequestHandlers.initHandlersFromConfig created /get: solr.RealTimeGetHandler
[junit4] 2> 639292 T2958 oasc.RequestHandlers.initHandlersFromConfig adding lazy requestHandler: solr.ReplicationHandler
[junit4] 2> 639293 T2958 oasc.RequestHandlers.initHandlersFromConfig created /replication: solr.ReplicationHandler
[junit4] 2> 639293 T2958 oasc.RequestHandlers.initHandlersFromConfig created /update: solr.UpdateRequestHandler
[junit4] 2> 639293 T2958 oasc.RequestHandlers.initHandlersFromConfig created /admin/: org.apache.solr.handler.admin.AdminHandlers
[junit4] 2> 639294 T2958 oasc.RequestHandlers.initHandlersFromConfig created /admin/file: solr.admin.ShowFileRequestHandler
[junit4] 2> 639296 T2958 oashl.XMLLoader.init xsltCacheLifetimeSeconds=60
[junit4] 2> 639297 T2958 oasu.CommitTracker.<init> Hard AutoCommit: disabled
[junit4] 2> 639297 T2958 oasu.CommitTracker.<init> Soft AutoCommit: disabled
[junit4] 2> 639298 T2958 oasu.RandomMergePolicy.<init> RandomMergePolicy wrapping class org.apache.lucene.index.LogByteSizeMergePolicy: [LogByteSizeMergePolicy: minMergeSize=1677721, mergeFactor=11, maxMergeSize=2147483648, maxMergeSizeForForcedMerge=9223372036854775807, calibrateSizeByDeletes=true, maxMergeDocs=2147483647, maxCFSSegmentSizeMB=8.796093022207999E12, noCFSRatio=0.5747052978639718]
[junit4] 2> 639298 T2958 oasc.SolrDeletionPolicy.onInit SolrDeletionPolicy.onInit: commits: num=1
[junit4] 2> commit{dir=MockDirectoryWrapper(RAMDirectory@10482e0 lockFactory=org.apache.lucene.store.SingleInstanceLockFactory@1554904),segFN=segments_1,generation=1}
[junit4] 2> 639298 T2958 oasc.SolrDeletionPolicy.updateCommits newest commit generation = 1
[junit4] 2> 639299 T2958 oass.SolrIndexSearcher.<init> Opening Searcher@51a54d[collection1] main
[junit4] 2> 639299 T2958 oascc.ZkStateReader.readConfigName Load collection config from:/collections/collection1
[junit4] 2> 639300 T2958 oascc.ZkStateReader.readConfigName path=/collections/collection1 configName=conf1 specified config exists in ZooKeeper
[junit4] 2> 639300 T2958 oasr.ManagedResourceStorage.newStorageIO Setting up ZooKeeper-based storage for the RestManager with znodeBase: /configs/conf1
[junit4] 2> 639301 T2958 oasr.ManagedResourceStorage$ZooKeeperStorageIO.configure Configured ZooKeeperStorageIO with znodeBase: /configs/conf1
[junit4] 2> 639301 T2958 oasr.RestManager.init Initializing RestManager with initArgs: {}
[junit4] 2> 639301 T2958 oasr.ManagedResourceStorage.load Reading _rest_managed.json using ZooKeeperStorageIO:path=/configs/conf1
[junit4] 2> 639302 T2958 oasr.ManagedResourceStorage$ZooKeeperStorageIO.openInputStream No data found for znode /configs/conf1/_rest_managed.json
[junit4] 2> 639302 T2958 oasr.ManagedResourceStorage.load Loaded null at path _rest_managed.json using ZooKeeperStorageIO:path=/configs/conf1
[junit4] 2> 639302 T2958 oasr.ManagedResource.notifyObserversDuringInit WARN No registered observers for /rest/managed
[junit4] 2> 639302 T2958 oasr.RestManager.init Initializing 0 registered ManagedResources
[junit4] 2> 639306 T2959 oasc.SolrCore.registerSearcher [collection1] Registered new searcher Searcher@51a54d[collection1] main{StandardDirectoryReader(segments_1:1:nrt)}
[junit4] 2> 639308 T2958 oasc.CoreContainer.registerCore registering core: collection1
[junit4] 2> 639309 T2962 oasc.ZkController.register Register replica - core:collection1 address:https://127.0.0.1:57620/_uw/vb collection:collection1 shard:shard1
[junit4] 2> 639310 T2911 oass.SolrDispatchFilter.init user.dir=/mnt/ssd/jenkins/workspace/Lucene-Solr-4.x-Linux/solr/build/solr-core/test/J0
[junit4] 2> 639311 T2911 oass.SolrDispatchFilter.init SolrDispatchFilter.init() done
[junit4] 2> 639311 T2962 oascc.SolrZkClient.makePath makePath: /collections/collection1/leader_elect/shard1/election
[junit4] 2> 639318 T2962 oasc.ShardLeaderElectionContext.runLeaderProcess Running the leader process for shard shard1
[junit4] 2> 639320 T2935 oasc.DistributedQueue$LatchChildWatcher.process LatchChildWatcher fired on path: /overseer/queue state: SyncConnected type NodeChildrenChanged
[junit4] 2> 639320 T2935 oasc.DistributedQueue$LatchChildWatcher.process LatchChildWatcher fired on path: /overseer/queue state: SyncConnected type NodeChildrenChanged
[junit4] 2> 639320 T2962 oasc.ShardLeaderElectionContext.waitForReplicasToComeUp Enough replicas found to continue.
[junit4] 2> 639321 T2935 oasc.DistributedQueue$LatchChildWatcher.process LatchChildWatcher fired on path: /overseer/queue state: SyncConnected type NodeChildrenChanged
[junit4] 2> 639321 T2962 oasc.ShardLeaderElectionContext.runLeaderProcess I may be the new leader - try and sync
[junit4] 2> ASYNC NEW_CORE C464 name=collection1 org.apache.solr.core.SolrCore@b5b81f url=https://127.0.0.1:57620/_uw/vb/collection1 node=127.0.0.1:57620__uw%2Fvb C464_STATE=coll:collection1 core:collection1 props:{state=down, base_url=https://127.0.0.1:57620/_uw/vb, core=collection1, node_name=127.0.0.1:57620__uw%2Fvb}
[junit4] 2> 639321 T2962 C464 P57620 oasc.SyncStrategy.sync Sync replicas to https://127.0.0.1:57620/_uw/vb/collection1/
[junit4] 2> 639322 T2936 oascc.ZkStateReader.updateClusterState Updating cloud state from ZooKeeper...
[junit4] 2> 639322 T2962 C464 P57620 oasc.SyncStrategy.syncReplicas Sync Success - now sync replicas to me
[junit4] 2> 639322 T2962 C464 P57620 oasc.SyncStrategy.syncToMe https://127.0.0.1:57620/_uw/vb/collection1/ has no replicas
[junit4] 2> 639323 T2962 oasc.ShardLeaderElectionContext.runLeaderProcess I am the new leader: https://127.0.0.1:57620/_uw/vb/collection1/ shard1
[junit4] 2> 639323 T2962 oascc.SolrZkClient.makePath makePath: /collections/collection1/leaders/shard1
[junit4] 2> 639324 T2935 oasc.DistributedQueue$LatchChildWatcher.process LatchChildWatcher fired on path: /overseer/queue state: SyncConnected type NodeChildrenChanged
[junit4] 2> 639328 T2935 oasc.DistributedQueue$LatchChildWatcher.process LatchChildWatcher fired on path: /overseer/queue state: SyncConnected type NodeChildrenChanged
[junit4] 2> 639330 T2935 oasc.DistributedQueue$LatchChildWatcher.process LatchChildWatcher fired on path: /overseer/queue state: SyncConnected type NodeChildrenChanged
[junit4] 2> 639432 T2944 oascc.ZkStateReader$2.process A cluster state change: WatchedEvent state:SyncConnected type:NodeDataChanged path:/clusterstate.json, has occurred - updating... (live nodes size: 2)
[junit4] 2> 639433 T2935 oascc.ZkStateReader$2.process A cluster state change: WatchedEvent state:SyncConnected type:NodeDataChanged path:/clusterstate.json, has occurred - updating... (live nodes size: 2)
[junit4] 2> 639432 T2957 oascc.ZkStateReader$2.process A cluster state change: WatchedEvent state:SyncConnected type:NodeDataChanged path:/clusterstate.json, has occurred - updating... (live nodes size: 2)
[junit4] 2> 639479 T2962 oasc.ZkController.register We are https://127.0.0.1:57620/_uw/vb/collection1/ and leader is https://127.0.0.1:57620/_uw/vb/collection1/
[junit4] 2> 639479 T2962 oasc.ZkController.register No LogReplay needed for core=collection1 baseURL=https://127.0.0.1:57620/_uw/vb
[junit4] 2> 639479 T2962 oasc.ZkController.checkRecovery I am the leader, no recovery necessary
[junit4] 2> 639480 T2962 oasc.ZkController.publish publishing core=collection1 state=active collection=collection1
[junit4] 2> 639480 T2962 oasc.ZkController.publish numShards not found on descriptor - reading it from system property
[junit4] 2> 639482 T2935 oasc.DistributedQueue$LatchChildWatcher.process LatchChildWatcher fired on path: /overseer/queue state: SyncConnected type NodeChildrenChanged
[junit4] 2> 639482 T2935 oasc.DistributedQueue$LatchChildWatcher.process LatchChildWatcher fired on path: /overseer/queue state: SyncConnected type NodeChildrenChanged
[junit4] 2> 639482 T2935 oasc.DistributedQueue$LatchChildWatcher.process LatchChildWatcher fired on path: /overseer/queue state: SyncConnected type NodeChildrenChanged
[junit4] 2> 639482 T2962 oascc.ZkStateReader.updateClusterState Updating cloud state from ZooKeeper...
[junit4] 2> 639483 T2936 oascc.ZkStateReader.updateClusterState Updating cloud state from ZooKeeper...
[junit4] 2> 639484 T2936 oasc.Overseer$ClusterStateUpdater.updateState Update state numShards=1 message={
[junit4] 2> "operation":"state",
[junit4] 2> "state":"active",
[junit4] 2> "base_url":"https://127.0.0.1:57620/_uw/vb",
[junit4] 2> "core":"collection1",
[junit4] 2> "roles":null,
[junit4] 2> "node_name":"127.0.0.1:57620__uw%2Fvb",
[junit4] 2> "shard":"shard1",
[junit4] 2> "collection":"collection1",
[junit4] 2> "numShards":"1",
[junit4] 2> "core_node_name":"core_node1"}
[junit4] 2> 639486 T2935 oasc.DistributedQueue$LatchChildWatcher.process LatchChildWatcher fired on path: /overseer/queue state: SyncConnected type NodeChildrenChanged
[junit4] 2> 639584 T2911 oasc.AbstractFullDistribZkTestBase.createJettys create jetty 2
[junit4] 2> 639585 T2911 oejs.Server.doStart jetty-8.1.10.v20130312
[junit4] 2> 639587 T2944 oascc.ZkStateReader$2.process A cluster state change: WatchedEvent state:SyncConnected type:NodeDataChanged path:/clusterstate.json, has occurred - updating... (live nodes size: 2)
[junit4] 2> 639588 T2911 oejus.SslContextFactory.doStart Enabled Protocols [SSLv2Hello, SSLv3, TLSv1, TLSv1.1, TLSv1.2] of [SSLv2Hello, SSLv3, TLSv1, TLSv1.1, TLSv1.2]
[junit4] 2> 639587 T2935 oascc.ZkStateReader$2.process A cluster state change: WatchedEvent state:SyncConnected type:NodeDataChanged path:/clusterstate.json, has occurred - updating... (live nodes size: 2)
[junit4] 2> 639587 T2957 oascc.ZkStateReader$2.process A cluster state change: WatchedEvent state:SyncConnected type:NodeDataChanged path:/clusterstate.json, has occurred - updating... (live nodes size: 2)
[junit4] 2> 639589 T2911 oejs.AbstractConnector.doStart Started SslSelectChannelConnector@127.0.0.1:33554
[junit4] 2> 639592 T2911 oass.SolrDispatchFilter.init SolrDispatchFilter.init()
[junit4] 2> 639593 T2911 oasc.SolrResourceLoader.locateSolrHome JNDI not configured for solr (NoInitialContextEx)
[junit4] 2> 639593 T2911 oasc.SolrResourceLoader.locateSolrHome using system property solr.solr.home: ../../../../../../../../../../mnt/ssd/jenkins/workspace/Lucene-Solr-4.x-Linux/solr/build/solr-core/test/J0/./solr.cloud.AliasIntegrationTest-FFB4B510D6EAFD27-001/tempDir-004
[junit4] 2> 639594 T2911 oasc.SolrResourceLoader.<init> new SolrResourceLoader for directory: '../../../../../../../../../../mnt/ssd/jenkins/workspace/Lucene-Solr-4.x-Linux/solr/build/solr-core/test/J0/./solr.cloud.AliasIntegrationTest-FFB4B510D6EAFD27-001/tempDir-004/'
[junit4] 2> 639615 T2911 oasc.ConfigSolr.fromFile Loading container configuration from /mnt/ssd/jenkins/workspace/Lucene-Solr-4.x-Linux/solr/build/solr-core/test/J0/../../../../../../../../../../mnt/ssd/jenkins/workspace/Lucene-Solr-4.x-Linux/solr/build/solr-core/test/J0/./solr.cloud.AliasIntegrationTest-FFB4B510D6EAFD27-001/tempDir-004/solr.xml
[junit4] 2> 639624 T2911 oasc.CoreContainer.<init> New CoreContainer 12867396
[junit4] 2> 639624 T2911 oasc.CoreContainer.load Loading cores into CoreContainer [instanceDir=../../../../../../../../../../mnt/ssd/jenkins/workspace/Lucene-Solr-4.x-Linux/solr/build/solr-core/test/J0/./solr.cloud.AliasIntegrationTest-FFB4B510D6EAFD27-001/tempDir-004/]
[junit4] 2> 639625 T2911 oashc.HttpShardHandlerFactory.getParameter Setting socketTimeout to: 90000
[junit4] 2> 639625 T2911 oashc.HttpShardHandlerFactory.getParameter Setting urlScheme to:
[junit4] 2> 639625 T2911 oashc.HttpShardHandlerFactory.getParameter Setting connTimeout to: 15000
[junit4] 2> 639626 T2911 oashc.HttpShardHandlerFactory.getParameter Setting maxConnectionsPerHost to: 20
[junit4] 2> 639626 T2911 oashc.HttpShardHandlerFactory.getParameter Setting corePoolSize to: 0
[junit4] 2> 639626 T2911 oashc.HttpShardHandlerFactory.getParameter Setting maximumPoolSize to: 2147483647
[junit4] 2> 639627 T2911 oashc.HttpShardHandlerFactory.getParameter Setting maxThreadIdleTime to: 5
[junit4] 2> 639627 T2911 oashc.HttpShardHandlerFactory.getParameter Setting sizeOfQueue to: -1
[junit4] 2> 639627 T2911 oashc.HttpShardHandlerFactory.getParameter Setting fairnessPolicy to: false
[junit4] 2> 639629 T2911 oasl.LogWatcher.createWatcher SLF4J impl is org.slf4j.impl.Log4jLoggerFactory
[junit4] 2> 639629 T2911 oasl.LogWatcher.newRegisteredLogWatcher Registering Log Listener [Log4j (org.slf4j.impl.Log4jLoggerFactory)]
[junit4] 2> 639630 T2911 oasc.CoreContainer.load Host Name: 127.0.0.1
[junit4] 2> 639630 T2911 oasc.ZkContainer.initZooKeeper Zookeeper client=127.0.0.1:46104/solr
[junit4] 2> 639630 T2911 oasc.ZkController.checkChrootPath zkHost includes chroot
[junit4] 2> 639631 T2911 oascc.ConnectionManager.waitForConnected Waiting for client to connect to ZooKeeper
[junit4] 2> 639633 T2973 oascc.ConnectionManager.process Watcher org.apache.solr.common.cloud.ConnectionManager@11b1268 name:ZooKeeperConnection Watcher:127.0.0.1:46104 got event WatchedEvent state:SyncConnected type:None path:null path:null type:None
[junit4] 2> 639633 T2911 oascc.ConnectionManager.waitForConnected Client is connected to ZooKeeper
[junit4] 2> 639636 T2911 oascc.ConnectionManager.waitForConnected Waiting for client to connect to ZooKeeper
[junit4] 2> 639638 T2975 oascc.ConnectionManager.process Watcher org.apache.solr.common.cloud.ConnectionManager@103e884 name:ZooKeeperConnection Watcher:127.0.0.1:46104/solr got event WatchedEvent state:SyncConnected type:None path:null path:null type:None
[junit4] 2> 639638 T2911 oascc.ConnectionManager.waitForConnected Client is connected to ZooKeeper
[junit4] 2> 639653 T2911 oascc.ZkStateReader.createClusterStateWatchersAndUpdate Updating cluster state from ZooKeeper...
[junit4] 2> 640656 T2911 oasc.ZkController.createEphemeralLiveNode Register node as live in ZooKeeper:/live_nodes/127.0.0.1:33554__uw%2Fvb
[junit4] 2> 640658 T2911 oascc.SolrZkClient.makePath makePath: /live_nodes/127.0.0.1:33554__uw%2Fvb
[junit4] 2> 640661 T2944 oascc.ZkStateReader$3.process Updating live nodes... (3)
[junit4] 2> 640661 T2975 oascc.ZkStateReader$3.process Updating live nodes... (3)
[junit4] 2> 640661 T2957 oascc.ZkStateReader$3.process Updating live nodes... (3)
[junit4] 2> 640661 T2935 oascc.ZkStateReader$3.process Updating live nodes... (3)
[junit4] 2> 640669 T2976 oasc.ZkController.publish publishing core=collection1 state=down collection=collection1
[junit4] 2> 640669 T2976 oasc.ZkController.publish numShards not found on descriptor - reading it from system property
[junit4] 2> 640671 T2935 oasc.DistributedQueue$LatchChildWatcher.process LatchChildWatcher fired on path: /overseer/queue state: SyncConnected type NodeChildrenChanged
[junit4] 2> 640671 T2935 oasc.DistributedQueue$LatchChildWatcher.process LatchChildWatcher fired on path: /overseer/queue state: SyncConnected type NodeChildrenChanged
[junit4] 2> 640671 T2976 oasc.ZkController.waitForCoreNodeName look for our core node name
[junit4] 2> 640672 T2935 oasc.DistributedQueue$LatchChildWatcher.process LatchChildWatcher fired on path: /overseer/queue state: SyncConnected type NodeChildrenChanged
[junit4] 2> 640674 T2936 oascc.ZkStateReader.updateClusterState Updating cloud state from ZooKeeper...
[junit4] 2> 640675 T2936 oasc.Overseer$ClusterStateUpdater.updateState Update state numShards=1 message={
[junit4] 2> "operation":"state",
[junit4] 2> "state":"down",
[junit4] 2> "base_url":"https://127.0.0.1:33554/_uw/vb",
[junit4] 2> "core":"collection1",
[junit4] 2> "roles":null,
[junit4] 2> "node_name":"127.0.0.1:33554__uw%2Fvb",
[junit4] 2> "shard":null,
[junit4] 2> "collection":"collection1",
[junit4] 2> "numShards":"1",
[junit4] 2> "core_node_name":null}
[junit4] 2> 640676 T2936 oasc.Overseer$ClusterStateUpdater.updateState Collection already exists with numShards=1
[junit4] 2> 640676 T2936 oasc.Overseer$ClusterStateUpdater.updateState Assigning new node to shard shard=shard1
[junit4] 2> 640679 T2935 oasc.DistributedQueue$LatchChildWatcher.process LatchChildWatcher fired on path: /overseer/queue state: SyncConnected type NodeChildrenChanged
[junit4] 2> 640782 T2935 oascc.ZkStateReader$2.process A cluster state change: WatchedEvent state:SyncConnected type:NodeDataChanged path:/clusterstate.json, has occurred - updating... (live nodes size: 3)
[junit4] 2> 640783 T2944 oascc.ZkStateReader$2.process A cluster state change: WatchedEvent state:SyncConnected type:NodeDataChanged path:/clusterstate.json, has occurred - updating... (live nodes size: 3)
[junit4] 2> 640782 T2975 oascc.ZkStateReader$2.process A cluster state change: WatchedEvent state:SyncConnected type:NodeDataChanged path:/clusterstate.json, has occurred - updating... (live nodes size: 3)
[junit4] 2> 640783 T2957 oascc.ZkStateReader$2.process A cluster state change: WatchedEvent state:SyncConnected type:NodeDataChanged path:/clusterstate.json, has occurred - updating... (live nodes size: 3)
[junit4] 2> 641673 T2976 oasc.ZkController.waitForShardId waiting to find shard id in clusterstate for collection1
[junit4] 2> 641673 T2976 oasc.ZkController.createCollectionZkNode Check for collection zkNode:collection1
[junit4] 2> 641674 T2976 oasc.ZkController.createCollectionZkNode Collection zkNode exists
[junit4] 2> 641675 T2976 oascc.ZkStateReader.readConfigName Load collection config from:/collections/collection1
[junit4] 2> 641677 T2976 oascc.ZkStateReader.readConfigName path=/collections/collection1 configName=conf1 specified config exists in ZooKeeper
[junit4] 2> 641677 T2976 oasc.SolrResourceLoader.<init> new SolrResourceLoader for directory: '../../../../../../../../../../mnt/ssd/jenkins/workspace/Lucene-Solr-4.x-Linux/solr/build/solr-core/test/J0/./solr.cloud.AliasIntegrationTest-FFB4B510D6EAFD27-001/tempDir-004/collection1/'
[junit4] 2> 641678 T2976 oasc.SolrResourceLoader.replaceClassLoader Adding 'file:/mnt/ssd/jenkins/workspace/Lucene-Solr-4.x-Linux/solr/build/solr-core/test/J0/solr.cloud.AliasIntegrationTest-FFB4B510D6EAFD27-001/tempDir-004/collection1/lib/.svn/' to classloader
[junit4] 2> 641679 T2976 oasc.SolrResourceLoader.replaceClassLoader Adding 'file:/mnt/ssd/jenkins/workspace/Lucene-Solr-4.x-Linux/solr/build/solr-core/test/J0/solr.cloud.AliasIntegrationTest-FFB4B510D6EAFD27-001/tempDir-004/collection1/lib/classes/' to classloader
[junit4] 2> 641680 T2976 oasc.SolrResourceLoader.replaceClassLoader Adding 'file:/mnt/ssd/jenkins/workspace/Lucene-Solr-4.x-Linux/solr/build/solr-core/test/J0/solr.cloud.AliasIntegrationTest-FFB4B510D6EAFD27-001/tempDir-004/collection1/lib/README' to classloader
[junit4] 2> 641708 T2976 oasc.SolrConfig.<init> Using Lucene MatchVersion: LUCENE_4_9
[junit4] 2> 641718 T2976 oasc.SolrConfig.<init> Loaded SolrConfig: solrconfig.xml
[junit4] 2> 641720 T2976 oass.IndexSchema.readSchema Reading Solr Schema from schema.xml
[junit4] 2> 641725 T2976 oass.IndexSchema.readSchema [collection1] Schema name=test
[junit4] 2> 641844 T2976 oass.ByteField.init WARN ByteField is deprecated and will be removed in 5.0. You should use TrieIntField instead.
[junit4] 2> 641844 T2976 oass.ShortField.init WARN ShortField is deprecated and will be removed in 5.0. You should use TrieIntField instead.
[junit4] 2> 641845 T2976 oass.OpenExchangeRatesOrgProvider.init Initialized with rates=open-exchange-rates.json, refreshInterval=1440.
[junit4] 2> 641849 T2976 oass.IndexSchema.readSchema default search field in schema is text
[junit4] 2> 641850 T2976 oass.IndexSchema.readSchema unique key field: id
[junit4] 2> 641860 T2976 oass.FileExchangeRateProvider.reload Reloading exchange rates from file currency.xml
[junit4] 2> 641863 T2976 oass.FileExchangeRateProvider.reload Reloading exchange rates from file currency.xml
[junit4] 2> 641865 T2976 oass.OpenExchangeRatesOrgProvider.reload Reloading exchange rates from open-exchange-rates.json
[junit4] 2> 641866 T2976 oass.OpenExchangeRatesOrgProvider$OpenExchangeRates.<init> WARN Unknown key IMPORTANT NOTE
[junit4] 2> 641866 T2976 oass.OpenExchangeRatesOrgProvider$OpenExchangeRates.<init> WARN Expected key, got STRING
[junit4] 2> 641866 T2976 oass.OpenExchangeRatesOrgProvider.reload Reloading exchange rates from open-exchange-rates.json
[junit4] 2> 641867 T2976 oass.OpenExchangeRatesOrgProvider$OpenExchangeRates.<init> WARN Unknown key IMPORTANT NOTE
[junit4] 2> 641867 T2976 oass.OpenExchangeRatesOrgProvider$OpenExchangeRates.<init> WARN Expected key, got STRING
[junit4] 2> 641868 T2976 oasc.CoreContainer.create Creating SolrCore 'collection1' using configuration from collection collection1
[junit4] 2> 641868 T2976 oasc.SolrCore.initDirectoryFactory org.apache.solr.core.MockDirectoryFactory
[junit4] 2> 641868 T2976 oasc.SolrCore.<init> [collection1] Opening new SolrCore at ../../../../../../../../../../mnt/ssd/jenkins/workspace/Lucene-Solr-4.x-Linux/solr/build/solr-core/test/J0/./solr.cloud.AliasIntegrationTest-FFB4B510D6EAFD27-001/tempDir-004/collection1/, dataDir=./solr.cloud.AliasIntegrationTest-FFB4B510D6EAFD27-001/tempDir-001/jetty2/
[junit4] 2> 641868 T2976 oasc.JmxMonitoredMap.<init> JMX monitoring is enabled. Adding Solr mbeans to JMX Server: com.sun.jmx.mbeanserver.JmxMBeanServer@115b4c
[junit4] 2> 641870 T2976 oasc.CachingDirectoryFactory.get return new directory for ./solr.cloud.AliasIntegrationTest-FFB4B510D6EAFD27-001/tempDir-001/jetty2
[junit4] 2> 641870 T2976 oasc.SolrCore.getNewIndexDir New index directory detected: old=null new=./solr.cloud.AliasIntegrationTest-FFB4B510D6EAFD27-001/tempDir-001/jetty2/index/
[junit4] 2> 641870 T2976 oasc.SolrCore.initIndex WARN [collection1] Solr index directory './solr.cloud.AliasIntegrationTest-FFB4B510D6EAFD27-001/tempDir-001/jetty2/index' doesn't exist. Creating new index...
[junit4] 2> 641870 T2976 oasc.CachingDirectoryFactory.get return new directory for ./solr.cloud.AliasIntegrationTest-FFB4B510D6EAFD27-001/tempDir-001/jetty2/index
[junit4] 2> 641871 T2976 oasu.RandomMergePolicy.<init> RandomMergePolicy wrapping class org.apache.lucene.index.LogByteSizeMergePolicy: [LogByteSizeMergePolicy: minMergeSize=1677721, mergeFactor=25, maxMergeSize=2147483648, maxMergeSizeForForcedMerge=9223372036854775807, calibrateSizeByDeletes=false, maxMergeDocs=2147483647, maxCFSSegmentSizeMB=8.796093022207999E12, noCFSRatio=0.37450410636813114]
[junit4] 2> 641871 T2976 oasc.SolrDeletionPolicy.onCommit SolrDeletionPolicy.onCommit: commits: num=1
[junit4] 2> commit{dir=MockDirectoryWrapper(RAMDirectory@51b43d lockFactory=org.apache.lucene.store.SingleInstanceLockFactory@154276f),segFN=segments_1,generation=1}
[junit4] 2> 641872 T2976 oasc.SolrDeletionPolicy.updateCommits newest commit generation = 1
[junit4] 2> 641875 T2976 oasup.UpdateRequestProcessorChain.init creating updateRequestProcessorChain "nodistrib"
[junit4] 2> 641875 T2976 oasup.UpdateRequestProcessorChain.init creating updateRequestProcessorChain "dedupe"
[junit4] 2> 641875 T2976 oasup.UpdateRequestProcessorChain.init inserting DistributedUpdateProcessorFactory into updateRequestProcessorChain "dedupe"
[junit4] 2> 641875 T2976 oasup.UpdateRequestProcessorChain.init creating updateRequestProcessorChain "stored_sig"
[junit4] 2> 641876 T2976 oasup.UpdateRequestProcessorChain.init inserting DistributedUpdateProcessorFactory into updateRequestProcessorChain "stored_sig"
[junit4] 2> 641876 T2976 oasup.UpdateRequestProcessorChain.init creating updateRequestProcessorChain "distrib-dup-test-chain-explicit"
[junit4] 2> 641876 T2976 oasup.UpdateRequestProcessorChain.init creating updateRequestProcessorChain "distrib-dup-test-chain-implicit"
[junit4] 2> 641877 T2976 oasup.UpdateRequestProcessorChain.init inserting DistributedUpdateProcessorFactory into updateRequestProcessorChain "distrib-dup-test-chain-implicit"
[junit4] 2> 641877 T2976 oasc.SolrCore.loadUpdateProcessorChains no updateRequestProcessorChain defined as default, creating implicit default
[junit4] 2> 641878 T2976 oasc.RequestHandlers.initHandlersFromConfig created standard: solr.StandardRequestHandler
[junit4] 2> 641878 T2976 oasc.RequestHandlers.initHandlersFromConfig created /get: solr.RealTimeGetHandler
[junit4] 2> 641879 T2976 oasc.RequestHandlers.initHandlersFromConfig adding lazy requestHandler: solr.ReplicationHandler
[junit4] 2> 641879 T2976 oasc.RequestHandlers.initHandlersFromConfig created /replication: solr.ReplicationHandler
[junit4] 2> 641880 T2976 oasc.RequestHandlers.initHandlersFromConfig created /update: solr.UpdateRequestHandler
[junit4] 2> 641880 T2976 oasc.RequestHandlers.initHandlersFromConfig created /admin/: org.apache.solr.handler.admin.AdminHandlers
[junit4] 2> 641881 T2976 oasc.RequestHandlers.initHandlersFromConfig created /admin/file: solr.admin.ShowFileRequestHandler
[junit4] 2> 641883 T2976 oashl.XMLLoader.init xsltCacheLifetimeSeconds=60
[junit4] 2> 641884 T2976 oasu.CommitTracker.<init> Hard AutoCommit: disabled
[junit4] 2> 641884 T2976 oasu.CommitTracker.<init> Soft AutoCommit: disabled
[junit4] 2> 641885 T2976 oasu.RandomMergePolicy.<init> RandomMergePolicy wrapping class org.apache.lucene.index.LogByteSizeMergePolicy: [LogByteSizeMergePolicy: minMergeSize=1677721, mergeFactor=11, maxMergeSize=2147483648, maxMergeSizeForForcedMerge=9223372036854775807, calibrateSizeByDeletes=true, maxMergeDocs=2147483647, maxCFSSegmentSizeMB=8.796093022207999E12, noCFSRatio=0.5747052978639718]
[junit4] 2> 641886 T2976 oasc.SolrDeletionPolicy.onInit SolrDeletionPolicy.onInit: commits: num=1
[junit4] 2> commit{dir=MockDirectoryWrapper(RAMDirectory@51b43d lockFactory=org.apache.lucene.store.SingleInstanceLockFactory@154276f),segFN=segments_1,generation=1}
[junit4] 2> 641886 T2976 oasc.SolrDeletionPolicy.updateCommits newest commit generation = 1
[junit4] 2> 641886 T2976 oass.SolrIndexSearcher.<init> Opening Searcher@1979e5d[collection1] main
[junit4] 2> 641887 T2976 oascc.ZkStateReader.readConfigName Load collection config from:/collections/collection1
[junit4] 2> 641888 T2976 oascc.ZkStateReader.readConfigName path=/collections/collection1 configName=conf1 specified config exists in ZooKeeper
[junit4] 2> 641888 T2976 oasr.ManagedResourceStorage.newStorageIO Setting up ZooKeeper-based storage for the RestManager with znodeBase: /configs/conf1
[junit4] 2> 641888 T2976 oasr.ManagedResourceStorage$ZooKeeperStorageIO.configure Configured ZooKeeperStorageIO with znodeBase: /configs/conf1
[junit4] 2> 641889 T2976 oasr.RestManager.init Initializing RestManager with initArgs: {}
[junit4] 2> 641889 T2976 oasr.ManagedResourceStorage.load Reading _rest_managed.json using ZooKeeperStorageIO:path=/configs/conf1
[junit4] 2> 641890 T2976 oasr.ManagedResourceStorage$ZooKeeperStorageIO.openInputStream No data found for znode /configs/conf1/_rest_managed.json
[junit4] 2> 641890 T2976 oasr.ManagedResourceStorage.load Loaded null at path _rest_managed.json using ZooKeeperStorageIO:path=/configs/conf1
[junit4] 2> 641890 T2976 oasr.ManagedResource.notifyObserversDuringInit WARN No registered observers for /rest/managed
[junit4] 2> 641890 T2976 oasr.RestManager.init Initializing 0 registered ManagedResources
[junit4] 2> 641895 T2977 oasc.SolrCore.registerSearcher [collection1] Registered new searcher Searcher@1979e5d[collection1] main{StandardDirectoryReader(segments_1:1:nrt)}
[junit4] 2> 641898 T2976 oasc.CoreContainer.registerCore registering core: collection1
[junit4] 2> 641899 T2980 oasc.ZkController.register Register replica - core:collection1 address:https://127.0.0.1:33554/_uw/vb collection:collection1 shard:shard1
[junit4] 2> 641899 T2911 oass.SolrDispatchFilter.init user.dir=/mnt/ssd/jenkins/workspace/Lucene-Solr-4.x-Linux/solr/build/solr-core/test/J0
[junit4] 2> 641900 T2911 oass.SolrDispatchFilter.init SolrDispatchFilter.init() done
[junit4] 2> 641902 T2980 oasc.ZkController.register We are https://127.0.0.1:33554/_uw/vb/collection1/ and leader is https://127.0.0.1:57620/_uw/vb/collection1/
[junit4] 2> 641903 T2980 oasc.ZkController.register No LogReplay needed for core=collection1 baseURL=https://127.0.0.1:33554/_uw/vb
[junit4] 2> 641903 T2980 oasc.ZkController.checkRecovery Core needs to recover:collection1
[junit4] 2> 641903 T2980 oasu.DefaultSolrCoreState.doRecovery Running recovery - first canceling any ongoing recovery
[junit4] 2> ASYNC NEW_CORE C465 name=collection1 org.apache.solr.core.SolrCore@792efb url=https://127.0.0.1:33554/_uw/vb/collection1 node=127.0.0.1:33554__uw%2Fvb C465_STATE=coll:collection1 core:collection1 props:{state=down, base_url=https://127.0.0.1:33554/_uw/vb, core=collection1, node_name=127.0.0.1:33554__uw%2Fvb}
[junit4] 2> 641904 T2981 C465 P33554 oasc.RecoveryStrategy.run Starting recovery process. core=collection1 recoveringAfterStartup=true
[junit4] 2> 641904 T2980 oascc.ZkStateReader.updateClusterState Updating cloud state from ZooKeeper...
[junit4] 2> 641906 T2981 C465 P33554 oasc.RecoveryStrategy.doRecovery ###### startupVersions=[]
[junit4] 2> 641906 T2981 C465 P33554 oasc.RecoveryStrategy.doRecovery Publishing state of core collection1 as recovering, leader is https://127.0.0.1:57620/_uw/vb/collection1/ and I am https://127.0.0.1:33554/_uw/vb/collection1/
[junit4] 2> 641907 T2981 C465 P33554 oasc.ZkController.publish publishing core=collection1 state=recovering collection=collection1
[junit4] 2> 641907 T2981 C465 P33554 oasc.ZkController.publish numShards not found on descriptor - reading it from system property
[junit4] 2> 641909 T2935 oasc.DistributedQueue$LatchChildWatcher.process LatchChildWatcher fired on path: /overseer/queue state: SyncConnected type NodeChildrenChanged
[junit4] 2> 641909 T2935 oasc.DistributedQueue$LatchChildWatcher.process LatchChildWatcher fired on path: /overseer/queue state: SyncConnected type NodeChildrenChanged
[junit4] 2> 641910 T2935 oasc.DistributedQueue$LatchChildWatcher.process LatchChildWatcher fired on path: /overseer/queue state: SyncConnected type NodeChildrenChanged
[junit4] 2> 641911 T2981 C465 P33554 oasc.RecoveryStrategy.sendPrepRecoveryCmd Sending prep recovery command to https://127.0.0.1:57620/_uw/vb; WaitForState: action=PREPRECOVERY&core=collection1&nodeName=127.0.0.1%3A33554__uw%252Fvb&coreNodeName=core_node2&state=recovering&checkLive=true&onlyIfLeader=true&onlyIfLeaderActive=true
[junit4] 2> 641913 T2936 oascc.ZkStateReader.updateClusterState Updating cloud state from ZooKeeper...
[junit4] 2> 641915 T2936 oasc.Overseer$ClusterStateUpdater.updateState Update state numShards=1 message={
[junit4] 2> "operation":"state",
[junit4] 2> "state":"recovering",
[junit4] 2> "base_url":"https://127.0.0.1:33554/_uw/vb",
[junit4] 2> "core":"collection1",
[junit4] 2> "roles":null,
[junit4] 2> "node_name":"127.0.0.1:33554__uw%2Fvb",
[junit4] 2> "shard":"shard1",
[junit4] 2> "collection":"collection1",
[junit4] 2> "numShards":"1",
[junit4] 2> "core_node_name":"core_node2"}
[junit4] 2> 641920 T2935 oasc.DistributedQueue$LatchChildWatcher.process LatchChildWatcher fired on path: /overseer/queue state: SyncConnected type NodeChildrenChanged
[junit4] 2> 642027 T2975 oascc.ZkStateReader$2.process A cluster state change: WatchedEvent state:SyncConnected type:NodeDataChanged path:/clusterstate.json, has occurred - updating... (live nodes size: 3)
[junit4] 2> 642027 T2957 oascc.ZkStateReader$2.process A cluster state change: WatchedEvent state:SyncConnected type:NodeDataChanged path:/clusterstate.json, has occurred - updating... (live nodes size: 3)
[junit4] 2> 642027 T2935 oascc.ZkStateReader$2.process A cluster state change: WatchedEvent state:SyncConnected type:NodeDataChanged path:/clusterstate.json, has occurred - updating... (live nodes size: 3)
[junit4] 2> 642027 T2944 oascc.ZkStateReader$2.process A cluster state change: WatchedEvent state:SyncConnected type:NodeDataChanged path:/clusterstate.json, has occurred - updating... (live nodes size: 3)
[junit4] 2> 642041 T2950 oasha.CoreAdminHandler.handleWaitForStateAction Going to wait for coreNodeName: core_node2, state: recovering, checkLive: true, onlyIfLeader: true, onlyIfLeaderActive: true
[junit4] 2> 642041 T2950 oascc.ZkStateReader.updateClusterState Updating cloud state from ZooKeeper...
[junit4] 2> 642042 T2950 oasha.CoreAdminHandler.handleWaitForStateAction Will wait a max of 183 seconds to see collection1 (shard1 of collection1) have state: recovering
[junit4] 2> 642043 T2950 oasha.CoreAdminHandler.handleWaitForStateAction In WaitForState(recovering): collection=collection1, shard=shard1, thisCore=collection1, leaderDoesNotNeedRecovery=false, isLeader? true, live=true, checkLive=true, currentState=recovering, localState=active, nodeName=127.0.0.1:33554__uw%2Fvb, coreNodeName=core_node2, onlyIfActiveCheckResult=false, nodeProps: core_node2:{"state":"recovering","base_url":"https://127.0.0.1:33554/_uw/vb","core":"collection1","node_name":"127.0.0.1:33554__uw%2Fvb"}
[junit4] 2> 642043 T2950 oasha.CoreAdminHandler.handleWaitForStateAction Waited coreNodeName: core_node2, state: recovering, checkLive: true, onlyIfLeader: true for: 0 seconds.
[junit4] 2> 642043 T2950 oass.SolrDispatchFilter.handleAdminRequest [admin] webapp=null path=/admin/cores params={nodeName=127.0.0.1:33554__uw%252Fvb&onlyIfLeaderActive=true&core=collection1&coreNodeName=core_node2&action=PREPRECOVERY&checkLive=true&state=recovering&onlyIfLeader=true&wt=javabin&version=2} status=0 QTime=3
[junit4] 2> 642189 T2911 oasc.AbstractFullDistribZkTestBase.createJettys create jetty 3
[junit4] 2> 642190 T2911 oejs.Server.doStart jetty-8.1.10.v20130312
[junit4] 2> 642194 T2911 oejus.SslContextFactory.doStart Enabled Protocols [SSLv2Hello, SSLv3, TLSv1, TLSv1.1, TLSv1.2] of [SSLv2Hello, SSLv3, TLSv1, TLSv1.1, TLSv1.2]
[junit4] 2> 642195 T2911 oejs.AbstractConnector.doStart Started SslSelectChannelConnector@127.0.0.1:58241
[junit4] 2> 642198 T2911 oass.SolrDispatchFilter.init SolrDispatchFilter.init()
[junit4] 2> 642199 T2911 oasc.SolrResourceLoader.locateSolrHome JNDI not configured for solr (NoInitialContextEx)
[junit4] 2> 642200 T2911 oasc.SolrResourceLoader.locateSolrHome using system property solr.solr.home: ./solr.cloud.AliasIntegrationTest-FFB4B510D6EAFD27-001/tempDir-005
[junit4] 2> 642201 T2911 oasc.SolrResourceLoader.<init> new SolrResourceLoader for directory: './solr.cloud.AliasIntegrationTest-FFB4B510D6EAFD27-001/tempDir-005/'
[junit4] 2> 642233 T2911 oasc.ConfigSolr.fromFile Loading container configuration from /mnt/ssd/jenkins/workspace/Lucene-Solr-4.x-Linux/solr/build/solr-core/test/J0/./solr.cloud.AliasIntegrationTest-FFB4B510D6EAFD27-001/tempDir-005/solr.xml
[junit4] 2> 642249 T2911 oasc.CoreContainer.<init> New CoreContainer 11068793
[junit4] 2> 642250 T2911 oasc.CoreContainer.load Loading cores into CoreContainer [instanceDir=./solr.cloud.AliasIntegrationTest-FFB4B510D6EAFD27-001/tempDir-005/]
[junit4] 2> 642251 T2911 oashc.HttpShardHandlerFactory.getParameter Setting socketTimeout to: 90000
[junit4] 2> 642251 T2911 oashc.HttpShardHandlerFactory.getParameter Setting urlScheme to:
[junit4] 2> 642252 T2911 oashc.HttpShardHandlerFactory.getParameter Setting connTimeout to: 15000
[junit4] 2> 642252 T2911 oashc.HttpShardHandlerFactory.getParameter Setting maxConnectionsPerHost to: 20
[junit4] 2> 642253 T2911 oashc.HttpShardHandlerFactory.getParameter Setting corePoolSize to: 0
[junit4] 2> 642253 T2911 oashc.HttpShardHandlerFactory.getParameter Setting maximumPoolSize to: 2147483647
[junit4] 2> 642254 T2911 oashc.HttpShardHandlerFactory.getParameter Setting maxThreadIdleTime to: 5
[junit4] 2> 642255 T2911 oashc.HttpShardHandlerFactory.getParameter Setting sizeOfQueue to: -1
[junit4] 2> 642255 T2911 oashc.HttpShardHandlerFactory.getParameter Setting fairnessPolicy to: false
[junit4] 2> 642259 T2911 oasl.LogWatcher.createWatcher SLF4J impl is org.slf4j.impl.Log4jLoggerFactory
[junit4] 2> 642260 T2911 oasl.LogWatcher.newRegisteredLogWatcher Registering Log Listener [Log4j (org.slf4j.impl.Log4jLoggerFactory)]
[junit4] 2> 642260 T2911 oasc.CoreContainer.load Host Name: 127.0.0.1
[junit4] 2> 642261 T2911 oasc.ZkContainer.initZooKeeper Zookeeper client=127.0.0.1:46104/solr
[junit4] 2> 642262 T2911 oasc.ZkController.checkChrootPath zkHost includes chroot
[junit4] 2> 642263 T2911 oascc.ConnectionManager.waitForConnected Waiting for client to connect to ZooKeeper
[junit4] 2> 642265 T2993 oascc.ConnectionManager.process Watcher org.apache.solr.common.cloud.ConnectionManager@1fc2a6c name:ZooKeeperConnection Watcher:127.0.0.1:46104 got event WatchedEvent state:SyncConnected type:None path:null path:null type:None
[junit4] 2> 642265 T2911 oascc.ConnectionManager.waitForConnected Client is connected to ZooKeeper
[junit4] 2> 642267 T2911 oascc.ConnectionManager.waitForConnected Waiting for client to connect to ZooKeeper
[junit4] 2> 642269 T2995 oascc.ConnectionManager.process Watcher org.apache.solr.common.cloud.ConnectionManager@3caaa9 name:ZooKeeperConnection Watcher:127.0.0.1:46104/solr got event WatchedEvent state:SyncConnected type:None path:null path:null type:None
[junit4] 2> 642269 T2911 oascc.ConnectionManager.waitForConnected Client is connected to ZooKeeper
[junit4] 2> 642277 T2911 oascc.ZkStateReader.createClusterStateWatchersAndUpdate Updating cluster state from ZooKeeper...
[junit4] 2> 643280 T2911 oasc.ZkController.createEphemeralLiveNode Register node as live in ZooKeeper:/live_nodes/127.0.0.1:58241__uw%2Fvb
[junit4] 2> 643282 T2911 oascc.SolrZkClient.makePath makePath: /live_nodes/127.0.0.1:58241__uw%2Fvb
[junit4] 2> 643286 T2935 oascc.ZkStateReader$3.process Updating live nodes... (4)
[junit4] 2> 643286 T2944 oascc.ZkStateReader$3.process Updating live nodes... (4)
[junit4] 2> 643287 T
[...truncated too long message...]
-001/tempDir-001/jetty3/index;done=false>>]
[junit4] 2> 671037 T2995 oasc.CachingDirectoryFactory.close Closing directory: ./solr.cloud.AliasIntegrationTest-FFB4B510D6EAFD27-001/tempDir-001/jetty3/index
[junit4] 2> 671038 T2995 oasc.CachingDirectoryFactory.closeCacheValue looking to close ./solr.cloud.AliasIntegrationTest-FFB4B510D6EAFD27-001/tempDir-001/jetty3 [CachedDir<<refCount=0;path=./solr.cloud.AliasIntegrationTest-FFB4B510D6EAFD27-001/tempDir-001/jetty3;done=false>>]
[junit4] 2> 671038 T2995 oasc.CachingDirectoryFactory.close Closing directory: ./solr.cloud.AliasIntegrationTest-FFB4B510D6EAFD27-001/tempDir-001/jetty3
[junit4] 2> 671038 T2995 oasc.LeaderElector$ElectionWatcher.process WARN org.apache.zookeeper.KeeperException$SessionExpiredException: KeeperErrorCode = Session expired for /overseer_elect/election
[junit4] 2> at org.apache.zookeeper.KeeperException.create(KeeperException.java:127)
[junit4] 2> at org.apache.zookeeper.KeeperException.create(KeeperException.java:51)
[junit4] 2> at org.apache.zookeeper.ZooKeeper.getChildren(ZooKeeper.java:1472)
[junit4] 2> at org.apache.solr.common.cloud.SolrZkClient$6.execute(SolrZkClient.java:260)
[junit4] 2> at org.apache.solr.common.cloud.SolrZkClient$6.execute(SolrZkClient.java:257)
[junit4] 2> at org.apache.solr.common.cloud.ZkCmdExecutor.retryOperation(ZkCmdExecutor.java:73)
[junit4] 2> at org.apache.solr.common.cloud.SolrZkClient.getChildren(SolrZkClient.java:257)
[junit4] 2> at org.apache.solr.cloud.LeaderElector.checkIfIamLeader(LeaderElector.java:94)
[junit4] 2> at org.apache.solr.cloud.LeaderElector.access$200(LeaderElector.java:55)
[junit4] 2> at org.apache.solr.cloud.LeaderElector$ElectionWatcher.process(LeaderElector.java:303)
[junit4] 2> at org.apache.zookeeper.ClientCnxn$EventThread.processEvent(ClientCnxn.java:522)
[junit4] 2> at org.apache.zookeeper.ClientCnxn$EventThread.run(ClientCnxn.java:498)
[junit4] 2>
[junit4] 2> 671038 T2995 oascc.ZkStateReader$3.process WARN ZooKeeper watch triggered, but Solr cannot talk to ZK
[junit4] 2> 671126 T3016 C469 P36702 oasc.SyncStrategy.sync WARN Closed, skipping sync up.
[junit4] 2> 671127 T3016 oasc.ShardLeaderElectionContext.rejoinLeaderElection Not rejoining election because CoreContainer is shutdown
[junit4] 2> 671127 T3016 oasc.SolrCore.close [collection1] CLOSING SolrCore org.apache.solr.core.SolrCore@8d30c1
[junit4] 2> 671136 T3016 oasu.DirectUpdateHandler2.close closing DirectUpdateHandler2{commits=1,autocommits=0,soft autocommits=0,optimizes=0,rollbacks=0,expungeDeletes=0,docsPending=0,adds=0,deletesById=0,deletesByQuery=1,errors=0,cumulative_adds=0,cumulative_deletesById=0,cumulative_deletesByQuery=1,cumulative_errors=0,transaction_logs_total_size=0,transaction_logs_total_number=0}
[junit4] 2> 671136 T3016 oasu.SolrCoreState.decrefSolrCoreState Closing SolrCoreState
[junit4] 2> 671136 T3016 oasu.DefaultSolrCoreState.closeIndexWriter SolrCoreState ref count has reached 0 - closing IndexWriter
[junit4] 2> 671136 T3016 oasu.DefaultSolrCoreState.closeIndexWriter closing IndexWriter with IndexWriterCloser
[junit4] 2> 671136 T3016 C469 P36702 oasu.DirectUpdateHandler2.closeWriter Committing on IndexWriter close.
[junit4] 2> 671137 T3016 C469 P36702 oasc.SolrDeletionPolicy.onCommit SolrDeletionPolicy.onCommit: commits: num=2
[junit4] 2> commit{dir=MockDirectoryWrapper(RAMDirectory@1bbb93f lockFactory=org.apache.lucene.store.SingleInstanceLockFactory@15622f1),segFN=segments_1,generation=1}
[junit4] 2> commit{dir=MockDirectoryWrapper(RAMDirectory@1bbb93f lockFactory=org.apache.lucene.store.SingleInstanceLockFactory@15622f1),segFN=segments_2,generation=2}
[junit4] 2> 671137 T3016 C469 P36702 oasc.SolrDeletionPolicy.updateCommits newest commit generation = 2
[junit4] 2> 671138 T3016 oasc.SolrCore.closeSearcher [collection1] Closing main searcher on request.
[junit4] 2> 671138 T3016 oasc.CachingDirectoryFactory.close Closing MockDirectoryFactory - 2 directories currently being tracked
[junit4] 2> 671138 T3016 oasc.CachingDirectoryFactory.closeCacheValue looking to close ./solr.cloud.AliasIntegrationTest-FFB4B510D6EAFD27-001/tempDir-001/jetty4/index [CachedDir<<refCount=0;path=./solr.cloud.AliasIntegrationTest-FFB4B510D6EAFD27-001/tempDir-001/jetty4/index;done=false>>]
[junit4] 2> 671138 T3016 oasc.CachingDirectoryFactory.close Closing directory: ./solr.cloud.AliasIntegrationTest-FFB4B510D6EAFD27-001/tempDir-001/jetty4/index
[junit4] 2> 671139 T3016 oasc.CachingDirectoryFactory.closeCacheValue looking to close ./solr.cloud.AliasIntegrationTest-FFB4B510D6EAFD27-001/tempDir-001/jetty4 [CachedDir<<refCount=0;path=./solr.cloud.AliasIntegrationTest-FFB4B510D6EAFD27-001/tempDir-001/jetty4;done=false>>]
[junit4] 2> 671139 T3016 oasc.CachingDirectoryFactory.close Closing directory: ./solr.cloud.AliasIntegrationTest-FFB4B510D6EAFD27-001/tempDir-001/jetty4
[junit4] 2> 671139 T3016 oasc.LeaderElector$ElectionWatcher.process WARN org.apache.zookeeper.KeeperException$SessionExpiredException: KeeperErrorCode = Session expired for /overseer_elect/election
[junit4] 2> at org.apache.zookeeper.KeeperException.create(KeeperException.java:127)
[junit4] 2> at org.apache.zookeeper.KeeperException.create(KeeperException.java:51)
[junit4] 2> at org.apache.zookeeper.ZooKeeper.getChildren(ZooKeeper.java:1472)
[junit4] 2> at org.apache.solr.common.cloud.SolrZkClient$6.execute(SolrZkClient.java:260)
[junit4] 2> at org.apache.solr.common.cloud.SolrZkClient$6.execute(SolrZkClient.java:257)
[junit4] 2> at org.apache.solr.common.cloud.ZkCmdExecutor.retryOperation(ZkCmdExecutor.java:73)
[junit4] 2> at org.apache.solr.common.cloud.SolrZkClient.getChildren(SolrZkClient.java:257)
[junit4] 2> at org.apache.solr.cloud.LeaderElector.checkIfIamLeader(LeaderElector.java:94)
[junit4] 2> at org.apache.solr.cloud.LeaderElector.access$200(LeaderElector.java:55)
[junit4] 2> at org.apache.solr.cloud.LeaderElector$ElectionWatcher.process(LeaderElector.java:303)
[junit4] 2> at org.apache.zookeeper.ClientCnxn$EventThread.processEvent(ClientCnxn.java:522)
[junit4] 2> at org.apache.zookeeper.ClientCnxn$EventThread.run(ClientCnxn.java:498)
[junit4] 2>
[junit4] 2> 671139 T3016 oascc.ZkStateReader$3.process WARN ZooKeeper watch triggered, but Solr cannot talk to ZK
[junit4] 2> NOTE: leaving temporary files on disk at: /mnt/ssd/jenkins/workspace/Lucene-Solr-4.x-Linux/solr/build/solr-core/test/J0/./solr.cloud.AliasIntegrationTest-FFB4B510D6EAFD27-001
[junit4] 2> NOTE: test params are: codec=Lucene45, sim=DefaultSimilarity, locale=cs_CZ, timezone=Australia/NSW
[junit4] 2> NOTE: Linux 3.8.0-41-generic i386/Oracle Corporation 1.8.0_05 (32-bit)/cpus=8,threads=1,free=122948760,total=326369280
[junit4] 2> NOTE: All tests run in this JVM: [AtomicUpdatesTest, SuggesterFSTTest, LegacyHTMLStripCharFilterTest, SimpleFacetsTest, DOMUtilTest, IndexSchemaTest, SoftAutoCommitTest, DocumentBuilderTest, ConnectionManagerTest, InfoHandlerTest, CursorMarkTest, SolrXmlInZkTest, SliceStateUpdateTest, TestSurroundQueryParser, TestImplicitCoreProperties, MigrateRouteKeyTest, PeerSyncTest, TestSort, MoreLikeThisHandlerTest, TestPHPSerializedResponseWriter, StatelessScriptUpdateProcessorFactoryTest, HdfsBasicDistributedZk2Test, TestLMJelinekMercerSimilarityFactory, CircularListTest, SearchHandlerTest, ScriptEngineTest, UpdateRequestProcessorFactoryTest, MultiThreadedOCPTest, TestPseudoReturnFields, MBeansHandlerTest, TestRandomDVFaceting, ExternalFileFieldSortTest, AnalyticsMergeStrategyTest, TestMiniSolrCloudCluster, SolrTestCaseJ4Test, TestJmxMonitoredMap, TestReversedWildcardFilterFactory, TestCharFilters, OverseerTest, TestLuceneMatchVersion, TestReplicationHandler, ReturnFieldsTest, TestCollationKeyRangeQueries, CacheHeaderTest, LoggingHandlerTest, TestCoreContainer, LeaderElectionTest, FieldMutatingUpdateProcessorTest, SolrInfoMBeanTest, TestLFUCache, TestJoin, TestFreeTextSuggestions, DistribDocExpirationUpdateProcessorTest, DocValuesTest, TestElisionMultitermQuery, RecoveryZkTest, TestDefaultSearchFieldResource, TestChildDocTransformer, BlockCacheTest, UUIDFieldTest, SystemInfoHandlerTest, TestPostingsSolrHighlighter, FastVectorHighlighterTest, PrimitiveFieldTypeTest, TestReRankQParserPlugin, WordBreakSolrSpellCheckerTest, HdfsUnloadDistributedZkTest, AliasIntegrationTest]
[junit4] Completed on J0 in 36.74s, 1 test, 1 error <<< FAILURES!
[...truncated 897 lines...]
BUILD FAILED
/mnt/ssd/jenkins/workspace/Lucene-Solr-4.x-Linux/build.xml:467: The following error occurred while executing this line:
/mnt/ssd/jenkins/workspace/Lucene-Solr-4.x-Linux/build.xml:447: The following error occurred while executing this line:
/mnt/ssd/jenkins/workspace/Lucene-Solr-4.x-Linux/build.xml:45: The following error occurred while executing this line:
/mnt/ssd/jenkins/workspace/Lucene-Solr-4.x-Linux/extra-targets.xml:37: The following error occurred while executing this line:
/mnt/ssd/jenkins/workspace/Lucene-Solr-4.x-Linux/solr/build.xml:189: The following error occurred while executing this line:
/mnt/ssd/jenkins/workspace/Lucene-Solr-4.x-Linux/solr/common-build.xml:496: The following error occurred while executing this line:
/mnt/ssd/jenkins/workspace/Lucene-Solr-4.x-Linux/lucene/common-build.xml:1297: The following error occurred while executing this line:
/mnt/ssd/jenkins/workspace/Lucene-Solr-4.x-Linux/lucene/common-build.xml:921: There were test failures: 404 suites, 1648 tests, 1 error, 37 ignored (16 assumptions)
Total time: 71 minutes 23 seconds
Build step 'Invoke Ant' marked build as failure
Description set: Java: 32bit/jdk1.8.0_05 -client -XX:+UseParallelGC
Archiving artifacts
Recording test results
Email was triggered for: Failure - Any
Sending email for trigger: Failure - Any
[JENKINS] Lucene-Solr-4.x-Linux (32bit/jdk1.7.0_60) - Build # 10432
- Still Failing!
Posted by Policeman Jenkins Server <je...@thetaphi.de>.
Build: http://jenkins.thetaphi.de/job/Lucene-Solr-4.x-Linux/10432/
Java: 32bit/jdk1.7.0_60 -server -XX:+UseSerialGC
1 tests failed.
REGRESSION: org.apache.solr.cloud.DeleteReplicaTest.testDistribSearch
Error Message:
java.util.concurrent.TimeoutException: Could not connect to ZooKeeper 127.0.0.1:46610 within 45000 ms
Stack Trace:
org.apache.solr.common.SolrException: java.util.concurrent.TimeoutException: Could not connect to ZooKeeper 127.0.0.1:46610 within 45000 ms
at org.apache.solr.common.cloud.SolrZkClient.<init>(SolrZkClient.java:151)
at org.apache.solr.common.cloud.SolrZkClient.<init>(SolrZkClient.java:102)
at org.apache.solr.common.cloud.SolrZkClient.<init>(SolrZkClient.java:92)
at org.apache.solr.cloud.AbstractZkTestCase.buildZooKeeper(AbstractZkTestCase.java:89)
at org.apache.solr.cloud.AbstractZkTestCase.buildZooKeeper(AbstractZkTestCase.java:83)
at org.apache.solr.cloud.AbstractDistribZkTestBase.setUp(AbstractDistribZkTestBase.java:76)
at org.apache.solr.cloud.AbstractFullDistribZkTestBase.setUp(AbstractFullDistribZkTestBase.java:202)
at org.apache.solr.cloud.DeleteReplicaTest.setUp(DeleteReplicaTest.java:55)
at sun.reflect.NativeMethodAccessorImpl.invoke0(Native Method)
at sun.reflect.NativeMethodAccessorImpl.invoke(NativeMethodAccessorImpl.java:57)
at sun.reflect.DelegatingMethodAccessorImpl.invoke(DelegatingMethodAccessorImpl.java:43)
at java.lang.reflect.Method.invoke(Method.java:606)
at com.carrotsearch.randomizedtesting.RandomizedRunner.invoke(RandomizedRunner.java:1618)
at com.carrotsearch.randomizedtesting.RandomizedRunner$7.evaluate(RandomizedRunner.java:861)
at com.carrotsearch.randomizedtesting.RandomizedRunner$8.evaluate(RandomizedRunner.java:877)
at com.carrotsearch.randomizedtesting.rules.SystemPropertiesRestoreRule$1.evaluate(SystemPropertiesRestoreRule.java:53)
at org.apache.lucene.util.TestRuleSetupTeardownChained$1.evaluate(TestRuleSetupTeardownChained.java:50)
at org.apache.lucene.util.TestRuleFieldCacheSanity$1.evaluate(TestRuleFieldCacheSanity.java:51)
at org.apache.lucene.util.AbstractBeforeAfterRule$1.evaluate(AbstractBeforeAfterRule.java:46)
at com.carrotsearch.randomizedtesting.rules.SystemPropertiesInvariantRule$1.evaluate(SystemPropertiesInvariantRule.java:55)
at org.apache.lucene.util.TestRuleThreadAndTestName$1.evaluate(TestRuleThreadAndTestName.java:49)
at org.apache.lucene.util.TestRuleIgnoreAfterMaxFailures$1.evaluate(TestRuleIgnoreAfterMaxFailures.java:65)
at org.apache.lucene.util.TestRuleMarkFailure$1.evaluate(TestRuleMarkFailure.java:48)
at com.carrotsearch.randomizedtesting.rules.StatementAdapter.evaluate(StatementAdapter.java:36)
at com.carrotsearch.randomizedtesting.ThreadLeakControl$StatementRunner.run(ThreadLeakControl.java:360)
at com.carrotsearch.randomizedtesting.ThreadLeakControl.forkTimeoutingTask(ThreadLeakControl.java:793)
at com.carrotsearch.randomizedtesting.ThreadLeakControl$3.evaluate(ThreadLeakControl.java:453)
at com.carrotsearch.randomizedtesting.RandomizedRunner.runSingleTest(RandomizedRunner.java:836)
at com.carrotsearch.randomizedtesting.RandomizedRunner$3.evaluate(RandomizedRunner.java:738)
at com.carrotsearch.randomizedtesting.RandomizedRunner$4.evaluate(RandomizedRunner.java:772)
at com.carrotsearch.randomizedtesting.RandomizedRunner$5.evaluate(RandomizedRunner.java:783)
at com.carrotsearch.randomizedtesting.rules.StatementAdapter.evaluate(StatementAdapter.java:36)
at com.carrotsearch.randomizedtesting.rules.SystemPropertiesRestoreRule$1.evaluate(SystemPropertiesRestoreRule.java:53)
at org.apache.lucene.util.AbstractBeforeAfterRule$1.evaluate(AbstractBeforeAfterRule.java:46)
at org.apache.lucene.util.TestRuleStoreClassName$1.evaluate(TestRuleStoreClassName.java:42)
at com.carrotsearch.randomizedtesting.rules.SystemPropertiesInvariantRule$1.evaluate(SystemPropertiesInvariantRule.java:55)
at com.carrotsearch.randomizedtesting.rules.NoShadowingOrOverridesOnMethodsRule$1.evaluate(NoShadowingOrOverridesOnMethodsRule.java:39)
at com.carrotsearch.randomizedtesting.rules.NoShadowingOrOverridesOnMethodsRule$1.evaluate(NoShadowingOrOverridesOnMethodsRule.java:39)
at com.carrotsearch.randomizedtesting.rules.StatementAdapter.evaluate(StatementAdapter.java:36)
at com.carrotsearch.randomizedtesting.rules.StatementAdapter.evaluate(StatementAdapter.java:36)
at com.carrotsearch.randomizedtesting.rules.StatementAdapter.evaluate(StatementAdapter.java:36)
at org.apache.lucene.util.TestRuleAssertionsRequired$1.evaluate(TestRuleAssertionsRequired.java:43)
at org.apache.lucene.util.TestRuleMarkFailure$1.evaluate(TestRuleMarkFailure.java:48)
at org.apache.lucene.util.TestRuleIgnoreAfterMaxFailures$1.evaluate(TestRuleIgnoreAfterMaxFailures.java:65)
at org.apache.lucene.util.TestRuleIgnoreTestSuites$1.evaluate(TestRuleIgnoreTestSuites.java:55)
at com.carrotsearch.randomizedtesting.rules.StatementAdapter.evaluate(StatementAdapter.java:36)
at com.carrotsearch.randomizedtesting.ThreadLeakControl$StatementRunner.run(ThreadLeakControl.java:360)
at java.lang.Thread.run(Thread.java:745)
Caused by: java.util.concurrent.TimeoutException: Could not connect to ZooKeeper 127.0.0.1:46610 within 45000 ms
at org.apache.solr.common.cloud.ConnectionManager.waitForConnected(ConnectionManager.java:223)
at org.apache.solr.common.cloud.SolrZkClient.<init>(SolrZkClient.java:143)
... 47 more
Build Log:
[...truncated 11808 lines...]
[junit4] Suite: org.apache.solr.cloud.DeleteReplicaTest
[junit4] 2> Creating dataDir: /mnt/ssd/jenkins/workspace/Lucene-Solr-4.x-Linux/solr/build/solr-core/test/J1/./solr.cloud.DeleteReplicaTest-946F4A2C5DF38849-001/init-core-data-001
[junit4] 2> 1383924 T6373 oas.SolrTestCaseJ4.buildSSLConfig Randomized ssl (false) and clientAuth (false)
[junit4] 2> 1383925 T6373 oas.BaseDistributedSearchTestCase.initHostContext Setting hostContext system property: /lr_ou/
[junit4] 2> 1383928 T6373 oas.SolrTestCaseJ4.setUp ###Starting testDistribSearch
[junit4] 2> 1383929 T6373 oasc.ZkTestServer.run STARTING ZK TEST SERVER
[junit4] 1> client port:0.0.0.0/0.0.0.0:0
[junit4] 2> 1383930 T6374 oasc.ZkTestServer$ZKServerMain.runFromConfig Starting server
[junit4] 2> 1384030 T6373 oasc.ZkTestServer.run start zk server on port:46610
[junit4] 2> 1384031 T6373 oascc.ConnectionManager.waitForConnected Waiting for client to connect to ZooKeeper
[junit4] 2> 1432093 T6377 oazsp.FileTxnLog.commit WARN fsync-ing the write ahead log in SyncThread:0 took 48060ms which will adversely effect operation latency. See the ZooKeeper troubleshooting guide
[junit4] 2> 1432095 T6375 oazs.NIOServerCnxn.doIO WARN caught end of stream exception EndOfStreamException: Unable to read additional data from client sessionid 0x146964e165e0000, likely client has closed socket
[junit4] 2> at org.apache.zookeeper.server.NIOServerCnxn.doIO(NIOServerCnxn.java:228)
[junit4] 2> at org.apache.zookeeper.server.NIOServerCnxnFactory.run(NIOServerCnxnFactory.java:208)
[junit4] 2> at java.lang.Thread.run(Thread.java:745)
[junit4] 2>
[junit4] 2> 1432096 T6375 oazs.NIOServerCnxn.doIO WARN caught end of stream exception EndOfStreamException: Unable to read additional data from client sessionid 0x146964e165e0001, likely client has closed socket
[junit4] 2> at org.apache.zookeeper.server.NIOServerCnxn.doIO(NIOServerCnxn.java:228)
[junit4] 2> at org.apache.zookeeper.server.NIOServerCnxnFactory.run(NIOServerCnxnFactory.java:208)
[junit4] 2> at java.lang.Thread.run(Thread.java:745)
[junit4] 2>
[junit4] 2> 1432098 T6380 oascc.ConnectionManager.process Watcher org.apache.solr.common.cloud.ConnectionManager@684652 name:ZooKeeperConnection Watcher:127.0.0.1:46610 got event WatchedEvent state:SyncConnected type:None path:null path:null type:None
[junit4] 2> 1432098 T6380 oascc.ConnectionManager.process Client->ZooKeeper status change trigger but we are already closed
[junit4] 2> 1432115 T6373 oas.SolrTestCaseJ4.tearDown ###Ending testDistribSearch
[junit4] 2> 1432116 T6373 oasc.ZkTestServer.send4LetterWord connecting to 127.0.0.1:46610 46610
[junit4] 2> 1432943 T6374 oasc.ZkTestServer.send4LetterWord connecting to 127.0.0.1:46610 46610
[junit4] 2> NOTE: reproduce with: ant test -Dtestcase=DeleteReplicaTest -Dtests.method=testDistribSearch -Dtests.seed=946F4A2C5DF38849 -Dtests.multiplier=3 -Dtests.slow=true -Dtests.locale=ko_KR -Dtests.timezone=Asia/Omsk -Dtests.file.encoding=US-ASCII
[junit4] ERROR 49.0s J1 | DeleteReplicaTest.testDistribSearch <<<
[junit4] > Throwable #1: org.apache.solr.common.SolrException: java.util.concurrent.TimeoutException: Could not connect to ZooKeeper 127.0.0.1:46610 within 45000 ms
[junit4] > at org.apache.solr.common.cloud.SolrZkClient.<init>(SolrZkClient.java:151)
[junit4] > at org.apache.solr.common.cloud.SolrZkClient.<init>(SolrZkClient.java:102)
[junit4] > at org.apache.solr.common.cloud.SolrZkClient.<init>(SolrZkClient.java:92)
[junit4] > at org.apache.solr.cloud.AbstractZkTestCase.buildZooKeeper(AbstractZkTestCase.java:89)
[junit4] > at org.apache.solr.cloud.AbstractZkTestCase.buildZooKeeper(AbstractZkTestCase.java:83)
[junit4] > at org.apache.solr.cloud.AbstractDistribZkTestBase.setUp(AbstractDistribZkTestBase.java:76)
[junit4] > at org.apache.solr.cloud.AbstractFullDistribZkTestBase.setUp(AbstractFullDistribZkTestBase.java:202)
[junit4] > at org.apache.solr.cloud.DeleteReplicaTest.setUp(DeleteReplicaTest.java:55)
[junit4] > at java.lang.Thread.run(Thread.java:745)
[junit4] > Caused by: java.util.concurrent.TimeoutException: Could not connect to ZooKeeper 127.0.0.1:46610 within 45000 ms
[junit4] > at org.apache.solr.common.cloud.ConnectionManager.waitForConnected(ConnectionManager.java:223)
[junit4] > at org.apache.solr.common.cloud.SolrZkClient.<init>(SolrZkClient.java:143)
[junit4] > ... 47 moreThrowable #2: java.lang.NullPointerException
[junit4] > at org.apache.solr.cloud.DeleteReplicaTest.tearDown(DeleteReplicaTest.java:64)
[junit4] > at java.lang.Thread.run(Thread.java:745)
[junit4] 2> 1432956 T6373 oas.SolrTestCaseJ4.deleteCore ###deleteCore
[junit4] 2> NOTE: leaving temporary files on disk at: /mnt/ssd/jenkins/workspace/Lucene-Solr-4.x-Linux/solr/build/solr-core/test/J1/./solr.cloud.DeleteReplicaTest-946F4A2C5DF38849-001
[junit4] 2> NOTE: test params are: codec=Lucene3x, sim=RandomSimilarityProvider(queryNorm=true,coord=no): {}, locale=ko_KR, timezone=Asia/Omsk
[junit4] 2> NOTE: Linux 3.8.0-41-generic i386/Oracle Corporation 1.7.0_60 (32-bit)/cpus=8,threads=1,free=115203288,total=263180288
[junit4] 2> NOTE: All tests run in this JVM: [NumericFieldsTest, TestNonNRTOpen, JSONWriterTest, ShardRoutingCustomTest, TestXIncludeConfig, TestPartialUpdateDeduplication, SolrRequestParserTest, TestDistribDocBasedVersion, LeaderElectionIntegrationTest, SolrCmdDistributorTest, DisMaxRequestHandlerTest, TestSchemaSimilarityResource, BasicZkTest, DirectUpdateHandlerTest, TestFastLRUCache, TestClassNameShortening, SimplePostToolTest, DocumentAnalysisRequestHandlerTest, TestZkChroot, TestFreeTextSuggestions, TestAddFieldRealTimeGet, TestFoldingMultitermQuery, TestSolrCoreProperties, MultiTermTest, TestFieldCollectionResource, TestIBSimilarityFactory, StandardRequestHandlerTest, UniqFieldsUpdateProcessorFactoryTest, TestNoOpRegenerator, TestFiltering, TestRecovery, TestCollationKeyRangeQueries, DistribCursorPagingTest, SolrCoreCheckLockOnStartupTest, TestReRankQParserPlugin, TestQuerySenderNoQuery, DocValuesMultiTest, TestSchemaNameResource, SuggesterWFSTTest, TestMultiCoreConfBootstrap, ParsingFieldUpdateProcessorsTest, SolrIndexConfigTest, XmlUpdateRequestHandlerTest, TestCodecSupport, TestDistributedMissingSort, TestRangeQuery, TermVectorComponentDistributedTest, HighlighterConfigTest, SignatureUpdateProcessorFactoryTest, TestSweetSpotSimilarityFactory, TestNumberUtils, SolrXmlInZkTest, TestWordDelimiterFilterFactory, AtomicUpdatesTest, OpenExchangeRatesOrgProviderTest, AddBlockUpdateTest, TestArbitraryIndexDir, TestCSVResponseWriter, DebugComponentTest, TestSchemaVersionResource, RemoteQueryErrorTest, PrimUtilsTest, RequestHandlersTest, TestComplexPhraseQParserPlugin, BJQParserTest, SortByFunctionTest, TestCopyFieldCollectionResource, TestFieldSortValues, NoCacheHeaderTest, TestBinaryResponseWriter, TestAnalyzedSuggestions, TestDefaultSimilarityFactory, TestReload, SpellingQueryConverterTest, TestDefaultSearchFieldResource, DefaultValueUpdateProcessorTest, TestLazyCores, TestRandomFaceting, DateFieldTest, BadIndexSchemaTest, EnumFieldTest, TestFastOutputStream, TestNonDefinedSimilarityFactory, TestInitQParser, FullSolrCloudDistribCmdsTest, OutputWriterTest, IndexSchemaRuntimeFieldTest, DistributedSuggestComponentTest, RequiredFieldsTest, FieldAnalysisRequestHandlerTest, TestSolrJ, TestReloadAndDeleteDocs, OpenCloseCoreStressTest, SuggesterTSTTest, DirectSolrSpellCheckerTest, TestIndexingPerformance, TestIndexSearcher, BasicDistributedZkTest, ChaosMonkeySafeLeaderTest, BasicDistributedZk2Test, CollectionsAPIDistributedZkTest, OverseerTest, ClusterStateUpdateTest, ZkSolrClientTest, ZkCLITest, SliceStateUpdateTest, TestDistributedSearch, AutoCommitTest, TestDistributedGrouping, TestFaceting, TestHashPartitioner, TestStressReorder, TestSolr4Spatial, TestGroupingSearch, TestFunctionQuery, HighlighterTest, DistributedQueryElevationComponentTest, CurrencyFieldXmlFileTest, TestExtendedDismaxParser, DocValuesTest, SuggesterTest, TestStressLucene, WordBreakSolrSpellCheckerTest, TestUpdate, QueryEqualityTest, TestRemoteStreaming, TestSolrDeletionPolicy1, CacheHeaderTest, LukeRequestHandlerTest, TestOmitPositions, DocumentBuilderTest, PathHierarchyTokenizerFactoryTest, SolrPluginUtilsTest, TestJmxIntegration, JsonLoaderTest, TestPHPSerializedResponseWriter, CSVRequestHandlerTest, TestLFUCache, TestQuerySenderListener, AlternateDirectoryTest, ResponseLogComponentTest, TestSolrDeletionPolicy2, SampleTest, TestBinaryField, MinimalSchemaTest, TestElisionMultitermQuery, TestConfig, TestFuzzyAnalyzedSuggestions, ExternalFileFieldSortTest, DirectSolrConnectionTest, NotRequiredUniqueKeyTest, TestPhraseSuggestions, SpellPossibilityIteratorTest, TestCharFilters, SynonymTokenizerTest, TestDFRSimilarityFactory, TestFastWriter, TestJmxMonitoredMap, TimeZoneUtilsTest, ScriptEngineTest, PluginInfoTest, ChaosMonkeyNothingIsSafeTest, AsyncMigrateRouteKeyTest, DeleteReplicaTest]
[junit4] Completed on J1 in 49.06s, 1 test, 1 error <<< FAILURES!
[...truncated 230 lines...]
BUILD FAILED
/mnt/ssd/jenkins/workspace/Lucene-Solr-4.x-Linux/build.xml:467: The following error occurred while executing this line:
/mnt/ssd/jenkins/workspace/Lucene-Solr-4.x-Linux/build.xml:447: The following error occurred while executing this line:
/mnt/ssd/jenkins/workspace/Lucene-Solr-4.x-Linux/build.xml:45: The following error occurred while executing this line:
/mnt/ssd/jenkins/workspace/Lucene-Solr-4.x-Linux/extra-targets.xml:37: The following error occurred while executing this line:
/mnt/ssd/jenkins/workspace/Lucene-Solr-4.x-Linux/solr/build.xml:189: The following error occurred while executing this line:
/mnt/ssd/jenkins/workspace/Lucene-Solr-4.x-Linux/solr/common-build.xml:496: The following error occurred while executing this line:
/mnt/ssd/jenkins/workspace/Lucene-Solr-4.x-Linux/lucene/common-build.xml:1297: The following error occurred while executing this line:
/mnt/ssd/jenkins/workspace/Lucene-Solr-4.x-Linux/lucene/common-build.xml:921: There were test failures: 404 suites, 1648 tests, 1 error, 37 ignored (16 assumptions)
Total time: 68 minutes 29 seconds
Build step 'Invoke Ant' marked build as failure
Description set: Java: 32bit/jdk1.7.0_60 -server -XX:+UseSerialGC
Archiving artifacts
Recording test results
Email was triggered for: Failure - Any
Sending email for trigger: Failure - Any