You are viewing a plain text version of this content. The canonical link for it is here.
Posted to dev@lucene.apache.org by Policeman Jenkins Server <je...@thetaphi.de> on 2017/10/03 13:44:02 UTC
[JENKINS] Lucene-Solr-7.0-Linux (32bit/jdk1.8.0_144) - Build # 413
- Still Unstable!
Build: https://jenkins.thetaphi.de/job/Lucene-Solr-7.0-Linux/413/
Java: 32bit/jdk1.8.0_144 -server -XX:+UseSerialGC
3 tests failed.
FAILED: org.apache.lucene.codecs.blockterms.TestVarGapFixedIntervalPostingsFormat.testRamBytesUsed
Error Message:
Stack Trace:
java.lang.AssertionError
at __randomizedtesting.SeedInfo.seed([472976B94B63016:F6D1852B5EC92F40]:0)
at org.apache.lucene.codecs.blockterms.BlockTermsReader$FieldReader$SegmentTermsEnum.seekCeil(BlockTermsReader.java:412)
at org.apache.lucene.index.Terms.getMax(Terms.java:193)
at org.apache.lucene.index.CheckIndex.checkFields(CheckIndex.java:1276)
at org.apache.lucene.index.CheckIndex.testPostings(CheckIndex.java:1771)
at org.apache.lucene.index.CheckIndex.checkIndex(CheckIndex.java:747)
at org.apache.lucene.util.TestUtil.checkIndex(TestUtil.java:300)
at org.apache.lucene.store.MockDirectoryWrapper.close(MockDirectoryWrapper.java:865)
at org.apache.lucene.index.BaseIndexFileFormatTestCase.testRamBytesUsed(BaseIndexFileFormatTestCase.java:299)
at org.apache.lucene.index.BasePostingsFormatTestCase.testRamBytesUsed(BasePostingsFormatTestCase.java:85)
at sun.reflect.NativeMethodAccessorImpl.invoke0(Native Method)
at sun.reflect.NativeMethodAccessorImpl.invoke(NativeMethodAccessorImpl.java:62)
at sun.reflect.DelegatingMethodAccessorImpl.invoke(DelegatingMethodAccessorImpl.java:43)
at java.lang.reflect.Method.invoke(Method.java:498)
at com.carrotsearch.randomizedtesting.RandomizedRunner.invoke(RandomizedRunner.java:1713)
at com.carrotsearch.randomizedtesting.RandomizedRunner$8.evaluate(RandomizedRunner.java:907)
at com.carrotsearch.randomizedtesting.RandomizedRunner$9.evaluate(RandomizedRunner.java:943)
at com.carrotsearch.randomizedtesting.RandomizedRunner$10.evaluate(RandomizedRunner.java:957)
at org.apache.lucene.util.TestRuleSetupTeardownChained$1.evaluate(TestRuleSetupTeardownChained.java:49)
at org.apache.lucene.util.AbstractBeforeAfterRule$1.evaluate(AbstractBeforeAfterRule.java:45)
at org.apache.lucene.util.TestRuleThreadAndTestName$1.evaluate(TestRuleThreadAndTestName.java:48)
at org.apache.lucene.util.TestRuleIgnoreAfterMaxFailures$1.evaluate(TestRuleIgnoreAfterMaxFailures.java:64)
at org.apache.lucene.util.TestRuleMarkFailure$1.evaluate(TestRuleMarkFailure.java:47)
at com.carrotsearch.randomizedtesting.rules.StatementAdapter.evaluate(StatementAdapter.java:36)
at com.carrotsearch.randomizedtesting.ThreadLeakControl$StatementRunner.run(ThreadLeakControl.java:368)
at com.carrotsearch.randomizedtesting.ThreadLeakControl.forkTimeoutingTask(ThreadLeakControl.java:817)
at com.carrotsearch.randomizedtesting.ThreadLeakControl$3.evaluate(ThreadLeakControl.java:468)
at com.carrotsearch.randomizedtesting.RandomizedRunner.runSingleTest(RandomizedRunner.java:916)
at com.carrotsearch.randomizedtesting.RandomizedRunner$5.evaluate(RandomizedRunner.java:802)
at com.carrotsearch.randomizedtesting.RandomizedRunner$6.evaluate(RandomizedRunner.java:852)
at com.carrotsearch.randomizedtesting.RandomizedRunner$7.evaluate(RandomizedRunner.java:863)
at org.apache.lucene.util.AbstractBeforeAfterRule$1.evaluate(AbstractBeforeAfterRule.java:45)
at com.carrotsearch.randomizedtesting.rules.StatementAdapter.evaluate(StatementAdapter.java:36)
at org.apache.lucene.util.TestRuleStoreClassName$1.evaluate(TestRuleStoreClassName.java:41)
at com.carrotsearch.randomizedtesting.rules.NoShadowingOrOverridesOnMethodsRule$1.evaluate(NoShadowingOrOverridesOnMethodsRule.java:40)
at com.carrotsearch.randomizedtesting.rules.NoShadowingOrOverridesOnMethodsRule$1.evaluate(NoShadowingOrOverridesOnMethodsRule.java:40)
at com.carrotsearch.randomizedtesting.rules.StatementAdapter.evaluate(StatementAdapter.java:36)
at com.carrotsearch.randomizedtesting.rules.StatementAdapter.evaluate(StatementAdapter.java:36)
at com.carrotsearch.randomizedtesting.rules.StatementAdapter.evaluate(StatementAdapter.java:36)
at org.apache.lucene.util.TestRuleAssertionsRequired$1.evaluate(TestRuleAssertionsRequired.java:53)
at org.apache.lucene.util.TestRuleMarkFailure$1.evaluate(TestRuleMarkFailure.java:47)
at org.apache.lucene.util.TestRuleIgnoreAfterMaxFailures$1.evaluate(TestRuleIgnoreAfterMaxFailures.java:64)
at org.apache.lucene.util.TestRuleIgnoreTestSuites$1.evaluate(TestRuleIgnoreTestSuites.java:54)
at com.carrotsearch.randomizedtesting.rules.StatementAdapter.evaluate(StatementAdapter.java:36)
at com.carrotsearch.randomizedtesting.ThreadLeakControl$StatementRunner.run(ThreadLeakControl.java:368)
at java.lang.Thread.run(Thread.java:748)
FAILED: org.apache.lucene.codecs.blockterms.TestVarGapFixedIntervalPostingsFormat.testDocsAndFreqs
Error Message:
Captured an uncaught exception in thread: Thread[id=561, name=Thread-537, state=RUNNABLE, group=TGRP-TestVarGapFixedIntervalPostingsFormat]
Stack Trace:
com.carrotsearch.randomizedtesting.UncaughtExceptionError: Captured an uncaught exception in thread: Thread[id=561, name=Thread-537, state=RUNNABLE, group=TGRP-TestVarGapFixedIntervalPostingsFormat]
Caused by: java.lang.RuntimeException: java.lang.ArrayIndexOutOfBoundsException: 0
at __randomizedtesting.SeedInfo.seed([472976B94B63016]:0)
at org.apache.lucene.index.RandomPostingsTester$TestThread.run(RandomPostingsTester.java:1006)
Caused by: java.lang.ArrayIndexOutOfBoundsException: 0
at org.apache.lucene.util.BytesRefBuilder.byteAt(BytesRefBuilder.java:52)
at org.apache.lucene.codecs.blockterms.BlockTermsReader$FieldReader$SegmentTermsEnum.seekCeil(BlockTermsReader.java:449)
at org.apache.lucene.index.FilteredTermsEnum.next(FilteredTermsEnum.java:216)
at org.apache.lucene.index.RandomPostingsTester.testTermsOneThread(RandomPostingsTester.java:1195)
at org.apache.lucene.index.RandomPostingsTester.access$000(RandomPostingsTester.java:61)
at org.apache.lucene.index.RandomPostingsTester$TestThread.run(RandomPostingsTester.java:1004)
FAILED: org.apache.lucene.codecs.blockterms.TestVarGapFixedIntervalPostingsFormat.testDocsOnly
Error Message:
Captured an uncaught exception in thread: Thread[id=570, name=Thread-546, state=RUNNABLE, group=TGRP-TestVarGapFixedIntervalPostingsFormat]
Stack Trace:
com.carrotsearch.randomizedtesting.UncaughtExceptionError: Captured an uncaught exception in thread: Thread[id=570, name=Thread-546, state=RUNNABLE, group=TGRP-TestVarGapFixedIntervalPostingsFormat]
Caused by: java.lang.RuntimeException: java.lang.ArrayIndexOutOfBoundsException: 0
at __randomizedtesting.SeedInfo.seed([472976B94B63016]:0)
at org.apache.lucene.index.RandomPostingsTester$TestThread.run(RandomPostingsTester.java:1006)
Caused by: java.lang.ArrayIndexOutOfBoundsException: 0
at org.apache.lucene.util.BytesRefBuilder.byteAt(BytesRefBuilder.java:52)
at org.apache.lucene.codecs.blockterms.BlockTermsReader$FieldReader$SegmentTermsEnum.seekCeil(BlockTermsReader.java:449)
at org.apache.lucene.index.FilteredTermsEnum.next(FilteredTermsEnum.java:216)
at org.apache.lucene.index.RandomPostingsTester.testTermsOneThread(RandomPostingsTester.java:1195)
at org.apache.lucene.index.RandomPostingsTester.access$000(RandomPostingsTester.java:61)
at org.apache.lucene.index.RandomPostingsTester$TestThread.run(RandomPostingsTester.java:1004)
Build Log:
[...truncated 6182 lines...]
[junit4] Suite: org.apache.lucene.codecs.blockterms.TestVarGapFixedIntervalPostingsFormat
[junit4] 2> NOTE: reproduce with: ant test -Dtestcase=TestVarGapFixedIntervalPostingsFormat -Dtests.method=testRamBytesUsed -Dtests.seed=472976B94B63016 -Dtests.multiplier=3 -Dtests.slow=true -Dtests.locale=de-CH -Dtests.timezone=Africa/Bamako -Dtests.asserts=true -Dtests.file.encoding=UTF-8
[junit4] FAILURE 3.84s J1 | TestVarGapFixedIntervalPostingsFormat.testRamBytesUsed <<<
[junit4] > Throwable #1: java.lang.AssertionError
[junit4] > at __randomizedtesting.SeedInfo.seed([472976B94B63016:F6D1852B5EC92F40]:0)
[junit4] > at org.apache.lucene.codecs.blockterms.BlockTermsReader$FieldReader$SegmentTermsEnum.seekCeil(BlockTermsReader.java:412)
[junit4] > at org.apache.lucene.index.Terms.getMax(Terms.java:193)
[junit4] > at org.apache.lucene.index.CheckIndex.checkFields(CheckIndex.java:1276)
[junit4] > at org.apache.lucene.index.CheckIndex.testPostings(CheckIndex.java:1771)
[junit4] > at org.apache.lucene.index.CheckIndex.checkIndex(CheckIndex.java:747)
[junit4] > at org.apache.lucene.util.TestUtil.checkIndex(TestUtil.java:300)
[junit4] > at org.apache.lucene.store.MockDirectoryWrapper.close(MockDirectoryWrapper.java:865)
[junit4] > at org.apache.lucene.index.BaseIndexFileFormatTestCase.testRamBytesUsed(BaseIndexFileFormatTestCase.java:299)
[junit4] > at org.apache.lucene.index.BasePostingsFormatTestCase.testRamBytesUsed(BasePostingsFormatTestCase.java:85)
[junit4] > at java.lang.Thread.run(Thread.java:748)
[junit4] 2> Okt 03, 2017 12:52:57 PM com.carrotsearch.randomizedtesting.RandomizedRunner$QueueUncaughtExceptionsHandler uncaughtException
[junit4] 2> WARNING: Uncaught exception in thread: Thread[Thread-537,5,TGRP-TestVarGapFixedIntervalPostingsFormat]
[junit4] 2> java.lang.RuntimeException: java.lang.ArrayIndexOutOfBoundsException: 0
[junit4] 2> at __randomizedtesting.SeedInfo.seed([472976B94B63016]:0)
[junit4] 2> at org.apache.lucene.index.RandomPostingsTester$TestThread.run(RandomPostingsTester.java:1006)
[junit4] 2> Caused by: java.lang.ArrayIndexOutOfBoundsException: 0
[junit4] 2> at org.apache.lucene.util.BytesRefBuilder.byteAt(BytesRefBuilder.java:52)
[junit4] 2> at org.apache.lucene.codecs.blockterms.BlockTermsReader$FieldReader$SegmentTermsEnum.seekCeil(BlockTermsReader.java:449)
[junit4] 2> at org.apache.lucene.index.FilteredTermsEnum.next(FilteredTermsEnum.java:216)
[junit4] 2> at org.apache.lucene.index.RandomPostingsTester.testTermsOneThread(RandomPostingsTester.java:1195)
[junit4] 2> at org.apache.lucene.index.RandomPostingsTester.access$000(RandomPostingsTester.java:61)
[junit4] 2> at org.apache.lucene.index.RandomPostingsTester$TestThread.run(RandomPostingsTester.java:1004)
[junit4] 2>
[junit4] 2> Okt 03, 2017 12:52:57 PM com.carrotsearch.randomizedtesting.RandomizedRunner$QueueUncaughtExceptionsHandler uncaughtException
[junit4] 2> WARNING: Uncaught exception in thread: Thread[Thread-536,5,TGRP-TestVarGapFixedIntervalPostingsFormat]
[junit4] 2> java.lang.RuntimeException: java.lang.ArrayIndexOutOfBoundsException: 0
[junit4] 2> at __randomizedtesting.SeedInfo.seed([472976B94B63016]:0)
[junit4] 2> at org.apache.lucene.index.RandomPostingsTester$TestThread.run(RandomPostingsTester.java:1006)
[junit4] 2> Caused by: java.lang.ArrayIndexOutOfBoundsException: 0
[junit4] 2> at org.apache.lucene.util.BytesRefBuilder.byteAt(BytesRefBuilder.java:52)
[junit4] 2> at org.apache.lucene.codecs.blockterms.BlockTermsReader$FieldReader$SegmentTermsEnum.seekCeil(BlockTermsReader.java:449)
[junit4] 2> at org.apache.lucene.index.FilteredTermsEnum.next(FilteredTermsEnum.java:216)
[junit4] 2> at org.apache.lucene.index.RandomPostingsTester.testTermsOneThread(RandomPostingsTester.java:1195)
[junit4] 2> at org.apache.lucene.index.RandomPostingsTester.access$000(RandomPostingsTester.java:61)
[junit4] 2> at org.apache.lucene.index.RandomPostingsTester$TestThread.run(RandomPostingsTester.java:1004)
[junit4] 2>
[junit4] 2> Okt 03, 2017 12:52:57 PM com.carrotsearch.randomizedtesting.RandomizedRunner$QueueUncaughtExceptionsHandler uncaughtException
[junit4] 2> WARNING: Uncaught exception in thread: Thread[Thread-539,5,TGRP-TestVarGapFixedIntervalPostingsFormat]
[junit4] 2> java.lang.RuntimeException: java.lang.ArrayIndexOutOfBoundsException: 0
[junit4] 2> at __randomizedtesting.SeedInfo.seed([472976B94B63016]:0)
[junit4] 2> at org.apache.lucene.index.RandomPostingsTester$TestThread.run(RandomPostingsTester.java:1006)
[junit4] 2> Caused by: java.lang.ArrayIndexOutOfBoundsException: 0
[junit4] 2> at org.apache.lucene.util.BytesRefBuilder.byteAt(BytesRefBuilder.java:52)
[junit4] 2> at org.apache.lucene.codecs.blockterms.BlockTermsReader$FieldReader$SegmentTermsEnum.seekCeil(BlockTermsReader.java:449)
[junit4] 2> at org.apache.lucene.index.FilteredTermsEnum.next(FilteredTermsEnum.java:216)
[junit4] 2> at org.apache.lucene.index.RandomPostingsTester.testTermsOneThread(RandomPostingsTester.java:1195)
[junit4] 2> at org.apache.lucene.index.RandomPostingsTester.access$000(RandomPostingsTester.java:61)
[junit4] 2> at org.apache.lucene.index.RandomPostingsTester$TestThread.run(RandomPostingsTester.java:1004)
[junit4] 2>
[junit4] 2> Okt 03, 2017 12:52:57 PM com.carrotsearch.randomizedtesting.RandomizedRunner$QueueUncaughtExceptionsHandler uncaughtException
[junit4] 2> WARNING: Uncaught exception in thread: Thread[Thread-542,5,TGRP-TestVarGapFixedIntervalPostingsFormat]
[junit4] 2> java.lang.RuntimeException: java.lang.ArrayIndexOutOfBoundsException: 0
[junit4] 2> at __randomizedtesting.SeedInfo.seed([472976B94B63016]:0)
[junit4] 2> at org.apache.lucene.index.RandomPostingsTester$TestThread.run(RandomPostingsTester.java:1006)
[junit4] 2> Caused by: java.lang.ArrayIndexOutOfBoundsException: 0
[junit4] 2> at org.apache.lucene.util.BytesRefBuilder.byteAt(BytesRefBuilder.java:52)
[junit4] 2> at org.apache.lucene.codecs.blockterms.BlockTermsReader$FieldReader$SegmentTermsEnum.seekCeil(BlockTermsReader.java:449)
[junit4] 2> at org.apache.lucene.index.FilteredTermsEnum.next(FilteredTermsEnum.java:216)
[junit4] 2> at org.apache.lucene.index.RandomPostingsTester.testTermsOneThread(RandomPostingsTester.java:1195)
[junit4] 2> at org.apache.lucene.index.RandomPostingsTester.access$000(RandomPostingsTester.java:61)
[junit4] 2> at org.apache.lucene.index.RandomPostingsTester$TestThread.run(RandomPostingsTester.java:1004)
[junit4] 2>
[junit4] 2> Okt 03, 2017 12:52:57 PM com.carrotsearch.randomizedtesting.RandomizedRunner$QueueUncaughtExceptionsHandler uncaughtException
[junit4] 2> WARNING: Uncaught exception in thread: Thread[Thread-541,5,TGRP-TestVarGapFixedIntervalPostingsFormat]
[junit4] 2> java.lang.RuntimeException: java.lang.ArrayIndexOutOfBoundsException: 0
[junit4] 2> at __randomizedtesting.SeedInfo.seed([472976B94B63016]:0)
[junit4] 2> at org.apache.lucene.index.RandomPostingsTester$TestThread.run(RandomPostingsTester.java:1006)
[junit4] 2> Caused by: java.lang.ArrayIndexOutOfBoundsException: 0
[junit4] 2> at org.apache.lucene.util.BytesRefBuilder.byteAt(BytesRefBuilder.java:52)
[junit4] 2> at org.apache.lucene.codecs.blockterms.BlockTermsReader$FieldReader$SegmentTermsEnum.seekCeil(BlockTermsReader.java:449)
[junit4] 2> at org.apache.lucene.index.FilteredTermsEnum.next(FilteredTermsEnum.java:216)
[junit4] 2> at org.apache.lucene.index.RandomPostingsTester.testTermsOneThread(RandomPostingsTester.java:1195)
[junit4] 2> at org.apache.lucene.index.RandomPostingsTester.access$000(RandomPostingsTester.java:61)
[junit4] 2> at org.apache.lucene.index.RandomPostingsTester$TestThread.run(RandomPostingsTester.java:1004)
[junit4] 2>
[junit4] 2> Okt 03, 2017 12:52:57 PM com.carrotsearch.randomizedtesting.RandomizedRunner$QueueUncaughtExceptionsHandler uncaughtException
[junit4] 2> WARNING: Uncaught exception in thread: Thread[Thread-543,5,TGRP-TestVarGapFixedIntervalPostingsFormat]
[junit4] 2> java.lang.RuntimeException: java.lang.ArrayIndexOutOfBoundsException: 0
[junit4] 2> at __randomizedtesting.SeedInfo.seed([472976B94B63016]:0)
[junit4] 2> at org.apache.lucene.index.RandomPostingsTester$TestThread.run(RandomPostingsTester.java:1006)
[junit4] 2> Caused by: java.lang.ArrayIndexOutOfBoundsException: 0
[junit4] 2> at org.apache.lucene.util.BytesRefBuilder.byteAt(BytesRefBuilder.java:52)
[junit4] 2> at org.apache.lucene.codecs.blockterms.BlockTermsReader$FieldReader$SegmentTermsEnum.seekCeil(BlockTermsReader.java:449)
[junit4] 2> at org.apache.lucene.index.FilteredTermsEnum.next(FilteredTermsEnum.java:216)
[junit4] 2> at org.apache.lucene.index.RandomPostingsTester.testTermsOneThread(RandomPostingsTester.java:1195)
[junit4] 2> at org.apache.lucene.index.RandomPostingsTester.access$000(RandomPostingsTester.java:61)
[junit4] 2> at org.apache.lucene.index.RandomPostingsTester$TestThread.run(RandomPostingsTester.java:1004)
[junit4] 2>
[junit4] 2> NOTE: reproduce with: ant test -Dtestcase=TestVarGapFixedIntervalPostingsFormat -Dtests.method=testDocsAndFreqs -Dtests.seed=472976B94B63016 -Dtests.multiplier=3 -Dtests.slow=true -Dtests.locale=de-CH -Dtests.timezone=Africa/Bamako -Dtests.asserts=true -Dtests.file.encoding=UTF-8
[junit4] ERROR 0.07s J1 | TestVarGapFixedIntervalPostingsFormat.testDocsAndFreqs <<<
[junit4] > Throwable #1: com.carrotsearch.randomizedtesting.UncaughtExceptionError: Captured an uncaught exception in thread: Thread[id=561, name=Thread-537, state=RUNNABLE, group=TGRP-TestVarGapFixedIntervalPostingsFormat]
[junit4] > Caused by: java.lang.RuntimeException: java.lang.ArrayIndexOutOfBoundsException: 0
[junit4] > at __randomizedtesting.SeedInfo.seed([472976B94B63016]:0)
[junit4] > at org.apache.lucene.index.RandomPostingsTester$TestThread.run(RandomPostingsTester.java:1006)
[junit4] > Caused by: java.lang.ArrayIndexOutOfBoundsException: 0
[junit4] > at org.apache.lucene.util.BytesRefBuilder.byteAt(BytesRefBuilder.java:52)
[junit4] > at org.apache.lucene.codecs.blockterms.BlockTermsReader$FieldReader$SegmentTermsEnum.seekCeil(BlockTermsReader.java:449)
[junit4] > at org.apache.lucene.index.FilteredTermsEnum.next(FilteredTermsEnum.java:216)
[junit4] > at org.apache.lucene.index.RandomPostingsTester.testTermsOneThread(RandomPostingsTester.java:1195)
[junit4] > at org.apache.lucene.index.RandomPostingsTester.access$000(RandomPostingsTester.java:61)
[junit4] > at org.apache.lucene.index.RandomPostingsTester$TestThread.run(RandomPostingsTester.java:1004)Throwable #2: com.carrotsearch.randomizedtesting.UncaughtExceptionError: Captured an uncaught exception in thread: Thread[id=560, name=Thread-536, state=RUNNABLE, group=TGRP-TestVarGapFixedIntervalPostingsFormat]
[junit4] > Caused by: java.lang.RuntimeException: java.lang.ArrayIndexOutOfBoundsException: 0
[junit4] > at __randomizedtesting.SeedInfo.seed([472976B94B63016]:0)
[junit4] > at org.apache.lucene.index.RandomPostingsTester$TestThread.run(RandomPostingsTester.java:1006)
[junit4] > Caused by: java.lang.ArrayIndexOutOfBoundsException: 0
[junit4] > at org.apache.lucene.util.BytesRefBuilder.byteAt(BytesRefBuilder.java:52)
[junit4] > at org.apache.lucene.codecs.blockterms.BlockTermsReader$FieldReader$SegmentTermsEnum.seekCeil(BlockTermsReader.java:449)
[junit4] > at org.apache.lucene.index.FilteredTermsEnum.next(FilteredTermsEnum.java:216)
[junit4] > at org.apache.lucene.index.RandomPostingsTester.testTermsOneThread(RandomPostingsTester.java:1195)
[junit4] > at org.apache.lucene.index.RandomPostingsTester.access$000(RandomPostingsTester.java:61)
[junit4] > at org.apache.lucene.index.RandomPostingsTester$TestThread.run(RandomPostingsTester.java:1004)Throwable #3: com.carrotsearch.randomizedtesting.UncaughtExceptionError: Captured an uncaught exception in thread: Thread[id=563, name=Thread-539, state=RUNNABLE, group=TGRP-TestVarGapFixedIntervalPostingsFormat]
[junit4] > Caused by: java.lang.RuntimeException: java.lang.ArrayIndexOutOfBoundsException: 0
[junit4] > at __randomizedtesting.SeedInfo.seed([472976B94B63016]:0)
[junit4] > at org.apache.lucene.index.RandomPostingsTester$TestThread.run(RandomPostingsTester.java:1006)
[junit4] > Caused by: java.lang.ArrayIndexOutOfBoundsException: 0
[junit4] > at org.apache.lucene.util.BytesRefBuilder.byteAt(BytesRefBuilder.java:52)
[junit4] > at org.apache.lucene.codecs.blockterms.BlockTermsReader$FieldReader$SegmentTermsEnum.seekCeil(BlockTermsReader.java:449)
[junit4] > at org.apache.lucene.index.FilteredTermsEnum.next(FilteredTermsEnum.java:216)
[junit4] > at org.apache.lucene.index.RandomPostingsTester.testTermsOneThread(RandomPostingsTester.java:1195)
[junit4] > at org.apache.lucene.index.RandomPostingsTester.access$000(RandomPostingsTester.java:61)
[junit4] > at org.apache.lucene.index.RandomPostingsTester$TestThread.run(RandomPostingsTester.java:1004)Throwable #4: com.carrotsearch.randomizedtesting.UncaughtExceptionError: Captured an uncaught exception in thread: Thread[id=566, name=Thread-542, state=RUNNABLE, group=TGRP-TestVarGapFixedIntervalPostingsFormat]
[junit4] > Caused by: java.lang.RuntimeException: java.lang.ArrayIndexOutOfBoundsException: 0
[junit4] > at __randomizedtesting.SeedInfo.seed([472976B94B63016]:0)
[junit4] > at org.apache.lucene.index.RandomPostingsTester$TestThread.run(RandomPostingsTester.java:1006)
[junit4] > Caused by: java.lang.ArrayIndexOutOfBoundsException: 0
[junit4] > at org.apache.lucene.util.BytesRefBuilder.byteAt(BytesRefBuilder.java:52)
[junit4] > at org.apache.lucene.codecs.blockterms.BlockTermsReader$FieldReader$SegmentTermsEnum.seekCeil(BlockTermsReader.java:449)
[junit4] > at org.apache.lucene.index.FilteredTermsEnum.next(FilteredTermsEnum.java:216)
[junit4] > at org.apache.lucene.index.RandomPostingsTester.testTermsOneThread(RandomPostingsTester.java:1195)
[junit4] > at org.apache.lucene.index.RandomPostingsTester.access$000(RandomPostingsTester.java:61)
[junit4] > at org.apache.lucene.index.RandomPostingsTester$TestThread.run(RandomPostingsTester.java:1004)Throwable #5: com.carrotsearch.randomizedtesting.UncaughtExceptionError: Captured an uncaught exception in thread: Thread[id=565, name=Thread-541, state=RUNNABLE, group=TGRP-TestVarGapFixedIntervalPostingsFormat]
[junit4] > Caused by: java.lang.RuntimeException: java.lang.ArrayIndexOutOfBoundsException: 0
[junit4] > at __randomizedtesting.SeedInfo.seed([472976B94B63016]:0)
[junit4] > at org.apache.lucene.index.RandomPostingsTester$TestThread.run(RandomPostingsTester.java:1006)
[junit4] > Caused by: java.lang.ArrayIndexOutOfBoundsException: 0
[junit4] > at org.apache.lucene.util.BytesRefBuilder.byteAt(BytesRefBuilder.java:52)
[junit4] > at org.apache.lucene.codecs.blockterms.BlockTermsReader$FieldReader$SegmentTermsEnum.seekCeil(BlockTermsReader.java:449)
[junit4] > at org.apache.lucene.index.FilteredTermsEnum.next(FilteredTermsEnum.java:216)
[junit4] > at org.apache.lucene.index.RandomPostingsTester.testTermsOneThread(RandomPostingsTester.java:1195)
[junit4] > at org.apache.lucene.index.RandomPostingsTester.access$000(RandomPostingsTester.java:61)
[junit4] > at org.apache.lucene.index.RandomPostingsTester$TestThread.run(RandomPostingsTester.java:1004)Throwable #6: com.carrotsearch.randomizedtesting.UncaughtExceptionError: Captured an uncaught exception in thread: Thread[id=567, name=Thread-543, state=RUNNABLE, group=TGRP-TestVarGapFixedIntervalPostingsFormat]
[junit4] > Caused by: java.lang.RuntimeException: java.lang.ArrayIndexOutOfBoundsException: 0
[junit4] > at __randomizedtesting.SeedInfo.seed([472976B94B63016]:0)
[junit4] > at org.apache.lucene.index.RandomPostingsTester$TestThread.run(RandomPostingsTester.java:1006)
[junit4] > Caused by: java.lang.ArrayIndexOutOfBoundsException: 0
[junit4] > at org.apache.lucene.util.BytesRefBuilder.byteAt(BytesRefBuilder.java:52)
[junit4] > at org.apache.lucene.codecs.blockterms.BlockTermsReader$FieldReader$SegmentTermsEnum.seekCeil(BlockTermsReader.java:449)
[junit4] > at org.apache.lucene.index.FilteredTermsEnum.next(FilteredTermsEnum.java:216)
[junit4] > at org.apache.lucene.index.RandomPostingsTester.testTermsOneThread(RandomPostingsTester.java:1195)
[junit4] > at org.apache.lucene.index.RandomPostingsTester.access$000(RandomPostingsTester.java:61)
[junit4] > at org.apache.lucene.index.RandomPostingsTester$TestThread.run(RandomPostingsTester.java:1004)
[junit4] 2> Okt 03, 2017 12:52:57 PM com.carrotsearch.randomizedtesting.RandomizedRunner$QueueUncaughtExceptionsHandler uncaughtException
[junit4] 2> WARNING: Uncaught exception in thread: Thread[Thread-546,5,TGRP-TestVarGapFixedIntervalPostingsFormat]
[junit4] 2> java.lang.RuntimeException: java.lang.ArrayIndexOutOfBoundsException: 0
[junit4] 2> at __randomizedtesting.SeedInfo.seed([472976B94B63016]:0)
[junit4] 2> at org.apache.lucene.index.RandomPostingsTester$TestThread.run(RandomPostingsTester.java:1006)
[junit4] 2> Caused by: java.lang.ArrayIndexOutOfBoundsException: 0
[junit4] 2> at org.apache.lucene.util.BytesRefBuilder.byteAt(BytesRefBuilder.java:52)
[junit4] 2> at org.apache.lucene.codecs.blockterms.BlockTermsReader$FieldReader$SegmentTermsEnum.seekCeil(BlockTermsReader.java:449)
[junit4] 2> at org.apache.lucene.index.FilteredTermsEnum.next(FilteredTermsEnum.java:216)
[junit4] 2> at org.apache.lucene.index.RandomPostingsTester.testTermsOneThread(RandomPostingsTester.java:1195)
[junit4] 2> at org.apache.lucene.index.RandomPostingsTester.access$000(RandomPostingsTester.java:61)
[junit4] 2> at org.apache.lucene.index.RandomPostingsTester$TestThread.run(RandomPostingsTester.java:1004)
[junit4] 2>
[junit4] 2> Okt 03, 2017 12:52:57 PM com.carrotsearch.randomizedtesting.RandomizedRunner$QueueUncaughtExceptionsHandler uncaughtException
[junit4] 2> WARNING: Uncaught exception in thread: Thread[Thread-547,5,TGRP-TestVarGapFixedIntervalPostingsFormat]
[junit4] 2> java.lang.RuntimeException: java.lang.ArrayIndexOutOfBoundsException: 0
[junit4] 2> at __randomizedtesting.SeedInfo.seed([472976B94B63016]:0)
[junit4] 2> at org.apache.lucene.index.RandomPostingsTester$TestThread.run(RandomPostingsTester.java:1006)
[junit4] 2> Caused by: java.lang.ArrayIndexOutOfBoundsException: 0
[junit4] 2> at org.apache.lucene.util.BytesRefBuilder.byteAt(BytesRefBuilder.java:52)
[junit4] 2> at org.apache.lucene.codecs.blockterms.BlockTermsReader$FieldReader$SegmentTermsEnum.seekCeil(BlockTermsReader.java:449)
[junit4] 2> at org.apache.lucene.index.FilteredTermsEnum.next(FilteredTermsEnum.java:216)
[junit4] 2> at org.apache.lucene.index.RandomPostingsTester.testTermsOneThread(RandomPostingsTester.java:1195)
[junit4] 2> at org.apache.lucene.index.RandomPostingsTester.access$000(RandomPostingsTester.java:61)
[junit4] 2> at org.apache.lucene.index.RandomPostingsTester$TestThread.run(RandomPostingsTester.java:1004)
[junit4] 2>
[junit4] 2> Okt 03, 2017 12:52:57 PM com.carrotsearch.randomizedtesting.RandomizedRunner$QueueUncaughtExceptionsHandler uncaughtException
[junit4] 2> WARNING: Uncaught exception in thread: Thread[Thread-548,5,TGRP-TestVarGapFixedIntervalPostingsFormat]
[junit4] 2> java.lang.RuntimeException: java.lang.ArrayIndexOutOfBoundsException: 0
[junit4] 2> at __randomizedtesting.SeedInfo.seed([472976B94B63016]:0)
[junit4] 2> at org.apache.lucene.index.RandomPostingsTester$TestThread.run(RandomPostingsTester.java:1006)
[junit4] 2> Caused by: java.lang.ArrayIndexOutOfBoundsException: 0
[junit4] 2> at org.apache.lucene.util.BytesRefBuilder.byteAt(BytesRefBuilder.java:52)
[junit4] 2> at org.apache.lucene.codecs.blockterms.BlockTermsReader$FieldReader$SegmentTermsEnum.seekCeil(BlockTermsReader.java:449)
[junit4] 2> at org.apache.lucene.index.FilteredTermsEnum.next(FilteredTermsEnum.java:216)
[junit4] 2> at org.apache.lucene.index.RandomPostingsTester.testTermsOneThread(RandomPostingsTester.java:1195)
[junit4] 2> at org.apache.lucene.index.RandomPostingsTester.access$000(RandomPostingsTester.java:61)
[junit4] 2> at org.apache.lucene.index.RandomPostingsTester$TestThread.run(RandomPostingsTester.java:1004)
[junit4] 2>
[junit4] 2> Okt 03, 2017 12:52:57 PM com.carrotsearch.randomizedtesting.RandomizedRunner$QueueUncaughtExceptionsHandler uncaughtException
[junit4] 2> WARNING: Uncaught exception in thread: Thread[Thread-549,5,TGRP-TestVarGapFixedIntervalPostingsFormat]
[junit4] 2> java.lang.RuntimeException: java.lang.ArrayIndexOutOfBoundsException: 0
[junit4] 2> at __randomizedtesting.SeedInfo.seed([472976B94B63016]:0)
[junit4] 2> at org.apache.lucene.index.RandomPostingsTester$TestThread.run(RandomPostingsTester.java:1006)
[junit4] 2> Caused by: java.lang.ArrayIndexOutOfBoundsException: 0
[junit4] 2> at org.apache.lucene.util.BytesRefBuilder.byteAt(BytesRefBuilder.java:52)
[junit4] 2> at org.apache.lucene.codecs.blockterms.BlockTermsReader$FieldReader$SegmentTermsEnum.seekCeil(BlockTermsReader.java:449)
[junit4] 2> at org.apache.lucene.index.FilteredTermsEnum.next(FilteredTermsEnum.java:216)
[junit4] 2> at org.apache.lucene.index.RandomPostingsTester.testTermsOneThread(RandomPostingsTester.java:1195)
[junit4] 2> at org.apache.lucene.index.RandomPostingsTester.access$000(RandomPostingsTester.java:61)
[junit4] 2> at org.apache.lucene.index.RandomPostingsTester$TestThread.run(RandomPostingsTester.java:1004)
[junit4] 2>
[junit4] 2> Okt 03, 2017 12:52:57 PM com.carrotsearch.randomizedtesting.RandomizedRunner$QueueUncaughtExceptionsHandler uncaughtException
[junit4] 2> WARNING: Uncaught exception in thread: Thread[Thread-550,5,TGRP-TestVarGapFixedIntervalPostingsFormat]
[junit4] 2> java.lang.RuntimeException: java.lang.ArrayIndexOutOfBoundsException: 0
[junit4] 2> at __randomizedtesting.SeedInfo.seed([472976B94B63016]:0)
[junit4] 2> at org.apache.lucene.index.RandomPostingsTester$TestThread.run(RandomPostingsTester.java:1006)
[junit4] 2> Caused by: java.lang.ArrayIndexOutOfBoundsException: 0
[junit4] 2> at org.apache.lucene.util.BytesRefBuilder.byteAt(BytesRefBuilder.java:52)
[junit4] 2> at org.apache.lucene.codecs.blockterms.BlockTermsReader$FieldReader$SegmentTermsEnum.seekCeil(BlockTermsReader.java:449)
[junit4] 2> at org.apache.lucene.index.FilteredTermsEnum.next(FilteredTermsEnum.java:216)
[junit4] 2> at org.apache.lucene.index.RandomPostingsTester.testTermsOneThread(RandomPostingsTester.java:1195)
[junit4] 2> at org.apache.lucene.index.RandomPostingsTester.access$000(RandomPostingsTester.java:61)
[junit4] 2> at org.apache.lucene.index.RandomPostingsTester$TestThread.run(RandomPostingsTester.java:1004)
[junit4] 2>
[junit4] 2> NOTE: reproduce with: ant test -Dtestcase=TestVarGapFixedIntervalPostingsFormat -Dtests.method=testDocsOnly -Dtests.seed=472976B94B63016 -Dtests.multiplier=3 -Dtests.slow=true -Dtests.locale=de-CH -Dtests.timezone=Africa/Bamako -Dtests.asserts=true -Dtests.file.encoding=UTF-8
[junit4] ERROR 0.04s J1 | TestVarGapFixedIntervalPostingsFormat.testDocsOnly <<<
[junit4] > Throwable #1: com.carrotsearch.randomizedtesting.UncaughtExceptionError: Captured an uncaught exception in thread: Thread[id=570, name=Thread-546, state=RUNNABLE, group=TGRP-TestVarGapFixedIntervalPostingsFormat]
[junit4] > Caused by: java.lang.RuntimeException: java.lang.ArrayIndexOutOfBoundsException: 0
[junit4] > at __randomizedtesting.SeedInfo.seed([472976B94B63016]:0)
[junit4] > at org.apache.lucene.index.RandomPostingsTester$TestThread.run(RandomPostingsTester.java:1006)
[junit4] > Caused by: java.lang.ArrayIndexOutOfBoundsException: 0
[junit4] > at org.apache.lucene.util.BytesRefBuilder.byteAt(BytesRefBuilder.java:52)
[junit4] > at org.apache.lucene.codecs.blockterms.BlockTermsReader$FieldReader$SegmentTermsEnum.seekCeil(BlockTermsReader.java:449)
[junit4] > at org.apache.lucene.index.FilteredTermsEnum.next(FilteredTermsEnum.java:216)
[junit4] > at org.apache.lucene.index.RandomPostingsTester.testTermsOneThread(RandomPostingsTester.java:1195)
[junit4] > at org.apache.lucene.index.RandomPostingsTester.access$000(RandomPostingsTester.java:61)
[junit4] > at org.apache.lucene.index.RandomPostingsTester$TestThread.run(RandomPostingsTester.java:1004)Throwable #2: com.carrotsearch.randomizedtesting.UncaughtExceptionError: Captured an uncaught exception in thread: Thread[id=571, name=Thread-547, state=RUNNABLE, group=TGRP-TestVarGapFixedIntervalPostingsFormat]
[junit4] > Caused by: java.lang.RuntimeException: java.lang.ArrayIndexOutOfBoundsException: 0
[junit4] > at __randomizedtesting.SeedInfo.seed([472976B94B63016]:0)
[junit4] > at org.apache.lucene.index.RandomPostingsTester$TestThread.run(RandomPostingsTester.java:1006)
[junit4] > Caused by: java.lang.ArrayIndexOutOfBoundsException: 0
[junit4] > at org.apache.lucene.util.BytesRefBuilder.byteAt(BytesRefBuilder.java:52)
[junit4] > at org.apache.lucene.codecs.blockterms.BlockTermsReader$FieldReader$SegmentTermsEnum.seekCeil(BlockTermsReader.java:449)
[junit4] > at org.apache.lucene.index.FilteredTermsEnum.next(FilteredTermsEnum.java:216)
[junit4] > at org.apache.lucene.index.RandomPostingsTester.testTermsOneThread(RandomPostingsTester.java:1195)
[junit4] > at org.apache.lucene.index.RandomPostingsTester.access$000(RandomPostingsTester.java:61)
[junit4] > at org.apache.lucene.index.RandomPostingsTester$TestThread.run(RandomPostingsTester.java:1004)Throwable #3: com.carrotsearch.randomizedtesting.UncaughtExceptionError: Captured an uncaught exception in thread: Thread[id=572, name=Thread-548, state=RUNNABLE, group=TGRP-TestVarGapFixedIntervalPostingsFormat]
[junit4] > Caused by: java.lang.RuntimeException: java.lang.ArrayIndexOutOfBoundsException: 0
[junit4] > at __randomizedtesting.SeedInfo.seed([472976B94B63016]:0)
[junit4] > at org.apache.lucene.index.RandomPostingsTester$TestThread.run(RandomPostingsTester.java:1006)
[junit4] > Caused by: java.lang.ArrayIndexOutOfBoundsException: 0
[junit4] > at org.apache.lucene.util.BytesRefBuilder.byteAt(BytesRefBuilder.java:52)
[junit4] > at org.apache.lucene.codecs.blockterms.BlockTermsReader$FieldReader$SegmentTermsEnum.seekCeil(BlockTermsReader.java:449)
[junit4] > at org.apache.lucene.index.FilteredTermsEnum.next(FilteredTermsEnum.java:216)
[junit4] > at org.apache.lucene.index.RandomPostingsTester.testTermsOneThread(RandomPostingsTester.java:1195)
[junit4] > at org.apache.lucene.index.RandomPostingsTester.access$000(RandomPostingsTester.java:61)
[junit4] > at org.apache.lucene.index.RandomPostingsTester$TestThread.run(RandomPostingsTester.java:1004)Throwable #4: com.carrotsearch.randomizedtesting.UncaughtExceptionError: Captured an uncaught exception in thread: Thread[id=573, name=Thread-549, state=RUNNABLE, group=TGRP-TestVarGapFixedIntervalPostingsFormat]
[junit4] > Caused by: java.lang.RuntimeException: java.lang.ArrayIndexOutOfBoundsException: 0
[junit4] > at __randomizedtesting.SeedInfo.seed([472976B94B63016]:0)
[junit4] > at org.apache.lucene.index.RandomPostingsTester$TestThread.run(RandomPostingsTester.java:1006)
[junit4] > Caused by: java.lang.ArrayIndexOutOfBoundsException: 0
[junit4] > at org.apache.lucene.util.BytesRefBuilder.byteAt(BytesRefBuilder.java:52)
[junit4] > at org.apache.lucene.codecs.blockterms.BlockTermsReader$FieldReader$SegmentTermsEnum.seekCeil(BlockTermsReader.java:449)
[junit4] > at org.apache.lucene.index.FilteredTermsEnum.next(FilteredTermsEnum.java:216)
[junit4] > at org.apache.lucene.index.RandomPostingsTester.testTermsOneThread(RandomPostingsTester.java:1195)
[junit4] > at org.apache.lucene.index.RandomPostingsTester.access$000(RandomPostingsTester.java:61)
[junit4] > at org.apache.lucene.index.RandomPostingsTester$TestThread.run(RandomPostingsTester.java:1004)Throwable #5: com.carrotsearch.randomizedtesting.UncaughtExceptionError: Captured an uncaught exception in thread: Thread[id=574, name=Thread-550, state=RUNNABLE, group=TGRP-TestVarGapFixedIntervalPostingsFormat]
[junit4] > Caused by: java.lang.RuntimeException: java.lang.ArrayIndexOutOfBoundsException: 0
[junit4] > at __randomizedtesting.SeedInfo.seed([472976B94B63016]:0)
[junit4] > at org.apache.lucene.index.RandomPostingsTester$TestThread.run(RandomPostingsTester.java:1006)
[junit4] > Caused by: java.lang.ArrayIndexOutOfBoundsException: 0
[junit4] > at org.apache.lucene.util.BytesRefBuilder.byteAt(BytesRefBuilder.java:52)
[junit4] > at org.apache.lucene.codecs.blockterms.BlockTermsReader$FieldReader$SegmentTermsEnum.seekCeil(BlockTermsReader.java:449)
[junit4] > at org.apache.lucene.index.FilteredTermsEnum.next(FilteredTermsEnum.java:216)
[junit4] > at org.apache.lucene.index.RandomPostingsTester.testTermsOneThread(RandomPostingsTester.java:1195)
[junit4] > at org.apache.lucene.index.RandomPostingsTester.access$000(RandomPostingsTester.java:61)
[junit4] > at org.apache.lucene.index.RandomPostingsTester$TestThread.run(RandomPostingsTester.java:1004)
[junit4] 2> NOTE: leaving temporary files on disk at: /home/jenkins/workspace/Lucene-Solr-7.0-Linux/lucene/build/codecs/test/J1/temp/lucene.codecs.blockterms.TestVarGapFixedIntervalPostingsFormat_472976B94B63016-001
[junit4] 2> NOTE: test params are: codec=HighCompressionCompressingStoredFields(storedFieldsFormat=CompressingStoredFieldsFormat(compressionMode=HIGH_COMPRESSION, chunkSize=23087, maxDocsPerChunk=8, blockSize=4), termVectorsFormat=CompressingTermVectorsFormat(compressionMode=HIGH_COMPRESSION, chunkSize=23087, blockSize=4)), sim=RandomSimilarity(queryNorm=false): {f_DOCS_AND_FREQS=DFI(ChiSquared), field=IB SPL-L2, f_DOCS_AND_FREQS_AND_POSITIONS_AND_OFFSETS=DFR I(F)B2, f_DOCS_AND_FREQS_AND_POSITIONS=DFI(ChiSquared), body=DFR I(n)3(800.0), f_DOCS=DFR I(ne)BZ(0.3)}, locale=de-CH, timezone=Africa/Bamako
[junit4] 2> NOTE: Linux 4.10.0-33-generic i386/Oracle Corporation 1.8.0_144 (32-bit)/cpus=8,threads=1,free=39915496,total=64946176
[junit4] 2> NOTE: All tests run in this JVM: [TestFSTOrdPostingsFormat, TestSimpleTextCompoundFormat, TestSimpleTextPointsFormat, TestMemoryPostingsFormat, TestFixedGapPostingsFormat, TestSimpleTextPostingsFormat, TestVarGapFixedIntervalPostingsFormat]
[junit4] Completed [15/20 (1!)] on J1 in 7.49s, 25 tests, 1 failure, 2 errors <<< FAILURES!
[...truncated 46768 lines...]
[JENKINS] Lucene-Solr-7.0-Linux (32bit/jdk1.8.0_144) - Build # 414
- Still Unstable!
Posted by Policeman Jenkins Server <je...@thetaphi.de>.
Build: https://jenkins.thetaphi.de/job/Lucene-Solr-7.0-Linux/414/
Java: 32bit/jdk1.8.0_144 -server -XX:+UseParallelGC
1 tests failed.
FAILED: junit.framework.TestSuite.org.apache.solr.cloud.TestSolrCloudWithSecureImpersonation
Error Message:
2 threads leaked from SUITE scope at org.apache.solr.cloud.TestSolrCloudWithSecureImpersonation: 1) Thread[id=2202, name=jetty-launcher-288-thread-2-EventThread, state=TIMED_WAITING, group=TGRP-TestSolrCloudWithSecureImpersonation] at sun.misc.Unsafe.park(Native Method) at java.util.concurrent.locks.LockSupport.parkNanos(LockSupport.java:215) at java.util.concurrent.locks.AbstractQueuedSynchronizer.doAcquireSharedNanos(AbstractQueuedSynchronizer.java:1037) at java.util.concurrent.locks.AbstractQueuedSynchronizer.tryAcquireSharedNanos(AbstractQueuedSynchronizer.java:1328) at java.util.concurrent.CountDownLatch.await(CountDownLatch.java:277) at org.apache.curator.CuratorZookeeperClient.internalBlockUntilConnectedOrTimedOut(CuratorZookeeperClient.java:323) at org.apache.curator.RetryLoop.callWithRetry(RetryLoop.java:105) at org.apache.curator.framework.imps.GetDataBuilderImpl.pathInForeground(GetDataBuilderImpl.java:288) at org.apache.curator.framework.imps.GetDataBuilderImpl.forPath(GetDataBuilderImpl.java:279) at org.apache.curator.framework.imps.GetDataBuilderImpl.forPath(GetDataBuilderImpl.java:41) at org.apache.curator.framework.recipes.shared.SharedValue.readValue(SharedValue.java:244) at org.apache.curator.framework.recipes.shared.SharedValue.access$100(SharedValue.java:44) at org.apache.curator.framework.recipes.shared.SharedValue$1.process(SharedValue.java:61) at org.apache.curator.framework.imps.NamespaceWatcher.process(NamespaceWatcher.java:67) at org.apache.zookeeper.ClientCnxn$EventThread.processEvent(ClientCnxn.java:530) at org.apache.zookeeper.ClientCnxn$EventThread.run(ClientCnxn.java:505) 2) Thread[id=2209, name=jetty-launcher-288-thread-1-EventThread, state=TIMED_WAITING, group=TGRP-TestSolrCloudWithSecureImpersonation] at sun.misc.Unsafe.park(Native Method) at java.util.concurrent.locks.LockSupport.parkNanos(LockSupport.java:215) at java.util.concurrent.locks.AbstractQueuedSynchronizer.doAcquireSharedNanos(AbstractQueuedSynchronizer.java:1037) at java.util.concurrent.locks.AbstractQueuedSynchronizer.tryAcquireSharedNanos(AbstractQueuedSynchronizer.java:1328) at java.util.concurrent.CountDownLatch.await(CountDownLatch.java:277) at org.apache.curator.CuratorZookeeperClient.internalBlockUntilConnectedOrTimedOut(CuratorZookeeperClient.java:323) at org.apache.curator.RetryLoop.callWithRetry(RetryLoop.java:105) at org.apache.curator.framework.imps.GetDataBuilderImpl.pathInForeground(GetDataBuilderImpl.java:288) at org.apache.curator.framework.imps.GetDataBuilderImpl.forPath(GetDataBuilderImpl.java:279) at org.apache.curator.framework.imps.GetDataBuilderImpl.forPath(GetDataBuilderImpl.java:41) at org.apache.curator.framework.recipes.shared.SharedValue.readValue(SharedValue.java:244) at org.apache.curator.framework.recipes.shared.SharedValue.access$100(SharedValue.java:44) at org.apache.curator.framework.recipes.shared.SharedValue$1.process(SharedValue.java:61) at org.apache.curator.framework.imps.NamespaceWatcher.process(NamespaceWatcher.java:67) at org.apache.zookeeper.ClientCnxn$EventThread.processEvent(ClientCnxn.java:530) at org.apache.zookeeper.ClientCnxn$EventThread.run(ClientCnxn.java:505)
Stack Trace:
com.carrotsearch.randomizedtesting.ThreadLeakError: 2 threads leaked from SUITE scope at org.apache.solr.cloud.TestSolrCloudWithSecureImpersonation:
1) Thread[id=2202, name=jetty-launcher-288-thread-2-EventThread, state=TIMED_WAITING, group=TGRP-TestSolrCloudWithSecureImpersonation]
at sun.misc.Unsafe.park(Native Method)
at java.util.concurrent.locks.LockSupport.parkNanos(LockSupport.java:215)
at java.util.concurrent.locks.AbstractQueuedSynchronizer.doAcquireSharedNanos(AbstractQueuedSynchronizer.java:1037)
at java.util.concurrent.locks.AbstractQueuedSynchronizer.tryAcquireSharedNanos(AbstractQueuedSynchronizer.java:1328)
at java.util.concurrent.CountDownLatch.await(CountDownLatch.java:277)
at org.apache.curator.CuratorZookeeperClient.internalBlockUntilConnectedOrTimedOut(CuratorZookeeperClient.java:323)
at org.apache.curator.RetryLoop.callWithRetry(RetryLoop.java:105)
at org.apache.curator.framework.imps.GetDataBuilderImpl.pathInForeground(GetDataBuilderImpl.java:288)
at org.apache.curator.framework.imps.GetDataBuilderImpl.forPath(GetDataBuilderImpl.java:279)
at org.apache.curator.framework.imps.GetDataBuilderImpl.forPath(GetDataBuilderImpl.java:41)
at org.apache.curator.framework.recipes.shared.SharedValue.readValue(SharedValue.java:244)
at org.apache.curator.framework.recipes.shared.SharedValue.access$100(SharedValue.java:44)
at org.apache.curator.framework.recipes.shared.SharedValue$1.process(SharedValue.java:61)
at org.apache.curator.framework.imps.NamespaceWatcher.process(NamespaceWatcher.java:67)
at org.apache.zookeeper.ClientCnxn$EventThread.processEvent(ClientCnxn.java:530)
at org.apache.zookeeper.ClientCnxn$EventThread.run(ClientCnxn.java:505)
2) Thread[id=2209, name=jetty-launcher-288-thread-1-EventThread, state=TIMED_WAITING, group=TGRP-TestSolrCloudWithSecureImpersonation]
at sun.misc.Unsafe.park(Native Method)
at java.util.concurrent.locks.LockSupport.parkNanos(LockSupport.java:215)
at java.util.concurrent.locks.AbstractQueuedSynchronizer.doAcquireSharedNanos(AbstractQueuedSynchronizer.java:1037)
at java.util.concurrent.locks.AbstractQueuedSynchronizer.tryAcquireSharedNanos(AbstractQueuedSynchronizer.java:1328)
at java.util.concurrent.CountDownLatch.await(CountDownLatch.java:277)
at org.apache.curator.CuratorZookeeperClient.internalBlockUntilConnectedOrTimedOut(CuratorZookeeperClient.java:323)
at org.apache.curator.RetryLoop.callWithRetry(RetryLoop.java:105)
at org.apache.curator.framework.imps.GetDataBuilderImpl.pathInForeground(GetDataBuilderImpl.java:288)
at org.apache.curator.framework.imps.GetDataBuilderImpl.forPath(GetDataBuilderImpl.java:279)
at org.apache.curator.framework.imps.GetDataBuilderImpl.forPath(GetDataBuilderImpl.java:41)
at org.apache.curator.framework.recipes.shared.SharedValue.readValue(SharedValue.java:244)
at org.apache.curator.framework.recipes.shared.SharedValue.access$100(SharedValue.java:44)
at org.apache.curator.framework.recipes.shared.SharedValue$1.process(SharedValue.java:61)
at org.apache.curator.framework.imps.NamespaceWatcher.process(NamespaceWatcher.java:67)
at org.apache.zookeeper.ClientCnxn$EventThread.processEvent(ClientCnxn.java:530)
at org.apache.zookeeper.ClientCnxn$EventThread.run(ClientCnxn.java:505)
at __randomizedtesting.SeedInfo.seed([C72AF9F8FD18D410]:0)
Build Log:
[...truncated 11180 lines...]
[junit4] Suite: org.apache.solr.cloud.TestSolrCloudWithSecureImpersonation
[junit4] 2> Creating dataDir: /home/jenkins/workspace/Lucene-Solr-7.0-Linux/solr/build/solr-core/test/J1/temp/solr.cloud.TestSolrCloudWithSecureImpersonation_C72AF9F8FD18D410-001/init-core-data-001
[junit4] 2> 326359 WARN (SUITE-TestSolrCloudWithSecureImpersonation-seed#[C72AF9F8FD18D410]-worker) [ ] o.a.s.SolrTestCaseJ4 startTrackingSearchers: numOpens=21 numCloses=21
[junit4] 2> 326359 INFO (SUITE-TestSolrCloudWithSecureImpersonation-seed#[C72AF9F8FD18D410]-worker) [ ] o.a.s.SolrTestCaseJ4 Using PointFields (NUMERIC_POINTS_SYSPROP=true) w/NUMERIC_DOCVALUES_SYSPROP=false
[junit4] 2> 326360 INFO (SUITE-TestSolrCloudWithSecureImpersonation-seed#[C72AF9F8FD18D410]-worker) [ ] o.a.s.SolrTestCaseJ4 Randomized ssl (true) and clientAuth (true) via: @org.apache.solr.util.RandomizeSSL(reason=, ssl=NaN, value=NaN, clientAuth=NaN)
[junit4] 2> 326415 WARN (SUITE-TestSolrCloudWithSecureImpersonation-seed#[C72AF9F8FD18D410]-worker) [ ] o.a.h.u.NativeCodeLoader Unable to load native-hadoop library for your platform... using builtin-java classes where applicable
[junit4] 2> 326530 INFO (SUITE-TestSolrCloudWithSecureImpersonation-seed#[C72AF9F8FD18D410]-worker) [ ] o.a.s.c.MiniSolrCloudCluster Starting cluster of 2 servers in /home/jenkins/workspace/Lucene-Solr-7.0-Linux/solr/build/solr-core/test/J1/temp/solr.cloud.TestSolrCloudWithSecureImpersonation_C72AF9F8FD18D410-001/tempDir-001
[junit4] 2> 326530 INFO (SUITE-TestSolrCloudWithSecureImpersonation-seed#[C72AF9F8FD18D410]-worker) [ ] o.a.s.c.ZkTestServer STARTING ZK TEST SERVER
[junit4] 2> 326530 INFO (Thread-411) [ ] o.a.s.c.ZkTestServer client port:0.0.0.0/0.0.0.0:0
[junit4] 2> 326530 INFO (Thread-411) [ ] o.a.s.c.ZkTestServer Starting server
[junit4] 2> 326535 ERROR (Thread-411) [ ] o.a.z.s.ZooKeeperServer ZKShutdownHandler is not registered, so ZooKeeper server won't take any action on ERROR or SHUTDOWN server state changes
[junit4] 2> 326630 INFO (SUITE-TestSolrCloudWithSecureImpersonation-seed#[C72AF9F8FD18D410]-worker) [ ] o.a.s.c.ZkTestServer start zk server on port:36323
[junit4] 2> 326641 INFO (jetty-launcher-288-thread-1) [ ] o.e.j.s.Server jetty-9.3.14.v20161028
[junit4] 2> 326642 INFO (jetty-launcher-288-thread-2) [ ] o.e.j.s.Server jetty-9.3.14.v20161028
[junit4] 2> 326642 INFO (jetty-launcher-288-thread-1) [ ] o.e.j.s.h.ContextHandler Started o.e.j.s.ServletContextHandler@2c7e5b{/solr,null,AVAILABLE}
[junit4] 2> 326643 INFO (jetty-launcher-288-thread-2) [ ] o.e.j.s.h.ContextHandler Started o.e.j.s.ServletContextHandler@20268d{/solr,null,AVAILABLE}
[junit4] 2> 326648 INFO (jetty-launcher-288-thread-1) [ ] o.e.j.s.AbstractConnector Started ServerConnector@11d90af{SSL,[ssl, http/1.1]}{127.0.0.1:43915}
[junit4] 2> 326648 INFO (jetty-launcher-288-thread-2) [ ] o.e.j.s.AbstractConnector Started ServerConnector@1a78da2{SSL,[ssl, http/1.1]}{127.0.0.1:34177}
[junit4] 2> 326648 INFO (jetty-launcher-288-thread-1) [ ] o.e.j.s.Server Started @328815ms
[junit4] 2> 326648 INFO (jetty-launcher-288-thread-2) [ ] o.e.j.s.Server Started @328815ms
[junit4] 2> 326648 INFO (jetty-launcher-288-thread-1) [ ] o.a.s.c.s.e.JettySolrRunner Jetty properties: {hostContext=/solr, hostPort=43915}
[junit4] 2> 326648 INFO (jetty-launcher-288-thread-2) [ ] o.a.s.c.s.e.JettySolrRunner Jetty properties: {hostContext=/solr, hostPort=34177}
[junit4] 2> 326648 ERROR (jetty-launcher-288-thread-1) [ ] o.a.s.s.StartupLoggingUtils Missing Java Option solr.log.dir. Logging may be missing or incomplete.
[junit4] 2> 326648 ERROR (jetty-launcher-288-thread-2) [ ] o.a.s.s.StartupLoggingUtils Missing Java Option solr.log.dir. Logging may be missing or incomplete.
[junit4] 2> 326648 INFO (jetty-launcher-288-thread-1) [ ] o.a.s.s.SolrDispatchFilter ___ _ Welcome to Apache Solr? version 7.0.1
[junit4] 2> 326648 INFO (jetty-launcher-288-thread-2) [ ] o.a.s.s.SolrDispatchFilter ___ _ Welcome to Apache Solr? version 7.0.1
[junit4] 2> 326648 INFO (jetty-launcher-288-thread-1) [ ] o.a.s.s.SolrDispatchFilter / __| ___| |_ _ Starting in cloud mode on port null
[junit4] 2> 326648 INFO (jetty-launcher-288-thread-2) [ ] o.a.s.s.SolrDispatchFilter / __| ___| |_ _ Starting in cloud mode on port null
[junit4] 2> 326648 INFO (jetty-launcher-288-thread-1) [ ] o.a.s.s.SolrDispatchFilter \__ \/ _ \ | '_| Install dir: null, Default config dir: null
[junit4] 2> 326648 INFO (jetty-launcher-288-thread-2) [ ] o.a.s.s.SolrDispatchFilter \__ \/ _ \ | '_| Install dir: null, Default config dir: null
[junit4] 2> 326648 INFO (jetty-launcher-288-thread-1) [ ] o.a.s.s.SolrDispatchFilter |___/\___/_|_| Start time: 2017-10-03T17:15:55.772Z
[junit4] 2> 326648 INFO (jetty-launcher-288-thread-2) [ ] o.a.s.s.SolrDispatchFilter |___/\___/_|_| Start time: 2017-10-03T17:15:55.772Z
[junit4] 2> 326655 INFO (jetty-launcher-288-thread-1) [ ] o.a.s.s.SolrDispatchFilter solr.xml found in ZooKeeper. Loading...
[junit4] 2> 326655 INFO (jetty-launcher-288-thread-2) [ ] o.a.s.s.SolrDispatchFilter solr.xml found in ZooKeeper. Loading...
[junit4] 2> 326664 INFO (jetty-launcher-288-thread-1) [ ] o.a.s.c.ZkContainer Zookeeper client=127.0.0.1:36323/solr
[junit4] 2> 326667 INFO (jetty-launcher-288-thread-2) [ ] o.a.s.c.ZkContainer Zookeeper client=127.0.0.1:36323/solr
[junit4] 2> 326732 INFO (jetty-launcher-288-thread-1) [n:127.0.0.1:43915_solr ] o.a.s.c.Overseer Overseer (id=null) closing
[junit4] 2> 326732 INFO (jetty-launcher-288-thread-1) [n:127.0.0.1:43915_solr ] o.a.s.c.OverseerElectionContext I am going to be the leader 127.0.0.1:43915_solr
[junit4] 2> 326733 INFO (jetty-launcher-288-thread-1) [n:127.0.0.1:43915_solr ] o.a.s.c.Overseer Overseer (id=98766091429806086-127.0.0.1:43915_solr-n_0000000000) starting
[junit4] 2> 326735 INFO (jetty-launcher-288-thread-2) [n:127.0.0.1:34177_solr ] o.a.s.c.Overseer Overseer (id=null) closing
[junit4] 2> 326739 INFO (jetty-launcher-288-thread-1) [n:127.0.0.1:43915_solr ] o.a.s.c.ZkController Register node as live in ZooKeeper:/live_nodes/127.0.0.1:43915_solr
[junit4] 2> 326739 INFO (zkCallback-300-thread-1-processing-n:127.0.0.1:43915_solr) [n:127.0.0.1:43915_solr ] o.a.s.c.c.ZkStateReader Updated live nodes from ZooKeeper... (0) -> (1)
[junit4] 2> 326739 INFO (jetty-launcher-288-thread-2) [n:127.0.0.1:34177_solr ] o.a.s.c.ZkController Register node as live in ZooKeeper:/live_nodes/127.0.0.1:34177_solr
[junit4] 2> 326740 INFO (zkCallback-300-thread-1-processing-n:127.0.0.1:43915_solr) [n:127.0.0.1:43915_solr ] o.a.s.c.c.ZkStateReader Updated live nodes from ZooKeeper... (1) -> (2)
[junit4] 2> 326746 INFO (zkCallback-299-thread-1-processing-n:127.0.0.1:34177_solr) [n:127.0.0.1:34177_solr ] o.a.s.c.c.ZkStateReader Updated live nodes from ZooKeeper... (0) -> (1)
[junit4] 2> 326750 INFO (zkCallback-299-thread-2-processing-n:127.0.0.1:34177_solr) [n:127.0.0.1:34177_solr ] o.a.s.c.c.ZkStateReader Updated live nodes from ZooKeeper... (1) -> (2)
[junit4] 2> 326776 INFO (jetty-launcher-288-thread-2) [n:127.0.0.1:34177_solr ] o.a.s.c.CoreContainer Initializing authentication plugin: org.apache.solr.security.HttpParamDelegationTokenPlugin
[junit4] 2> 326779 WARN (jetty-launcher-288-thread-2) [n:127.0.0.1:34177_solr ] o.a.s.c.s.i.Krb5HttpClientBuilder org.apache.solr.client.solrj.impl.Krb5HttpClientBuilder is configured without specifying system property 'java.security.auth.login.config'
[junit4] 2> 326791 INFO (jetty-launcher-288-thread-2) [n:127.0.0.1:34177_solr ] o.a.s.s.KerberosPlugin Params: {solr.kerberos.impersonator.user.noGroups.hosts=*, solr.kerberos.impersonator.user.bogusGroup.groups=__some_bogus_group, token.valid=30, cookie.domain=127.0.0.1, solr.kerberos.impersonator.user.anyHostAnyUser.groups=*, solr.kerberos.impersonator.user.bogusGroup.hosts=*, solr.kerberos.impersonator.user.anyHostAnyUser.hosts=*, token.validity=36000, solr.kerberos.impersonator.user.noHosts.groups=*, type=kerberos, solr.kerberos.impersonator.user.localHostAnyGroup.groups=*, delegation-token.token-kind=solr-dt, solr.kerberos.impersonator.user.wrongHost.hosts=1.1.1.1.1.1, cookie.path=/, zk-dt-secret-manager.znodeWorkingPath=solr/security/zkdtsm, solr.kerberos.impersonator.user.localHostAnyGroup.hosts=localhost.localdomain,localhost,127.0.0.1, signer.secret.provider.zookeeper.path=/token, solr.kerberos.impersonator.user.anyHostUsersGroup.groups=jenkins, zk-dt-secret-manager.enable=true, solr.kerberos.impersonator.user.wrongHost.groups=*, kerberos.name.rules=DEFAULT, signer.secret.provider=zookeeper, solr.kerberos.impersonator.user.anyHostUsersGroup.hosts=*}
[junit4] 2> 326865 INFO (jetty-launcher-288-thread-2) [n:127.0.0.1:34177_solr ] o.a.c.f.i.CuratorFrameworkImpl Starting
[junit4] 2> 326878 INFO (jetty-launcher-288-thread-2-EventThread) [n:127.0.0.1:34177_solr ] o.a.c.f.s.ConnectionStateManager State change: CONNECTED
[junit4] 2> 326956 INFO (jetty-launcher-288-thread-1) [n:127.0.0.1:43915_solr ] o.a.s.c.CoreContainer Initializing authentication plugin: org.apache.solr.security.HttpParamDelegationTokenPlugin
[junit4] 2> 326956 WARN (jetty-launcher-288-thread-1) [n:127.0.0.1:43915_solr ] o.a.s.c.s.i.Krb5HttpClientBuilder org.apache.solr.client.solrj.impl.Krb5HttpClientBuilder is configured without specifying system property 'java.security.auth.login.config'
[junit4] 2> 326957 INFO (jetty-launcher-288-thread-1) [n:127.0.0.1:43915_solr ] o.a.s.s.KerberosPlugin Params: {solr.kerberos.impersonator.user.noGroups.hosts=*, solr.kerberos.impersonator.user.bogusGroup.groups=__some_bogus_group, token.valid=30, cookie.domain=127.0.0.1, solr.kerberos.impersonator.user.anyHostAnyUser.groups=*, solr.kerberos.impersonator.user.bogusGroup.hosts=*, solr.kerberos.impersonator.user.anyHostAnyUser.hosts=*, token.validity=36000, solr.kerberos.impersonator.user.noHosts.groups=*, type=kerberos, solr.kerberos.impersonator.user.localHostAnyGroup.groups=*, delegation-token.token-kind=solr-dt, solr.kerberos.impersonator.user.wrongHost.hosts=1.1.1.1.1.1, cookie.path=/, zk-dt-secret-manager.znodeWorkingPath=solr/security/zkdtsm, solr.kerberos.impersonator.user.localHostAnyGroup.hosts=localhost.localdomain,localhost,127.0.0.1, signer.secret.provider.zookeeper.path=/token, solr.kerberos.impersonator.user.anyHostUsersGroup.groups=jenkins, zk-dt-secret-manager.enable=true, solr.kerberos.impersonator.user.wrongHost.groups=*, kerberos.name.rules=DEFAULT, signer.secret.provider=zookeeper, solr.kerberos.impersonator.user.anyHostUsersGroup.hosts=*}
[junit4] 2> 326957 INFO (jetty-launcher-288-thread-1) [n:127.0.0.1:43915_solr ] o.a.c.f.i.CuratorFrameworkImpl Starting
[junit4] 2> 326960 INFO (jetty-launcher-288-thread-1-EventThread) [n:127.0.0.1:43915_solr ] o.a.c.f.s.ConnectionStateManager State change: CONNECTED
[junit4] 2> 326989 WARN (jetty-launcher-288-thread-2) [n:127.0.0.1:34177_solr ] o.a.s.c.s.i.Krb5HttpClientBuilder org.apache.solr.client.solrj.impl.Krb5HttpClientBuilder is configured without specifying system property 'java.security.auth.login.config'
[junit4] 2> 327025 INFO (jetty-launcher-288-thread-2) [n:127.0.0.1:34177_solr ] o.a.s.m.r.SolrJmxReporter JMX monitoring for 'solr_34177.solr.node' (registry 'solr.node') enabled at server: com.sun.jmx.mbeanserver.JmxMBeanServer@2ce38e
[junit4] 2> 327034 INFO (jetty-launcher-288-thread-2) [n:127.0.0.1:34177_solr ] o.a.s.m.r.SolrJmxReporter JMX monitoring for 'solr_34177.solr.jvm' (registry 'solr.jvm') enabled at server: com.sun.jmx.mbeanserver.JmxMBeanServer@2ce38e
[junit4] 2> 327034 INFO (jetty-launcher-288-thread-2) [n:127.0.0.1:34177_solr ] o.a.s.m.r.SolrJmxReporter JMX monitoring for 'solr_34177.solr.jetty' (registry 'solr.jetty') enabled at server: com.sun.jmx.mbeanserver.JmxMBeanServer@2ce38e
[junit4] 2> 327035 INFO (jetty-launcher-288-thread-2) [n:127.0.0.1:34177_solr ] o.a.s.c.CorePropertiesLocator Found 0 core definitions underneath /home/jenkins/workspace/Lucene-Solr-7.0-Linux/solr/build/solr-core/test/J1/temp/solr.cloud.TestSolrCloudWithSecureImpersonation_C72AF9F8FD18D410-001/tempDir-001/node2/.
[junit4] 2> 327973 WARN (jetty-launcher-288-thread-1) [n:127.0.0.1:43915_solr ] o.a.s.c.s.i.Krb5HttpClientBuilder org.apache.solr.client.solrj.impl.Krb5HttpClientBuilder is configured without specifying system property 'java.security.auth.login.config'
[junit4] 2> 328001 INFO (jetty-launcher-288-thread-1) [n:127.0.0.1:43915_solr ] o.a.s.m.r.SolrJmxReporter JMX monitoring for 'solr_43915.solr.node' (registry 'solr.node') enabled at server: com.sun.jmx.mbeanserver.JmxMBeanServer@2ce38e
[junit4] 2> 328008 INFO (jetty-launcher-288-thread-1) [n:127.0.0.1:43915_solr ] o.a.s.m.r.SolrJmxReporter JMX monitoring for 'solr_43915.solr.jvm' (registry 'solr.jvm') enabled at server: com.sun.jmx.mbeanserver.JmxMBeanServer@2ce38e
[junit4] 2> 328008 INFO (jetty-launcher-288-thread-1) [n:127.0.0.1:43915_solr ] o.a.s.m.r.SolrJmxReporter JMX monitoring for 'solr_43915.solr.jetty' (registry 'solr.jetty') enabled at server: com.sun.jmx.mbeanserver.JmxMBeanServer@2ce38e
[junit4] 2> 328009 INFO (jetty-launcher-288-thread-1) [n:127.0.0.1:43915_solr ] o.a.s.c.CorePropertiesLocator Found 0 core definitions underneath /home/jenkins/workspace/Lucene-Solr-7.0-Linux/solr/build/solr-core/test/J1/temp/solr.cloud.TestSolrCloudWithSecureImpersonation_C72AF9F8FD18D410-001/tempDir-001/node1/.
[junit4] 2> 328038 INFO (TEST-TestSolrCloudWithSecureImpersonation.testProxyInvalidRemote-seed#[C72AF9F8FD18D410]) [ ] o.a.s.SolrTestCaseJ4 ###Starting testProxyInvalidRemote
[junit4] 2> 328341 WARN (TEST-TestSolrCloudWithSecureImpersonation.testProxyInvalidRemote-seed#[C72AF9F8FD18D410]) [ ] o.a.h.c.p.ResponseProcessCookies Invalid cookie header: "Set-Cookie: hadoop.auth="u=localHostAnyGroup&p=localHostAnyGroup&t=test&e=1507086957204&s=dHVjc/RLDML5l/rlk9dzGqx6gng="; Path=/; Domain=127.0.0.1; Expires=sre, 04-okt-2017 03:15:57 GMT; Secure; HttpOnly". Invalid 'expires' attribute: sre, 04-okt-2017 03:15:57 GMT
[junit4] 2> 328342 INFO (TEST-TestSolrCloudWithSecureImpersonation.testProxyInvalidRemote-seed#[C72AF9F8FD18D410]) [ ] o.a.s.SolrTestCaseJ4 ###Ending testProxyInvalidRemote
[junit4] 2> 328354 INFO (TEST-TestSolrCloudWithSecureImpersonation.testProxyWrongHost-seed#[C72AF9F8FD18D410]) [ ] o.a.s.SolrTestCaseJ4 ###Starting testProxyWrongHost
[junit4] 2> 333374 WARN (TEST-TestSolrCloudWithSecureImpersonation.testProxyWrongHost-seed#[C72AF9F8FD18D410]) [ ] o.a.h.c.p.ResponseProcessCookies Invalid cookie header: "Set-Cookie: hadoop.auth="u=wrongHost&p=wrongHost&t=test&e=1507086957479&s=a3lTGOWx1Y6bPtdwD4ELRfm9/kM="; Path=/; Domain=127.0.0.1; Expires=sre, 04-okt-2017 03:15:57 GMT; Secure; HttpOnly". Invalid 'expires' attribute: sre, 04-okt-2017 03:15:57 GMT
[junit4] 2> 333374 INFO (TEST-TestSolrCloudWithSecureImpersonation.testProxyWrongHost-seed#[C72AF9F8FD18D410]) [ ] o.a.s.SolrTestCaseJ4 ###Ending testProxyWrongHost
[junit4] 2> 333388 INFO (TEST-TestSolrCloudWithSecureImpersonation.testProxyValidateHost-seed#[C72AF9F8FD18D410]) [ ] o.a.s.SolrTestCaseJ4 ###Starting testProxyValidateHost
[junit4] 2> 333393 INFO (qtp29714285-2171) [n:127.0.0.1:34177_solr ] o.a.s.h.a.CollectionsHandler Invoked Collection Action :list with params doAs=bar&action=LIST&wt=javabin&version=2 and sendToOCPQueue=true
[junit4] 2> 333393 INFO (qtp29714285-2171) [n:127.0.0.1:34177_solr ] o.a.s.s.HttpSolrCall [admin] webapp=null path=/admin/collections params={doAs=bar&action=LIST&wt=javabin&version=2} status=0 QTime=0
[junit4] 2> 333394 WARN (TEST-TestSolrCloudWithSecureImpersonation.testProxyValidateHost-seed#[C72AF9F8FD18D410]) [ ] o.a.h.c.p.ResponseProcessCookies Invalid cookie header: "Set-Cookie: hadoop.auth="u=localHostAnyGroup&p=localHostAnyGroup&t=test&e=1507086962513&s=cVql7wAA7WBkJVlh2+lN/A9SNY8="; Path=/; Domain=127.0.0.1; Expires=sre, 04-okt-2017 03:16:02 GMT; Secure; HttpOnly". Invalid 'expires' attribute: sre, 04-okt-2017 03:16:02 GMT
[junit4] 2> 333394 INFO (TEST-TestSolrCloudWithSecureImpersonation.testProxyValidateHost-seed#[C72AF9F8FD18D410]) [ ] o.a.s.SolrTestCaseJ4 ###Ending testProxyValidateHost
[junit4] 2> 333420 INFO (TEST-TestSolrCloudWithSecureImpersonation.testForwarding-seed#[C72AF9F8FD18D410]) [ ] o.a.s.SolrTestCaseJ4 ###Starting testForwarding
[junit4] 2> 333640 INFO (TEST-TestSolrCloudWithSecureImpersonation.testForwarding-seed#[C72AF9F8FD18D410]) [ ] o.a.s.c.c.ZkStateReader Updated live nodes from ZooKeeper... (0) -> (2)
[junit4] 2> 333641 INFO (TEST-TestSolrCloudWithSecureImpersonation.testForwarding-seed#[C72AF9F8FD18D410]) [ ] o.a.s.c.s.i.ZkClientClusterStateProvider Cluster at 127.0.0.1:36323/solr ready
[junit4] 2> 333645 INFO (qtp29714285-2165) [n:127.0.0.1:34177_solr ] o.a.s.h.a.CollectionsHandler Invoked Collection Action :create with params pullReplicas=0&replicationFactor=1&collection.configName=conf1&maxShardsPerNode=1&name=forwardingCollection&nrtReplicas=1&action=CREATE&numShards=1&tlogReplicas=0&wt=javabin&version=2 and sendToOCPQueue=true
[junit4] 2> 333646 INFO (OverseerThreadFactory-756-thread-1-processing-n:127.0.0.1:43915_solr) [n:127.0.0.1:43915_solr ] o.a.s.c.CreateCollectionCmd Create collection forwardingCollection
[junit4] 2> 333755 INFO (OverseerStateUpdate-98766091429806086-127.0.0.1:43915_solr-n_0000000000) [n:127.0.0.1:43915_solr ] o.a.s.c.o.SliceMutator createReplica() {
[junit4] 2> "operation":"ADDREPLICA",
[junit4] 2> "collection":"forwardingCollection",
[junit4] 2> "shard":"shard1",
[junit4] 2> "core":"forwardingCollection_shard1_replica_n1",
[junit4] 2> "state":"down",
[junit4] 2> "base_url":"https://127.0.0.1:43915/solr",
[junit4] 2> "type":"NRT"}
[junit4] 2> 334014 INFO (qtp22032243-2160) [n:127.0.0.1:43915_solr ] o.a.s.h.a.CoreAdminOperation core create command qt=/admin/cores&coreNodeName=core_node1&collection.configName=conf1&newCollection=true&name=forwardingCollection_shard1_replica_n1&action=CREATE&numShards=1&collection=forwardingCollection&shard=shard1&wt=javabin&version=2&replicaType=NRT
[junit4] 2> 334015 INFO (qtp22032243-2160) [n:127.0.0.1:43915_solr ] o.a.s.c.TransientSolrCoreCacheDefault Allocating transient cache for 2147483647 transient cores
[junit4] 2> 334126 INFO (zkCallback-300-thread-1-processing-n:127.0.0.1:43915_solr) [n:127.0.0.1:43915_solr ] o.a.s.c.c.ZkStateReader A cluster state change: [WatchedEvent state:SyncConnected type:NodeDataChanged path:/collections/forwardingCollection/state.json] for collection [forwardingCollection] has occurred - updating... (live nodes size: [2])
[junit4] 2> 334126 INFO (zkCallback-300-thread-2-processing-n:127.0.0.1:43915_solr) [n:127.0.0.1:43915_solr ] o.a.s.c.c.ZkStateReader A cluster state change: [WatchedEvent state:SyncConnected type:NodeDataChanged path:/collections/forwardingCollection/state.json] for collection [forwardingCollection] has occurred - updating... (live nodes size: [2])
[junit4] 2> 335069 INFO (qtp22032243-2160) [n:127.0.0.1:43915_solr c:forwardingCollection s:shard1 r:core_node1 x:forwardingCollection_shard1_replica_n1] o.a.s.c.SolrConfig Using Lucene MatchVersion: 7.0.1
[junit4] 2> 335108 INFO (qtp22032243-2160) [n:127.0.0.1:43915_solr c:forwardingCollection s:shard1 r:core_node1 x:forwardingCollection_shard1_replica_n1] o.a.s.s.IndexSchema [forwardingCollection_shard1_replica_n1] Schema name=test
[junit4] 2> 335181 INFO (qtp22032243-2160) [n:127.0.0.1:43915_solr c:forwardingCollection s:shard1 r:core_node1 x:forwardingCollection_shard1_replica_n1] o.a.s.s.IndexSchema Loaded schema test/1.0 with uniqueid field id
[junit4] 2> 335192 INFO (qtp22032243-2160) [n:127.0.0.1:43915_solr c:forwardingCollection s:shard1 r:core_node1 x:forwardingCollection_shard1_replica_n1] o.a.s.c.CoreContainer Creating SolrCore 'forwardingCollection_shard1_replica_n1' using configuration from collection forwardingCollection, trusted=true
[junit4] 2> 335193 INFO (qtp22032243-2160) [n:127.0.0.1:43915_solr c:forwardingCollection s:shard1 r:core_node1 x:forwardingCollection_shard1_replica_n1] o.a.s.m.r.SolrJmxReporter JMX monitoring for 'solr_43915.solr.core.forwardingCollection.shard1.replica_n1' (registry 'solr.core.forwardingCollection.shard1.replica_n1') enabled at server: com.sun.jmx.mbeanserver.JmxMBeanServer@2ce38e
[junit4] 2> 335193 INFO (qtp22032243-2160) [n:127.0.0.1:43915_solr c:forwardingCollection s:shard1 r:core_node1 x:forwardingCollection_shard1_replica_n1] o.a.s.c.SolrCore solr.RecoveryStrategy.Builder
[junit4] 2> 335193 INFO (qtp22032243-2160) [n:127.0.0.1:43915_solr c:forwardingCollection s:shard1 r:core_node1 x:forwardingCollection_shard1_replica_n1] o.a.s.c.SolrCore [[forwardingCollection_shard1_replica_n1] ] Opening new SolrCore at [/home/jenkins/workspace/Lucene-Solr-7.0-Linux/solr/build/solr-core/test/J1/temp/solr.cloud.TestSolrCloudWithSecureImpersonation_C72AF9F8FD18D410-001/tempDir-001/node1/forwardingCollection_shard1_replica_n1], dataDir=[/home/jenkins/workspace/Lucene-Solr-7.0-Linux/solr/build/solr-core/test/J1/temp/solr.cloud.TestSolrCloudWithSecureImpersonation_C72AF9F8FD18D410-001/tempDir-001/node1/./forwardingCollection_shard1_replica_n1/data/]
[junit4] 2> 335195 INFO (qtp22032243-2160) [n:127.0.0.1:43915_solr c:forwardingCollection s:shard1 r:core_node1 x:forwardingCollection_shard1_replica_n1] o.a.s.u.RandomMergePolicy RandomMergePolicy wrapping class org.apache.lucene.index.TieredMergePolicy: [TieredMergePolicy: maxMergeAtOnce=39, maxMergeAtOnceExplicit=36, maxMergedSegmentMB=92.0380859375, floorSegmentMB=0.998046875, forceMergeDeletesPctAllowed=22.840039997622725, segmentsPerTier=47.0, maxCFSSegmentSizeMB=8.796093022207999E12, noCFSRatio=0.0
[junit4] 2> 335234 INFO (qtp22032243-2160) [n:127.0.0.1:43915_solr c:forwardingCollection s:shard1 r:core_node1 x:forwardingCollection_shard1_replica_n1] o.a.s.u.UpdateHandler Using UpdateLog implementation: org.apache.solr.update.UpdateLog
[junit4] 2> 335234 INFO (qtp22032243-2160) [n:127.0.0.1:43915_solr c:forwardingCollection s:shard1 r:core_node1 x:forwardingCollection_shard1_replica_n1] o.a.s.u.UpdateLog Initializing UpdateLog: dataDir= defaultSyncLevel=FLUSH numRecordsToKeep=100 maxNumLogsToKeep=10 numVersionBuckets=65536
[junit4] 2> 335235 INFO (qtp22032243-2160) [n:127.0.0.1:43915_solr c:forwardingCollection s:shard1 r:core_node1 x:forwardingCollection_shard1_replica_n1] o.a.s.u.CommitTracker Hard AutoCommit: disabled
[junit4] 2> 335235 INFO (qtp22032243-2160) [n:127.0.0.1:43915_solr c:forwardingCollection s:shard1 r:core_node1 x:forwardingCollection_shard1_replica_n1] o.a.s.u.CommitTracker Soft AutoCommit: disabled
[junit4] 2> 335236 INFO (qtp22032243-2160) [n:127.0.0.1:43915_solr c:forwardingCollection s:shard1 r:core_node1 x:forwardingCollection_shard1_replica_n1] o.a.s.u.RandomMergePolicy RandomMergePolicy wrapping class org.apache.lucene.index.TieredMergePolicy: [TieredMergePolicy: maxMergeAtOnce=16, maxMergeAtOnceExplicit=43, maxMergedSegmentMB=31.560546875, floorSegmentMB=1.44140625, forceMergeDeletesPctAllowed=18.18346518907679, segmentsPerTier=44.0, maxCFSSegmentSizeMB=8.796093022207999E12, noCFSRatio=0.7934195315431586
[junit4] 2> 335236 INFO (qtp22032243-2160) [n:127.0.0.1:43915_solr c:forwardingCollection s:shard1 r:core_node1 x:forwardingCollection_shard1_replica_n1] o.a.s.s.SolrIndexSearcher Opening [Searcher@6e0fb4[forwardingCollection_shard1_replica_n1] main]
[junit4] 2> 335238 INFO (qtp22032243-2160) [n:127.0.0.1:43915_solr c:forwardingCollection s:shard1 r:core_node1 x:forwardingCollection_shard1_replica_n1] o.a.s.h.c.SpellCheckComponent Initializing spell checkers
[junit4] 2> 335257 INFO (qtp22032243-2160) [n:127.0.0.1:43915_solr c:forwardingCollection s:shard1 r:core_node1 x:forwardingCollection_shard1_replica_n1] o.a.s.s.DirectSolrSpellChecker init: {name=direct,classname=DirectSolrSpellChecker,field=lowerfilt,minQueryLength=3}
[junit4] 2> 335320 INFO (qtp22032243-2160) [n:127.0.0.1:43915_solr c:forwardingCollection s:shard1 r:core_node1 x:forwardingCollection_shard1_replica_n1] o.a.s.h.ReplicationHandler Commits will be reserved for 10000
[junit4] 2> 335320 INFO (searcherExecutor-761-thread-1-processing-n:127.0.0.1:43915_solr x:forwardingCollection_shard1_replica_n1 s:shard1 c:forwardingCollection r:core_node1) [n:127.0.0.1:43915_solr c:forwardingCollection s:shard1 r:core_node1 x:forwardingCollection_shard1_replica_n1] o.a.s.h.c.SpellCheckComponent Loading spell index for spellchecker: default
[junit4] 2> 335320 INFO (qtp22032243-2160) [n:127.0.0.1:43915_solr c:forwardingCollection s:shard1 r:core_node1 x:forwardingCollection_shard1_replica_n1] o.a.s.u.UpdateLog Could not find max version in index or recent updates, using new clock 1580257472092831744
[junit4] 2> 335320 INFO (searcherExecutor-761-thread-1-processing-n:127.0.0.1:43915_solr x:forwardingCollection_shard1_replica_n1 s:shard1 c:forwardingCollection r:core_node1) [n:127.0.0.1:43915_solr c:forwardingCollection s:shard1 r:core_node1 x:forwardingCollection_shard1_replica_n1] o.a.s.h.c.SpellCheckComponent Loading spell index for spellchecker: direct
[junit4] 2> 335320 INFO (searcherExecutor-761-thread-1-processing-n:127.0.0.1:43915_solr x:forwardingCollection_shard1_replica_n1 s:shard1 c:forwardingCollection r:core_node1) [n:127.0.0.1:43915_solr c:forwardingCollection s:shard1 r:core_node1 x:forwardingCollection_shard1_replica_n1] o.a.s.h.c.SpellCheckComponent Loading spell index for spellchecker: wordbreak
[junit4] 2> 335320 INFO (searcherExecutor-761-thread-1-processing-n:127.0.0.1:43915_solr x:forwardingCollection_shard1_replica_n1 s:shard1 c:forwardingCollection r:core_node1) [n:127.0.0.1:43915_solr c:forwardingCollection s:shard1 r:core_node1 x:forwardingCollection_shard1_replica_n1] o.a.s.h.c.SpellCheckComponent Loading spell index for spellchecker: multipleFields
[junit4] 2> 335320 INFO (searcherExecutor-761-thread-1-processing-n:127.0.0.1:43915_solr x:forwardingCollection_shard1_replica_n1 s:shard1 c:forwardingCollection r:core_node1) [n:127.0.0.1:43915_solr c:forwardingCollection s:shard1 r:core_node1 x:forwardingCollection_shard1_replica_n1] o.a.s.h.c.SpellCheckComponent Loading spell index for spellchecker: jarowinkler
[junit4] 2> 335320 INFO (searcherExecutor-761-thread-1-processing-n:127.0.0.1:43915_solr x:forwardingCollection_shard1_replica_n1 s:shard1 c:forwardingCollection r:core_node1) [n:127.0.0.1:43915_solr c:forwardingCollection s:shard1 r:core_node1 x:forwardingCollection_shard1_replica_n1] o.a.s.h.c.SpellCheckComponent Loading spell index for spellchecker: external
[junit4] 2> 335320 INFO (searcherExecutor-761-thread-1-processing-n:127.0.0.1:43915_solr x:forwardingCollection_shard1_replica_n1 s:shard1 c:forwardingCollection r:core_node1) [n:127.0.0.1:43915_solr c:forwardingCollection s:shard1 r:core_node1 x:forwardingCollection_shard1_replica_n1] o.a.s.h.c.SpellCheckComponent Loading spell index for spellchecker: freq
[junit4] 2> 335321 INFO (searcherExecutor-761-thread-1-processing-n:127.0.0.1:43915_solr x:forwardingCollection_shard1_replica_n1 s:shard1 c:forwardingCollection r:core_node1) [n:127.0.0.1:43915_solr c:forwardingCollection s:shard1 r:core_node1 x:forwardingCollection_shard1_replica_n1] o.a.s.h.c.SpellCheckComponent Loading spell index for spellchecker: fqcn
[junit4] 2> 335321 INFO (searcherExecutor-761-thread-1-processing-n:127.0.0.1:43915_solr x:forwardingCollection_shard1_replica_n1 s:shard1 c:forwardingCollection r:core_node1) [n:127.0.0.1:43915_solr c:forwardingCollection s:shard1 r:core_node1 x:forwardingCollection_shard1_replica_n1] o.a.s.h.c.SpellCheckComponent Loading spell index for spellchecker: perDict
[junit4] 2> 335322 INFO (searcherExecutor-761-thread-1-processing-n:127.0.0.1:43915_solr x:forwardingCollection_shard1_replica_n1 s:shard1 c:forwardingCollection r:core_node1) [n:127.0.0.1:43915_solr c:forwardingCollection s:shard1 r:core_node1 x:forwardingCollection_shard1_replica_n1] o.a.s.c.SolrCore [forwardingCollection_shard1_replica_n1] Registered new searcher Searcher@6e0fb4[forwardingCollection_shard1_replica_n1] main{ExitableDirectoryReader(UninvertingDirectoryReader())}
[junit4] 2> 335324 INFO (qtp22032243-2160) [n:127.0.0.1:43915_solr c:forwardingCollection s:shard1 r:core_node1 x:forwardingCollection_shard1_replica_n1] o.a.s.c.ShardLeaderElectionContext Enough replicas found to continue.
[junit4] 2> 335324 INFO (qtp22032243-2160) [n:127.0.0.1:43915_solr c:forwardingCollection s:shard1 r:core_node1 x:forwardingCollection_shard1_replica_n1] o.a.s.c.ShardLeaderElectionContext I may be the new leader - try and sync
[junit4] 2> 335324 INFO (qtp22032243-2160) [n:127.0.0.1:43915_solr c:forwardingCollection s:shard1 r:core_node1 x:forwardingCollection_shard1_replica_n1] o.a.s.c.SyncStrategy Sync replicas to https://127.0.0.1:43915/solr/forwardingCollection_shard1_replica_n1/
[junit4] 2> 335324 INFO (qtp22032243-2160) [n:127.0.0.1:43915_solr c:forwardingCollection s:shard1 r:core_node1 x:forwardingCollection_shard1_replica_n1] o.a.s.c.SyncStrategy Sync Success - now sync replicas to me
[junit4] 2> 335324 INFO (qtp22032243-2160) [n:127.0.0.1:43915_solr c:forwardingCollection s:shard1 r:core_node1 x:forwardingCollection_shard1_replica_n1] o.a.s.c.SyncStrategy https://127.0.0.1:43915/solr/forwardingCollection_shard1_replica_n1/ has no replicas
[junit4] 2> 335324 INFO (qtp22032243-2160) [n:127.0.0.1:43915_solr c:forwardingCollection s:shard1 r:core_node1 x:forwardingCollection_shard1_replica_n1] o.a.s.c.ShardLeaderElectionContext Found all replicas participating in election, clear LIR
[junit4] 2> 335326 INFO (qtp22032243-2160) [n:127.0.0.1:43915_solr c:forwardingCollection s:shard1 r:core_node1 x:forwardingCollection_shard1_replica_n1] o.a.s.c.ShardLeaderElectionContext I am the new leader: https://127.0.0.1:43915/solr/forwardingCollection_shard1_replica_n1/ shard1
[junit4] 2> 335428 INFO (zkCallback-300-thread-2-processing-n:127.0.0.1:43915_solr) [n:127.0.0.1:43915_solr ] o.a.s.c.c.ZkStateReader A cluster state change: [WatchedEvent state:SyncConnected type:NodeDataChanged path:/collections/forwardingCollection/state.json] for collection [forwardingCollection] has occurred - updating... (live nodes size: [2])
[junit4] 2> 335428 INFO (zkCallback-300-thread-1-processing-n:127.0.0.1:43915_solr) [n:127.0.0.1:43915_solr ] o.a.s.c.c.ZkStateReader A cluster state change: [WatchedEvent state:SyncConnected type:NodeDataChanged path:/collections/forwardingCollection/state.json] for collection [forwardingCollection] has occurred - updating... (live nodes size: [2])
[junit4] 2> 335476 INFO (qtp22032243-2160) [n:127.0.0.1:43915_solr c:forwardingCollection s:shard1 r:core_node1 x:forwardingCollection_shard1_replica_n1] o.a.s.c.ZkController I am the leader, no recovery necessary
[junit4] 2> 335478 INFO (qtp22032243-2160) [n:127.0.0.1:43915_solr c:forwardingCollection s:shard1 r:core_node1 x:forwardingCollection_shard1_replica_n1] o.a.s.s.HttpSolrCall [admin] webapp=null path=/admin/cores params={qt=/admin/cores&coreNodeName=core_node1&collection.configName=conf1&newCollection=true&name=forwardingCollection_shard1_replica_n1&action=CREATE&numShards=1&collection=forwardingCollection&shard=shard1&wt=javabin&version=2&replicaType=NRT} status=0 QTime=1464
[junit4] 2> 335479 WARN (httpShardExecutor-753-thread-1-processing-n:127.0.0.1:43915_solr [https:////127.0.0.1:43915//solr] https:////127.0.0.1:43915//solr) [n:127.0.0.1:43915_solr ] o.a.h.c.p.ResponseProcessCookies Invalid cookie header: "Set-Cookie: hadoop.auth="u=$&p=$&t=test&e=1507086963138&s=zXSPR0eU3RT059X+rNcRxloibO8="; Path=/; Domain=127.0.0.1; Expires=sre, 04-okt-2017 03:16:03 GMT; Secure; HttpOnly". Invalid 'expires' attribute: sre, 04-okt-2017 03:16:03 GMT
[junit4] 2> 335483 INFO (qtp29714285-2165) [n:127.0.0.1:34177_solr ] o.a.s.h.a.CollectionsHandler Wait for new collection to be active for at most 30 seconds. Check all shard replicas
[junit4] 2> 335581 INFO (zkCallback-300-thread-2-processing-n:127.0.0.1:43915_solr) [n:127.0.0.1:43915_solr ] o.a.s.c.c.ZkStateReader A cluster state change: [WatchedEvent state:SyncConnected type:NodeDataChanged path:/collections/forwardingCollection/state.json] for collection [forwardingCollection] has occurred - updating... (live nodes size: [2])
[junit4] 2> 335581 INFO (zkCallback-300-thread-1-processing-n:127.0.0.1:43915_solr) [n:127.0.0.1:43915_solr ] o.a.s.c.c.ZkStateReader A cluster state change: [WatchedEvent state:SyncConnected type:NodeDataChanged path:/collections/forwardingCollection/state.json] for collection [forwardingCollection] has occurred - updating... (live nodes size: [2])
[junit4] 2> 335648 INFO (OverseerCollectionConfigSetProcessor-98766091429806086-127.0.0.1:43915_solr-n_0000000000) [n:127.0.0.1:43915_solr ] o.a.s.c.OverseerTaskQueue Response ZK path: /overseer/collection-queue-work/qnr-0000000000 doesn't exist. Requestor may have disconnected from ZooKeeper
[junit4] 2> 336483 INFO (qtp29714285-2165) [n:127.0.0.1:34177_solr ] o.a.s.s.HttpSolrCall [admin] webapp=null path=/admin/collections params={pullReplicas=0&replicationFactor=1&collection.configName=conf1&maxShardsPerNode=1&name=forwardingCollection&nrtReplicas=1&action=CREATE&numShards=1&tlogReplicas=0&wt=javabin&version=2} status=0 QTime=2838
[junit4] 2> 336484 WARN (TEST-TestSolrCloudWithSecureImpersonation.testForwarding-seed#[C72AF9F8FD18D410]) [ ] o.a.h.c.p.ResponseProcessCookies Invalid cookie header: "Set-Cookie: hadoop.auth="u=user&p=user&t=test&e=1507086962769&s=1YxCJkANOpBXpa03k+eoU8Khwhk="; Path=/; Domain=127.0.0.1; Expires=sre, 04-okt-2017 03:16:02 GMT; Secure; HttpOnly". Invalid 'expires' attribute: sre, 04-okt-2017 03:16:02 GMT
[junit4] 2> 336484 INFO (TEST-TestSolrCloudWithSecureImpersonation.testForwarding-seed#[C72AF9F8FD18D410]) [ ] o.a.s.c.AbstractDistribZkTestBase Wait for recoveries to finish - collection: forwardingCollection failOnTimeout:true timeout (sec):100
[junit4] 2> 336484 INFO (TEST-TestSolrCloudWithSecureImpersonation.testForwarding-seed#[C72AF9F8FD18D410]) [ ] o.a.s.c.AbstractDistribZkTestBase Recoveries finished - collection: forwardingCollection
[junit4] 2> 336488 INFO (qtp29714285-2167) [n:127.0.0.1:34177_solr ] o.a.s.c.TransientSolrCoreCacheDefault Allocating transient cache for 2147483647 transient cores
[junit4] 2> 336492 INFO (qtp22032243-2157) [n:127.0.0.1:43915_solr c:forwardingCollection s:shard1 r:core_node1 x:forwardingCollection_shard1_replica_n1] o.a.s.c.S.Request [forwardingCollection_shard1_replica_n1] webapp=/solr path=/select params={q=*:*&wt=javabin&version=2} hits=0 status=0 QTime=0
[junit4] 2> 336492 WARN (qtp29714285-2167) [n:127.0.0.1:34177_solr ] o.a.h.c.p.ResponseProcessCookies Invalid cookie header: "Set-Cookie: hadoop.auth="u=$&p=$&t=test&e=1507086965614&s=/AME5zMIBnWKKAXkjifH9agUdVE="; Path=/; Domain=127.0.0.1; Expires=sre, 04-okt-2017 03:16:05 GMT; Secure; HttpOnly". Invalid 'expires' attribute: sre, 04-okt-2017 03:16:05 GMT
[junit4] 2> 336495 WARN (TEST-TestSolrCloudWithSecureImpersonation.testForwarding-seed#[C72AF9F8FD18D410]) [ ] o.a.h.c.p.ResponseProcessCookies Invalid cookie header: "Set-Cookie: hadoop.auth="u=user&p=user&t=test&e=1507086965611&s=eTJrd7PDD0tbafZOOmndzr7acTA="; Path=/; Domain=127.0.0.1; Expires=sre, 04-okt-2017 03:16:05 GMT; Secure; HttpOnly". Invalid 'expires' attribute: sre, 04-okt-2017 03:16:05 GMT
[junit4] 2> 336495 WARN (TEST-TestSolrCloudWithSecureImpersonation.testForwarding-seed#[C72AF9F8FD18D410]) [ ] o.a.h.c.p.ResponseProcessCookies Invalid cookie header: "Set-Cookie: hadoop.auth="u=$&p=$&t=test&e=1507086965614&s=/AME5zMIBnWKKAXkjifH9agUdVE="; Path=/; Domain=127.0.0.1; Expires=sre, 04-okt-2017 03:16:05 GMT; Secure; HttpOnly". Invalid 'expires' attribute: sre, 04-okt-2017 03:16:05 GMT
[junit4] 2> 336512 INFO (qtp22032243-2161) [n:127.0.0.1:43915_solr c:forwardingCollection s:shard1 r:core_node1 x:forwardingCollection_shard1_replica_n1] o.a.s.c.S.Request [forwardingCollection_shard1_replica_n1] webapp=/solr path=/select params={q=*:*&wt=javabin&version=2} hits=0 status=0 QTime=0
[junit4] 2> 336514 WARN (TEST-TestSolrCloudWithSecureImpersonation.testForwarding-seed#[C72AF9F8FD18D410]) [ ] o.a.h.c.p.ResponseProcessCookies Invalid cookie header: "Set-Cookie: hadoop.auth="u=user&p=user&t=test&e=1507086965635&s=o69Jjki+ff5ZcWk1+/UdkfBAPg4="; Path=/; Domain=127.0.0.1; Expires=sre, 04-okt-2017 03:16:05 GMT; Secure; HttpOnly". Invalid 'expires' attribute: sre, 04-okt-2017 03:16:05 GMT
[junit4] 2> 336514 INFO (TEST-TestSolrCloudWithSecureImpersonation.testForwarding-seed#[C72AF9F8FD18D410]) [ ] o.a.s.SolrTestCaseJ4 ###Ending testForwarding
[junit4] 2> 336532 INFO (TEST-TestSolrCloudWithSecureImpersonation.testProxyNoConfigHosts-seed#[C72AF9F8FD18D410]) [ ] o.a.s.SolrTestCaseJ4 ###Starting testProxyNoConfigHosts
[junit4] 2> 336536 WARN (TEST-TestSolrCloudWithSecureImpersonation.testProxyNoConfigHosts-seed#[C72AF9F8FD18D410]) [ ] o.a.h.c.p.ResponseProcessCookies Invalid cookie header: "Set-Cookie: hadoop.auth="u=noHosts&p=noHosts&t=test&e=1507086965658&s=AtXlJxZocdaTddDYpq6WIAFYRTI="; Path=/; Domain=127.0.0.1; Expires=sre, 04-okt-2017 03:16:05 GMT; Secure; HttpOnly". Invalid 'expires' attribute: sre, 04-okt-2017 03:16:05 GMT
[junit4] 2> 336537 INFO (TEST-TestSolrCloudWithSecureImpersonation.testProxyNoConfigHosts-seed#[C72AF9F8FD18D410]) [ ] o.a.s.SolrTestCaseJ4 ###Ending testProxyNoConfigHosts
[junit4] 2> 336550 INFO (TEST-TestSolrCloudWithSecureImpersonation.testProxyInvalidProxyUser-seed#[C72AF9F8FD18D410]) [ ] o.a.s.SolrTestCaseJ4 ###Starting testProxyInvalidProxyUser
[junit4] 2> 336555 WARN (TEST-TestSolrCloudWithSecureImpersonation.testProxyInvalidProxyUser-seed#[C72AF9F8FD18D410]) [ ] o.a.h.c.p.ResponseProcessCookies Invalid cookie header: "Set-Cookie: hadoop.auth="u=bar&p=bar&t=test&e=1507086965674&s=J3ileUXa/a/Ypnvc26lGNTTGEKY="; Path=/; Domain=127.0.0.1; Expires=sre, 04-okt-2017 03:16:05 GMT; Secure; HttpOnly". Invalid 'expires' attribute: sre, 04-okt-2017 03:16:05 GMT
[junit4] 2> 336555 INFO (TEST-TestSolrCloudWithSecureImpersonation.testProxyInvalidProxyUser-seed#[C72AF9F8FD18D410]) [ ] o.a.s.SolrTestCaseJ4 ###Ending testProxyInvalidProxyUser
[junit4] 2> 336573 INFO (TEST-TestSolrCloudWithSecureImpersonation.testProxyValidateGroup-seed#[C72AF9F8FD18D410]) [ ] o.a.s.SolrTestCaseJ4 ###Starting testProxyValidateGroup
[junit4] 2> 336606 INFO (qtp29714285-2165) [n:127.0.0.1:34177_solr ] o.a.s.h.a.CollectionsHandler Invoked Collection Action :list with params doAs=jenkins&action=LIST&wt=javabin&version=2 and sendToOCPQueue=true
[junit4] 2> 336607 INFO (qtp29714285-2165) [n:127.0.0.1:34177_solr ] o.a.s.s.HttpSolrCall [admin] webapp=null path=/admin/collections params={doAs=jenkins&action=LIST&wt=javabin&version=2} status=0 QTime=0
[junit4] 2> 336607 WARN (TEST-TestSolrCloudWithSecureImpersonation.testProxyValidateGroup-seed#[C72AF9F8FD18D410]) [ ] o.a.h.c.p.ResponseProcessCookies Invalid cookie header: "Set-Cookie: hadoop.auth="u=anyHostUsersGroup&p=anyHostUsersGroup&t=test&e=1507086965698&s=dlqRg9EJ6PrLcCBW6wqYYSz/MLg="; Path=/; Domain=127.0.0.1; Expires=sre, 04-okt-2017 03:16:05 GMT; Secure; HttpOnly". Invalid 'expires' attribute: sre, 04-okt-2017 03:16:05 GMT
[junit4] 2> 336607 INFO (TEST-TestSolrCloudWithSecureImpersonation.testProxyValidateGroup-seed#[C72AF9F8FD18D410]) [ ] o.a.s.SolrTestCaseJ4 ###Ending testProxyValidateGroup
[junit4] 2> 336620 INFO (TEST-TestSolrCloudWithSecureImpersonation.testProxyValidateAnyHostAnyUser-seed#[C72AF9F8FD18D410]) [ ] o.a.s.SolrTestCaseJ4 ###Starting testProxyValidateAnyHostAnyUser
[junit4] 2> 336621 INFO (qtp29714285-2166) [n:127.0.0.1:34177_solr ] o.a.s.h.a.CollectionsHandler Invoked Collection Action :list with params doAs=bar&action=LIST&wt=javabin&version=2 and sendToOCPQueue=true
[junit4] 2> 336622 INFO (qtp29714285-2166) [n:127.0.0.1:34177_solr ] o.a.s.s.HttpSolrCall [admin] webapp=null path=/admin/collections params={doAs=bar&action=LIST&wt=javabin&version=2} status=0 QTime=0
[junit4] 2> 336622 WARN (TEST-TestSolrCloudWithSecureImpersonation.testProxyValidateAnyHostAnyUser-seed#[C72AF9F8FD18D410]) [ ] o.a.h.c.p.ResponseProcessCookies Invalid cookie header: "Set-Cookie: hadoop.auth="u=anyHostAnyUser&p=anyHostAnyUser&t=test&e=1507086965745&s=dJlXzAiYIvrflTpnNrn6rxR28rg="; Path=/; Domain=127.0.0.1; Expires=sre, 04-okt-2017 03:16:05 GMT; Secure; HttpOnly". Invalid 'expires' attribute: sre, 04-okt-2017 03:16:05 GMT
[junit4] 2> 336622 INFO (TEST-TestSolrCloudWithSecureImpersonation.testProxyValidateAnyHostAnyUser-seed#[C72AF9F8FD18D410]) [ ] o.a.s.SolrTestCaseJ4 ###Ending testProxyValidateAnyHostAnyUser
[junit4] 2> 336639 INFO (TEST-TestSolrCloudWithSecureImpersonation.testProxyNullProxyUser-seed#[C72AF9F8FD18D410]) [ ] o.a.s.SolrTestCaseJ4 ###Starting testProxyNullProxyUser
[junit4] 2> 336639 INFO (qtp29714285-2172) [ ] o.a.s.s.SolrDispatchFilter Error authenticating
[junit4] 2> java.lang.IllegalArgumentException: userName is NULL, empty or contains a '&'
[junit4] 2> at org.apache.hadoop.security.authentication.util.AuthToken.checkForIllegalArgument(AuthToken.java:87)
[junit4] 2> at org.apache.hadoop.security.authentication.util.AuthToken.<init>(AuthToken.java:70)
[junit4] 2> at org.apache.hadoop.security.authentication.server.AuthenticationToken.<init>(AuthenticationToken.java:58)
[junit4] 2> at org.apache.solr.security.HttpParamDelegationTokenPlugin$HttpParamDelegationTokenAuthenticationHandler$HttpParamAuthenticationHandler.authenticate(HttpParamDelegationTokenPlugin.java:213)
[junit4] 2> at org.apache.hadoop.security.token.delegation.web.DelegationTokenAuthenticationHandler.authenticate(DelegationTokenAuthenticationHandler.java:348)
[junit4] 2> at org.apache.solr.security.RequestContinuesRecorderAuthenticationHandler.authenticate(RequestContinuesRecorderAuthenticationHandler.java:69)
[junit4] 2> at org.apache.hadoop.security.authentication.server.AuthenticationFilter.doFilter(AuthenticationFilter.java:518)
[junit4] 2> at org.apache.solr.security.DelegationTokenKerberosFilter.doFilter(DelegationTokenKerberosFilter.java:134)
[junit4] 2> at org.apache.solr.security.HttpParamDelegationTokenPlugin$HttpParamToRequestFilter.doFilter(HttpParamDelegationTokenPlugin.java:245)
[junit4] 2> at org.apache.solr.security.KerberosPlugin.doAuthenticate(KerberosPlugin.java:243)
[junit4] 2> at org.apache.solr.servlet.SolrDispatchFilter.authenticateRequest(SolrDispatchFilter.java:447)
[junit4] 2> at org.apache.solr.servlet.SolrDispatchFilter.doFilter(SolrDispatchFilter.java:343)
[junit4] 2> at org.apache.solr.servlet.SolrDispatchFilter.doFilter(SolrDispatchFilter.java:322)
[junit4] 2> at org.eclipse.jetty.servlet.ServletHandler$CachedChain.doFilter(ServletHandler.java:1699)
[junit4] 2> at org.apache.solr.client.solrj.embedded.JettySolrRunner$DebugFilter.doFilter(JettySolrRunner.java:139)
[junit4] 2> at org.eclipse.jetty.servlet.ServletHandler$CachedChain.doFilter(ServletHandler.java:1699)
[junit4] 2> at org.eclipse.jetty.servlet.ServletHandler.doHandle(ServletHandler.java:582)
[junit4] 2> at org.eclipse.jetty.server.session.SessionHandler.doHandle(SessionHandler.java:224)
[junit4] 2> at org.eclipse.jetty.server.handler.ContextHandler.doHandle(ContextHandler.java:1180)
[junit4] 2> at org.eclipse.jetty.servlet.ServletHandler.doScope(ServletHandler.java:512)
[junit4] 2> at org.eclipse.jetty.server.session.SessionHandler.doScope(SessionHandler.java:185)
[junit4] 2> at org.eclipse.jetty.server.handler.ContextHandler.doScope(ContextHandler.java:1112)
[junit4] 2> at org.eclipse.jetty.server.handler.ScopedHandler.handle(ScopedHandler.java:141)
[junit4] 2> at org.eclipse.jetty.server.handler.gzip.GzipHandler.handle(GzipHandler.java:462)
[junit4] 2> at org.eclipse.jetty.server.handler.HandlerWrapper.handle(HandlerWrapper.java:134)
[junit4] 2> at org.eclipse.jetty.server.Server.handle(Server.java:534)
[junit4] 2> at org.eclipse.jetty.server.HttpChannel.handle(HttpChannel.java:320)
[junit4] 2> at org.eclipse.jetty.server.HttpConnection.onFillable(HttpConnection.java:251)
[junit4] 2> at org.eclipse.jetty.io.AbstractConnection$ReadCallback.succeeded(AbstractConnection.java:273)
[junit4] 2> at org.eclipse.jetty.io.FillInterest.fillable(FillInterest.java:95)
[junit4] 2> at org.eclipse.jetty.io.ssl.SslConnection.onFillable(SslConnection.java:202)
[junit4] 2> at org.eclipse.jetty.io.AbstractConnection$ReadCallback.succeeded(AbstractConnection.java:273)
[junit4] 2> at org.eclipse.jetty.io.FillInterest.fillable(FillInterest.java:95)
[junit4] 2> at org.eclipse.jetty.io.SelectChannelEndPoint$2.run(SelectChannelEndPoint.java:93)
[junit4] 2> at org.eclipse.jetty.util.thread.strategy.ExecuteProduceConsume.executeProduceConsume(ExecuteProduceConsume.java:303)
[junit4] 2> at org.eclipse.jetty.util.thread.strategy.ExecuteProduceConsume.produceConsume(ExecuteProduceConsume.java:148)
[junit4] 2> at org.eclipse.jetty.util.thread.strategy.ExecuteProduceConsume.run(ExecuteProduceConsume.java:136)
[junit4] 2> at org.eclipse.jetty.util.thread.QueuedThreadPool.runJob(QueuedThreadPool.java:671)
[junit4] 2> at org.eclipse.jetty.util.thread.QueuedThreadPool$2.run(QueuedThreadPool.java:589)
[junit4] 2> at java.lang.Thread.run(Thread.java:748)
[junit4] 2> 336640 WARN (qtp29714285-2172) [ ] o.e.j.s.ServletHandler /solr/admin/collections
[junit4] 2> org.apache.solr.common.SolrException: Error during request authentication,
[junit4] 2> at org.apache.solr.servlet.SolrDispatchFilter.authenticateRequest(SolrDispatchFilter.java:453)
[junit4] 2> at org.apache.solr.servlet.SolrDispatchFilter.doFilter(SolrDispatchFilter.java:343)
[junit4] 2> at org.apache.solr.servlet.SolrDispatchFilter.doFilter(SolrDispatchFilter.java:322)
[junit4] 2> at org.eclipse.jetty.servlet.ServletHandler$CachedChain.doFilter(ServletHandler.java:1699)
[junit4] 2> at org.apache.solr.client.solrj.embedded.JettySolrRunner$DebugFilter.doFilter(JettySolrRunner.java:139)
[junit4] 2> at org.eclipse.jetty.servlet.ServletHandler$CachedChain.doFilter(ServletHandler.java:1699)
[junit4] 2> at org.eclipse.jetty.servlet.ServletHandler.doHandle(ServletHandler.java:582)
[junit4] 2> at org.eclipse.jetty.server.session.SessionHandler.doHandle(SessionHandler.java:224)
[junit4] 2> at org.eclipse.jetty.server.handler.ContextHandler.doHandle(ContextHandler.java:1180)
[junit4] 2> at org.eclipse.jetty.servlet.ServletHandler.doScope(ServletHandler.java:512)
[junit4] 2> at org.eclipse.jetty.server.session.SessionHandler.doScope(SessionHandler.java:185)
[junit4] 2> at org.eclipse.jetty.server.handler.ContextHandler.doScope(ContextHandler.java:1112)
[junit4] 2> at org.eclipse.jetty.server.handler.ScopedHandler.handle(ScopedHandler.java:141)
[junit4] 2> at org.eclipse.jetty.server.handler.gzip.GzipHandler.handle(GzipHandler.java:462)
[junit4] 2> at org.eclipse.jetty.server.handler.HandlerWrapper.handle(HandlerWrapper.java:134)
[junit4] 2> at org.eclipse.jetty.server.Server.handle(Server.java:534)
[junit4] 2> at org.eclipse.jetty.server.HttpChannel.handle(HttpChannel.java:320)
[junit4] 2> at org.eclipse.jetty.server.HttpConnection.onFillable(HttpConnection.java:251)
[junit4] 2> at org.eclipse.jetty.io.AbstractConnection$ReadCallback.succeeded(AbstractConnection.java:273)
[junit4] 2> at org.eclipse.jetty.io.FillInterest.fillable(FillInterest.java:95)
[junit4] 2> at org.eclipse.jetty.io.ssl.SslConnection.onFillable(SslConnection.java:202)
[junit4] 2> at org.eclipse.jetty.io.AbstractConnection$ReadCallback.succeeded(AbstractConnection.java:273)
[junit4] 2> at org.eclipse.jetty.io.FillInterest.fillable(FillInterest.java:95)
[junit4] 2> at org.eclipse.jetty.io.SelectChannelEndPoint$2.run(SelectChannelEndPoint.java:93)
[junit4] 2> at org.eclipse.jetty.util.thread.strategy.ExecuteProduceConsume.executeProduceConsume(ExecuteProduceConsume.java:303)
[junit4] 2> at org.eclipse.jetty.util.thread.strategy.ExecuteProduceConsume.produceConsume(ExecuteProduceConsume.java:148)
[junit4] 2> at org.eclipse.jetty.util.thread.strategy.ExecuteProduceConsume.run(ExecuteProduceConsume.java:136)
[junit4] 2> at org.eclipse.jetty.util.thread.QueuedThreadPool.runJob(QueuedThreadPool.java:671)
[junit4] 2> at org.eclipse.jetty.util.thread.QueuedThreadPool$2.run(QueuedThreadPool.java:589)
[junit4] 2> at java.lang.Thread.run(Thread.java:748)
[junit4] 2> Caused by: java.lang.IllegalArgumentException: userName is NULL, empty or contains a '&'
[junit4] 2> at org.apache.hadoop.security.authentication.util.AuthToken.checkForIllegalArgument(AuthToken.java:87)
[junit4] 2> at org.apache.hadoop.security.authentication.util.AuthToken.<init>(AuthToken.java:70)
[junit4] 2> at org.apache.hadoop.security.authentication.server.AuthenticationToken.<init>(AuthenticationToken.java:58)
[junit4] 2> at org.apache.solr.security.HttpParamDelegationTokenPlugin$HttpParamDelegationTokenAuthenticationHandler$HttpParamAuthenticationHandler.authenticate(HttpParamDelegationTokenPlugin.java:213)
[junit4] 2> at org.apache.hadoop.security.token.delegation.web.DelegationTokenAuthenticationHandler.authenticate(DelegationTokenAuthenticationHandler.java:348)
[junit4] 2> at org.apache.solr.security.RequestContinuesRecorderAuthenticationHandler.authenticate(RequestContinuesRecorderAuthenticationHandler.java:69)
[junit4] 2> at org.apache.hadoop.security.authentication.server.AuthenticationFilter.doFilter(AuthenticationFilter.java:518)
[junit4] 2> at org.apache.solr.security.DelegationTokenKerberosFilter.doFilter(DelegationTokenKerberosFilter.java:134)
[junit4] 2> at org.apache.solr.security.HttpParamDelegationTokenPlugin$HttpParamToRequestFilter.doFilter(HttpParamDelegationTokenPlugin.java:245)
[junit4] 2> at org.apache.solr.security.KerberosPlugin.doAuthenticate(KerberosPlugin.java:243)
[junit4] 2> at org.apache.solr.servlet.SolrDispatchFilter.authenticateRequest(SolrDispatchFilter.java:447)
[junit4] 2> ... 29 more
[junit4] 2> 336645 INFO (TEST-TestSolrCloudWithSecureImpersonation.testProxyNullProxyUser-seed#[C72AF9F8FD18D410]) [ ] o.a.s.SolrTestCaseJ4 ###Ending testProxyNullProxyUser
[junit4] 2> 336658 INFO (TEST-TestSolrCloudWithSecureImpersonation.testProxyUnknownRemote-seed#[C72AF9F8FD18D410]) [ ] o.a.s.SolrTestCaseJ4 ###Starting testProxyUnknownRemote
[junit4] 2> 352562 WARN (jetty-launcher-288-thread-2-SendThread(127.0.0.1:36323)) [n:127.0.0.1:34177_solr ] o.a.z.ClientCnxn Client session timed out, have not heard from server in 15940ms for sessionid 0x15ee33ca3870005
[junit4] 2> 352562 WARN (jetty-launcher-288-thread-1-SendThread(127.0.0.1:36323)) [n:127.0.0.1:43915_solr ] o.a.z.ClientCnxn Client session timed out, have not heard from server in 17916ms for sessionid 0x15ee33ca3870008
[junit4] 2> 352562 WARN (jetty-launcher-288-thread-2-SendThread(127.0.0.1:36323)) [n:127.0.0.1:34177_solr ] o.a.z.ClientCnxn Client session timed out, have not heard from server in 17913ms for sessionid 0x15ee33ca3870007
[junit4] 2> 352564 WARN (TEST-TestSolrCloudWithSecureImpersonation.testProxyUnknownRemote-seed#[C72AF9F8FD18D410]) [ ] o.a.h.c.p.ResponseProcessCookies Invalid cookie header: "Set-Cookie: hadoop.auth="u=localHostAnyGroup&p=localHostAnyGroup&t=test&e=1507086965784&s=YOqEeAYieruh7mQiCLpc1Tpuvro="; Path=/; Domain=127.0.0.1; Expires=sre, 04-okt-2017 03:16:05 GMT; Secure; HttpOnly". Invalid 'expires' attribute: sre, 04-okt-2017 03:16:05 GMT
[junit4] 2> 352564 WARN (NIOServerCxn.Factory:0.0.0.0/0.0.0.0:0) [ ] o.a.z.s.NIOServerCnxn caught end of stream exception
[junit4] 2> EndOfStreamException: Unable to read additional data from client sessionid 0x15ee33ca3870005, likely client has closed socket
[junit4] 2> at org.apache.zookeeper.server.NIOServerCnxn.doIO(NIOServerCnxn.java:239)
[junit4] 2> at org.apache.zookeeper.server.NIOServerCnxnFactory.run(NIOServerCnxnFactory.java:203)
[junit4] 2> at java.lang.Thread.run(Thread.java:748)
[junit4] 2> 352565 INFO (TEST-TestSolrCloudWithSecureImpersonation.testProxyUnknownRemote-seed#[C72AF9F8FD18D410]) [ ] o.a.s.SolrTestCaseJ4 ###Ending testProxyUnknownRemote
[junit4] 2> 352565 WARN (NIOServerCxn.Factory:0.0.0.0/0.0.0.0:0) [ ] o.a.z.s.NIOServerCnxn caught end of stream exception
[junit4] 2> EndOfStreamException: Unable to read additional data from client sessionid 0x15ee33ca3870007, likely client has closed socket
[junit4] 2> at org.apache.zookeeper.server.NIOServerCnxn.doIO(NIOServerCnxn.java:239)
[junit4] 2> at org.apache.zookeeper.server.NIOServerCnxnFactory.run(NIOServerCnxnFactory.java:203)
[junit4] 2> at java.lang.Thread.run(Thread.java:748)
[junit4] 2> 352565 WARN (NIOServerCxn.Factory:0.0.0.0/0.0.0.0:0) [ ] o.a.z.s.NIOServerCnxn caught end of stream exception
[junit4] 2> EndOfStreamException: Unable to read additional data from client sessionid 0x15ee33ca3870008, likely client has closed socket
[junit4] 2> at org.apache.zookeeper.server.NIOServerCnxn.doIO(NIOServerCnxn.java:239)
[junit4] 2> at org.apache.zookeeper.server.NIOServerCnxnFactory.run(NIOServerCnxnFactory.java:203)
[junit4] 2> at java.lang.Thread.run(Thread.java:748)
[junit4] 2> 352565 WARN (jetty-launcher-288-thread-1-SendThread(127.0.0.1:36323)) [n:127.0.0.1:43915_solr ] o.a.z.ClientCnxn Client session timed out, have not heard from server in 16916ms for sessionid 0x15ee33ca3870006
[junit4] 2> 352565 WARN (NIOServerCxn.Factory:0.0.0.0/0.0.0.0:0) [ ] o.a.z.s.NIOServerCnxn caught end of stream exception
[junit4] 2> EndOfStreamException: Unable to read additional data from client sessionid 0x15ee33ca3870006, likely client has closed socket
[junit4] 2> at org.apache.zookeeper.server.NIOServerCnxn.doIO(NIOServerCnxn.java:239)
[junit4] 2> at org.apache.zookeeper.server.NIOServerCnxnFactory.run(NIOServerCnxnFactory.java:203)
[junit4] 2> at java.lang.Thread.run(Thread.java:748)
[junit4] 2> 352574 INFO (TEST-TestSolrCloudWithSecureImpersonation.testProxyInvalidGroup-seed#[C72AF9F8FD18D410]) [ ] o.a.s.SolrTestCaseJ4 ###Starting testProxyInvalidGroup
[junit4] 2> 352580 WARN (qtp29714285-2172) [ ] o.a.h.s.ShellBasedUnixGroupsMapping got exception trying to get groups for user bar: id: âbarâ: no such user
[junit4] 2> id: âbarâ: no such user
[junit4] 2>
[junit4] 2> 352582 WARN (TEST-TestSolrCloudWithSecureImpersonation.testProxyInvalidGroup-seed#[C72AF9F8FD18D410]) [ ] o.a.h.c.p.ResponseProcessCookies Invalid cookie header: "Set-Cookie: hadoop.auth="u=bogusGroup&p=bogusGroup&t=test&e=1507086981699&s=0n7XuwR1fFAsCqbJBxXaD5DJ7x0="; Path=/; Domain=127.0.0.1; Expires=sre, 04-okt-2017 03:16:21 GMT; Secure; HttpOnly". Invalid 'expires' attribute: sre, 04-okt-2017 03:16:21 GMT
[junit4] 2> 352583 INFO (TEST-TestSolrCloudWithSecureImpersonation.testProxyInvalidGroup-seed#[C72AF9F8FD18D410]) [ ] o.a.s.SolrTestCaseJ4 ###Ending testProxyInvalidGroup
[junit4] 2> 352592 INFO (TEST-TestSolrCloudWithSecureImpersonation.testProxyNoConfigGroups-seed#[C72AF9F8FD18D410]) [ ] o.a.s.SolrTestCaseJ4 ###Starting testProxyNoConfigGroups
[junit4] 2> 352594 WARN (TEST-TestSolrCloudWithSecureImpersonation.testProxyNoConfigGroups-seed#[C72AF9F8FD18D410]) [ ] o.a.h.c.p.ResponseProcessCookies Invalid cookie header: "Set-Cookie: hadoop.auth="u=noGroups&p=noGroups&t=test&e=1507086981716&s=k8zAwPuzSSQnBltf/CYHIugFfaw="; Path=/; Domain=127.0.0.1; Expires=sre, 04-okt-2017 03:16:21 GMT; Secure; HttpOnly". Invalid 'expires' attribute: sre, 04-okt-2017 03:16:21 GMT
[junit4] 2> 352594 INFO (TEST-TestSolrCloudWithSecureImpersonation.testProxyNoConfigGroups-seed#[C72AF9F8FD18D410]) [ ] o.a.s.SolrTestCaseJ4 ###Ending testProxyNoConfigGroups
[junit4] 2> 352664 INFO (jetty-launcher-288-thread-2-EventThread) [n:127.0.0.1:34177_solr ] o.a.c.f.s.ConnectionStateManager State change: SUSPENDED
[junit4] 2> 352664 WARN (zkCallback-299-thread-1-processing-n:127.0.0.1:34177_solr) [n:127.0.0.1:34177_solr ] o.a.s.c.c.ConnectionManager Watcher org.apache.solr.common.cloud.ConnectionManager@1d41a64 name: ZooKeeperConnection Watcher:127.0.0.1:36323/solr got event WatchedEvent state:Disconnected type:None path:null path: null type: None
[junit4] 2> 352664 WARN (zkCallback-299-thread-1-processing-n:127.0.0.1:34177_solr) [n:127.0.0.1:34177_solr ] o.a.s.c.c.ConnectionManager zkClient has disconnected
[junit4] 2> 352665 INFO (jetty-launcher-288-thread-1-EventThread) [n:127.0.0.1:43915_solr ] o.a.c.f.s.ConnectionStateManager State change: SUSPENDED
[junit4] 2> 352666 WARN (zkCallback-300-thread-2-processing-n:127.0.0.1:43915_solr) [n:127.0.0.1:43915_solr ] o.a.s.c.c.ConnectionManager Watcher org.apache.solr.common.cloud.ConnectionManager@1c9c262 name: ZooKeeperConnection Watcher:127.0.0.1:36323/solr got event WatchedEvent state:Disconnected type:None path:null path: null type: None
[junit4] 2> 352666 WARN (zkCallback-300-thread-2-processing-n:127.0.0.1:43915_solr) [n:127.0.0.1:43915_solr ] o.a.s.c.c.ConnectionManager zkClient has disconnected
[junit4] 2> 352670 INFO (jetty-closer-289-thread-1) [ ] o.e.j.s.AbstractConnector Stopped ServerConnector@1a78da2{SSL,[ssl, http/1.1]}{127.0.0.1:0}
[junit4] 2> 352671 INFO (jetty-closer-289-thread-1) [ ] o.a.s.c.CoreContainer Shutting down CoreContainer instance=6076056
[junit4] 2> 352671 INFO (jetty-closer-289-thread-2) [ ] o.e.j.s.AbstractConnector Stopped ServerConnector@11d90af{SSL,[ssl, http/1.1]}{127.0.0.1:0}
[junit4] 2> 352671 INFO (jetty-closer-289-thread-2) [ ] o.a.s.c.CoreContainer Shutting down CoreContainer instance=11644833
[junit4] 2> 352672 INFO (jetty-closer-289-thread-2) [ ] o.a.s.m.SolrMetricManager Closing metric reporters for registry=solr.node, tag=null
[junit4] 2> 352672 INFO (jetty-closer-289-thread-2) [ ] o.a.s.m.r.SolrJmxReporter Closing reporter [org.apache.solr.metrics.reporters.SolrJmxReporter@c623fb: rootName = solr_43915, domain = solr.node, service url = null, agent id = null] for registry solr.node / com.codahale.metrics.MetricRegistry@1d13407
[junit4] 2> 352674 INFO (jetty-closer-289-thread-1) [ ] o.a.s.m.SolrMetricManager Closing metric reporters for registry=solr.node, tag=null
[junit4] 2> 352675 INFO (jetty-closer-289-thread-1) [ ] o.a.s.m.r.SolrJmxReporter Closing reporter [org.apache.solr.metrics.reporters.SolrJmxReporter@421098: rootName = solr_34177, domain = solr.node, service url = null, agent id = null] for registry solr.node / com.codahale.metrics.MetricRegistry@174364a
[junit4] 2> 352679 INFO (jetty-closer-289-thread-2) [ ] o.a.s.m.SolrMetricManager Closing metric reporters for registry=solr.jvm, tag=null
[junit4] 2> 352679 INFO (jetty-closer-289-thread-2) [ ] o.a.s.m.r.SolrJmxReporter Closing reporter [org.apache.solr.metrics.reporters.SolrJmxReporter@7bb254: rootName = solr_43915, domain = solr.jvm, service url = null, agent id = null] for registry solr.jvm / com.codahale.metrics.MetricRegistry@c14329
[junit4] 2> 352679 INFO (jetty-closer-289-thread-1) [ ] o.a.s.m.SolrMetricManager Closing metric reporters for registry=solr.jvm, tag=null
[junit4] 2> 352679 INFO (jetty-closer-289-thread-1) [ ] o.a.s.m.r.SolrJmxReporter Closing reporter [org.apache.solr.metrics.reporters.SolrJmxReporter@379fb6: rootName = solr_34177, domain = solr.jvm, service url = null, agent id = null] for registry solr.jvm / com.codahale.metrics.MetricRegistry@c14329
[junit4] 2> 352682 INFO (jetty-closer-289-thread-2) [ ] o.a.s.m.SolrMetricManager Closing metric reporters for registry=solr.jetty, tag=null
[junit4] 2> 352682 INFO (jetty-closer-289-thread-1) [ ] o.a.s.m.SolrMetricManager Closing metric reporters for registry=solr.jetty, tag=null
[junit4] 2> 352682 INFO (jetty-closer-289-thread-2) [ ] o.a.s.m.r.SolrJmxReporter Closing reporter [org.apache.solr.metrics.reporters.SolrJmxReporter@f8c441: rootName = solr_43915, domain = solr.jetty, service url = null, agent id = null] for registry solr.jetty / com.codahale.metrics.MetricRegistry@1bb3c2b
[junit4] 2> 352682 INFO (jetty-closer-289-thread-1) [ ] o.a.s.m.r.SolrJmxReporter Closing reporter [org.apache.solr.metrics.reporters.SolrJmxReporter@47f9d: rootName = solr_34177, domain = solr.jetty, service url = null, agent id = null] for registry solr.jetty / com.codahale.metrics.MetricRegistry@1bb3c2b
[junit4] 2> 353842 INFO (jetty-closer-289-thread-1) [ ] o.a.s.m.SolrMetricManager Closing metric reporters for registry=solr.cluster, tag=null
[junit4] 2> 353843 WARN (zkCallback-299-thread-1-processing-n:127.0.0.1:34177_solr) [n:127.0.0.1:34177_solr ] o.a.s.c.c.ZkStateReader ZooKeeper watch triggered, but Solr cannot talk to ZK: [KeeperErrorCode = Session expired for /live_nodes]
[junit4] 2> 353844 ERROR (Thread[Thread-428,5,TGRP-TestSolrCloudWithSecureImpersonation]) [n:127.0.0.1:34177_solr ] o.a.h.s.t.d.AbstractDelegationTokenSecretManager ExpiredTokenRemover received java.lang.InterruptedException: sleep interrupted
[junit4] 2> 354285 INFO (jetty-closer-289-thread-1) [ ] o.e.j.s.h.ContextHandler Stopped o.e.j.s.ServletContextHandler@20268d{/solr,null,UNAVAILABLE}
[junit4] 2> 354594 INFO (zkCallback-300-thread-5-processing-n:127.0.0.1:43915_solr) [n:127.0.0.1:43915_solr ] o.a.s.c.c.ZkStateReader Updated live nodes from ZooKeeper... (2) -> (1)
[junit4] 2> 354594 INFO (jetty-closer-289-thread-2) [ ] o.a.s.m.SolrMetricManager Closing metric reporters for registry=solr.cluster, tag=null
[junit4] 2> 354595 INFO (zkCallback-300-thread-5-processing-n:127.0.0.1:43915_solr) [n:127.0.0.1:43915_solr ] o.a.s.c.c.ZkStateReader A cluster state change: [WatchedEvent state:SyncConnected type:NodeDataChanged path:/collections/forwardingCollection/state.json] for collection [forwardingCollection] has occurred - updating... (live nodes size: [1])
[junit4] 2> 354595 INFO (zkCallback-300-thread-4-processing-n:127.0.0.1:43915_solr) [n:127.0.0.1:43915_solr ] o.a.s.c.c.ZkStateReader A cluster state change: [WatchedEvent state:SyncConnected type:NodeDataChanged path:/collections/forwardingCollection/state.json] for collection [forwardingCollection] has occurred - updating... (live nodes size: [1])
[junit4] 2> 354598 INFO (coreCloseExecutor-767-thread-1) [n:127.0.0.1:43915_solr c:forwardingCollection s:shard1 r:core_node1 x:forwardingCollection_shard1_replica_n1] o.a.s.c.SolrCore [forwardingCollection_shard1_replica_n1] CLOSING SolrCore org.apache.solr.core.SolrCore@172d38e
[junit4] 2> 354598 INFO (coreCloseExecutor-767-thread-1) [n:127.0.0.1:43915_solr c:forwardingCollection s:shard1 r:core_node1 x:forwardingCollection_shard1_replica_n1] o.a.s.m.SolrMetricManager Closing metric reporters for registry=solr.core.forwardingCollection.shard1.replica_n1, tag=24302478
[junit4] 2> 354598 INFO (coreCloseExecutor-767-thread-1) [n:127.0.0.1:43915_solr c:forwardingCollection s:shard1 r:core_node1 x:forwardingCollection_shard1_replica_n1] o.a.s.m.r.SolrJmxReporter Closing reporter [org.apache.solr.metrics.reporters.SolrJmxReporter@1f73b58: rootName = solr_43915, domain = solr.core.forwardingCollection.shard1.replica_n1, service url = null, agent id = null] for registry solr.core.forwardingCollection.shard1.replica_n1 / com.codahale.metrics.MetricRegistry@1c44d1b
[junit4] 2> 354606 INFO (coreCloseExecutor-767-thread-1) [n:127.0.0.1:43915_solr c:forwardingCollection s:shard1 r:core_node1 x:forwardingCollection_shard1_replica_n1] o.a.s.m.SolrMetricManager Closing metric reporters for registry=solr.collection.forwardingCollection.shard1.leader, tag=24302478
[junit4] 2> 354607 INFO (jetty-closer-289-thread-2) [ ] o.a.s.c.Overseer Overseer (id=98766091429806086-127.0.0.1:43915_solr-n_0000000000) closing
[junit4] 2> 354607 INFO (OverseerStateUpdate-98766091429806086-127.0.0.1:43915_solr-n_0000000000) [n:127.0.0.1:43915_solr ] o.a.s.c.Overseer Overseer Loop exiting : 127.0.0.1:43915_solr
[junit4] 2> 354608 ERROR (Thread[Thread-431,5,TGRP-TestSolrCloudWithSecureImpersonation]) [n:127.0.0.1:43915_solr ] o.a.h.s.t.d.AbstractDelegationTokenSecretManager ExpiredTokenRemover received java.lang.InterruptedException: sleep interrupted
[junit4] 2> 354609 INFO (jetty-closer-289-thread-2) [ ] o.e.j.s.h.ContextHandler Stopped o.e.j.s.ServletContextHandler@2c7e5b{/solr,null,UNAVAILABLE}
[junit4] 2> 354610 ERROR (SUITE-TestSolrCloudWithSecureImpersonation-seed#[C72AF9F8FD18D410]-worker) [ ] o.a.z.s.ZooKeeperServer ZKShutdownHandler is not registered, so ZooKeeper server won't take any action on ERROR or SHUTDOWN server state changes
[junit4] 2> 354610 INFO (SUITE-TestSolrCloudWithSecureImpersonation-seed#[C72AF9F8FD18D410]-worker) [ ] o.a.s.c.ZkTestServer connecting to 127.0.0.1:36323 36323
[junit4] 2> 359640 INFO (Thread-411) [ ] o.a.s.c.ZkTestServer connecting to 127.0.0.1:36323 36323
[junit4] 2> 359640 WARN (Thread-411) [ ] o.a.s.c.ZkTestServer Watch limit violations:
[junit4] 2> Maximum concurrent create/delete watches above limit:
[junit4] 2>
[junit4] 2> 3 /solr/aliases.json
[junit4] 2> 2 /solr/security.json
[junit4] 2>
[junit4] 2> Maximum concurrent data watches above limit:
[junit4] 2>
[junit4] 2> 6 /solr/collections/forwardingCollection/state.json
[junit4] 2> 3 /solr/clusterstate.json
[junit4] 2> 3 /solr/clusterprops.json
[junit4] 2> 2 /solr/security/zkdtsm/ZKDTSMRoot/ZKDTSMKeyIdRoot
[junit4] 2> 2 /solr/security/zkdtsm/ZKDTSMRoot/ZKDTSMMasterKeyRoot/DK_1
[junit4] 2> 2 /solr/security/zkdtsm/ZKDTSMRoot/ZKDTSMMasterKeyRoot/DK_3
[junit4] 2> 2 /solr/security/zkdtsm/ZKDTSMRoot/ZKDTSMMasterKeyRoot/DK_2
[junit4] 2> 2 /solr/security/zkdtsm/ZKDTSMRoot/ZKDTSMMasterKeyRoot/DK_4
[junit4] 2> 2 /solr/security/zkdtsm/ZKDTSMRoot/ZKDTSMSeqNumRoot
[junit4] 2>
[junit4] 2> Maximum concurrent children watches above limit:
[junit4] 2>
[junit4] 2> 3 /solr/live_nodes
[junit4] 2> 3 /solr/collections
[junit4] 2> 3 /solr/security/zkdtsm/ZKDTSMRoot/ZKDTSMTokensRoot
[junit4] 2> 2 /solr/security/zkdtsm/ZKDTSMRoot/ZKDTSMMasterKeyRoot
[junit4] 2>
[junit4] 2> 359648 INFO (SUITE-TestSolrCloudWithSecureImpersonation-seed#[C72AF9F8FD18D410]-worker) [ ] o.a.s.SolrTestCaseJ4 ------------------------------------------------------- Done waiting for tracked resources to be released
[junit4] 2> Oct 03, 2017 5:16:28 PM com.carrotsearch.randomizedtesting.ThreadLeakControl checkThreadLeaks
[junit4] 2> WARNING: Will linger awaiting termination of 2 leaked thread(s).
[junit4] 2> Oct 03, 2017 5:16:48 PM com.carrotsearch.randomizedtesting.ThreadLeakControl checkThreadLeaks
[junit4] 2> SEVERE: 2 threads leaked from SUITE scope at org.apache.solr.cloud.TestSolrCloudWithSecureImpersonation:
[junit4] 2> 1) Thread[id=2202, name=jetty-launcher-288-thread-2-EventThread, state=TIMED_WAITING, group=TGRP-TestSolrCloudWithSecureImpersonation]
[junit4] 2> at sun.misc.Unsafe.park(Native Method)
[junit4] 2> at java.util.concurrent.locks.LockSupport.parkNanos(LockSupport.java:215)
[junit4] 2> at java.util.concurrent.locks.AbstractQueuedSynchronizer.doAcquireSharedNanos(AbstractQueuedSynchronizer.java:1037)
[junit4] 2> at java.util.concurrent.locks.AbstractQueuedSynchronizer.tryAcquireSharedNanos(AbstractQueuedSynchronizer.java:1328)
[junit4] 2> at java.util.concurrent.CountDownLatch.await(CountDownLatch.java:277)
[junit4] 2> at org.apache.curator.CuratorZookeeperClient.internalBlockUntilConnectedOrTimedOut(CuratorZookeeperClient.java:323)
[junit4] 2> at org.apache.curator.RetryLoop.callWithRetry(RetryLoop.java:105)
[junit4] 2> at org.apache.curator.framework.imps.GetDataBuilderImpl.pathInForeground(GetDataBuilderImpl.java:288)
[junit4] 2> at org.apache.curator.framework.imps.GetDataBuilderImpl.forPath(GetDataBuilderImpl.java:279)
[junit4] 2> at org.apache.curator.framework.imps.GetDataBuilderImpl.forPath(GetDataBuilderImpl.java:41)
[junit4] 2> at org.apache.curator.framework.recipes.shared.SharedValue.readValue(SharedValue.java:244)
[junit4] 2> at org.apache.curator.framework.recipes.shared.SharedValue.access$100(SharedValue.java:44)
[junit4] 2> at org.apache.curator.framework.recipes.shared.SharedValue$1.process(SharedValue.java:61)
[junit4] 2> at org.apache.curator.framework.imps.NamespaceWatcher.process(NamespaceWatcher.java:67)
[junit4] 2> at org.apache.zookeeper.ClientCnxn$EventThread.processEvent(ClientCnxn.java:530)
[junit4] 2> at org.apache.zookeeper.ClientCnxn$EventThread.run(ClientCnxn.java:505)
[junit4] 2> 2) Thread[id=2209, name=jetty-launcher-288-thread-1-EventThread, state=TIMED_WAITING, group=TGRP-TestSolrCloudWithSecureImpersonation]
[junit4] 2> at sun.misc.Unsafe.park(Native Method)
[junit4] 2> at java.util.concurrent.locks.LockSupport.parkNanos(LockSupport.java:215)
[junit4] 2> at java.util.concurrent.locks.AbstractQueuedSynchronizer.doAcquireSharedNanos(AbstractQueuedSynchronizer.java:1037)
[junit4] 2> at java.util.concurrent.locks.AbstractQueuedSynchronizer.tryAcquireSharedNanos(AbstractQueuedSynchronizer.java:1328)
[junit4] 2> at java.util.concurrent.CountDownLatch.await(CountDownLatch.java:277)
[junit4] 2> at org.apache.curator.CuratorZookeeperClient.internalBlockUntilConnectedOrTimedOut(CuratorZookeeperClient.java:323)
[junit4] 2> at org.apache.curator.RetryLoop.callWithRetry(RetryLoop.java:105)
[junit4] 2> at org.apache.curator.framework.imps.GetDataBuilderImpl.pathInForeground(GetDataBuilderImpl.java:288)
[junit4] 2> at org.apache.curator.framework.imps.GetDataBuilderImpl.forPath(GetDataBuilderImpl.java:279)
[junit4] 2> at org.apache.curator.framework.imps.GetDataBuilderImpl.forPath(GetDataBuilderImpl.java:41)
[junit4] 2> at org.apache.curator.framework.recipes.shared.SharedValue.readValue(SharedValue.java:244)
[junit4] 2> at org.apache.curator.framework.recipes.shared.SharedValue.access$100(SharedValue.java:44)
[junit4] 2> at org.apache.curator.framework.recipes.shared.SharedValue$1.process(SharedValue.java:61)
[junit4] 2> at org.apache.curator.framework.imps.NamespaceWatcher.process(NamespaceWatcher.java:67)
[junit4] 2> at org.apache.zookeeper.ClientCnxn$EventThread.processEvent(ClientCnxn.java:530)
[junit4] 2> at org.apache.zookeeper.ClientCnxn$EventThread.run(ClientCnxn.java:505)
[junit4] 2> Oct 03, 2017 5:16:48 PM com.carrotsearch.randomizedtesting.ThreadLeakControl tryToInterruptAll
[junit4] 2> INFO: Starting to interrupt leaked threads:
[junit4] 2> 1) Thread[id=2202, name=jetty-launcher-288-thread-2-EventThread, state=TIMED_WAITING, group=TGRP-TestSolrCloudWithSecureImpersonation]
[junit4] 2> 2) Thread[id=2209, name=jetty-launcher-288-thread-1-EventThread, state=TIMED_WAITING, group=TGRP-TestSolrCloudWithSecureImpersonation]
[junit4] 2> 379726 ERROR (jetty-launcher-288-thread-2-EventThread) [n:127.0.0.1:34177_solr ] o.a.c.f.i.CuratorFrameworkImpl Watcher exception
[junit4] 2> java.lang.InterruptedException
[junit4] 2> at java.util.concurrent.locks.AbstractQueuedSynchronizer.doAcquireSharedNanos(AbstractQueuedSynchronizer.java:1039)
[junit4] 2> at java.util.concurrent.locks.AbstractQueuedSynchronizer.tryAcquireSharedNanos(AbstractQueuedSynchronizer.java:1328)
[junit4] 2> at java.util.concurrent.CountDownLatch.await(CountDownLatch.java:277)
[junit4] 2> at org.apache.curator.CuratorZookeeperClient.internalBlockUntilConnectedOrTimedOut(CuratorZookeeperClient.java:323)
[junit4] 2> at org.apache.curator.RetryLoop.callWithRetry(RetryLoop.java:105)
[junit4] 2> at org.apache.curator.framework.imps.GetDataBuilderImpl.pathInForeground(GetDataBuilderImpl.java:288)
[junit4] 2> at org.apache.curator.framework.imps.GetDataBuilderImpl.forPath(GetDataBuilderImpl.java:279)
[junit4] 2> at org.apache.curator.framework.imps.GetDataBuilderImpl.forPath(GetDataBuilderImpl.java:41)
[junit4] 2> at org.apache.curator.framework.recipes.shared.SharedValue.readValue(SharedValue.java:244)
[junit4] 2> at org.apache.curator.framework.recipes.shared.SharedValue.access$100(SharedValue.java:44)
[junit4] 2> at org.apache.curator.framework.recipes.shared.SharedValue$1.process(SharedValue.java:61)
[junit4] 2> at org.apache.curator.framework.imps.NamespaceWatcher.process(NamespaceWatcher.java:67)
[junit4] 2> at org.apache.zookeeper.ClientCnxn$EventThread.processEvent(ClientCnxn.java:530)
[junit4] 2> at org.apache.zookeeper.ClientCnxn$EventThread.run(ClientCnxn.java:505)
[junit4] 2> 379727 ERROR (jetty-launcher-288-thread-1-EventThread) [n:127.0.0.1:43915_solr ] o.a.c.f.i.CuratorFrameworkImpl Watcher exception
[junit4] 2> java.lang.InterruptedException
[junit4] 2> at java.util.concurrent.locks.AbstractQueuedSynchronizer.doAcquireSharedNanos(AbstractQueuedSynchronizer.java:1039)
[junit4] 2> at java.util.concurrent.locks.AbstractQueuedSynchronizer.tryAcquireSharedNanos(AbstractQueuedSynchronizer.java:1328)
[junit4] 2> at java.util.concurrent.CountDownLatch.await(CountDownLatch.java:277)
[junit4] 2> at org.apache.curator.CuratorZookeeperClient.internalBlockUntilConnectedOrTimedOut(CuratorZookeeperClient.java:323)
[junit4] 2> at org.apache.curator.RetryLoop.callWithRetry(RetryLoop.java:105)
[junit4] 2> at org.apache.curator.framework.imps.GetDataBuilderImpl.pathInForeground(GetDataBuilderImpl.java:288)
[junit4] 2> at org.apache.curator.framework.imps.GetDataBuilderImpl.forPath(GetDataBuilderImpl.java:279)
[junit4] 2> at org.apache.curator.framework.imps.GetDataBuilderImpl.forPath(GetDataBuilderImpl.java:41)
[junit4] 2> at org.apache.curator.framework.recipes.shared.SharedValue.readValue(SharedValue.java:244)
[junit4] 2> at org.apache.curator.framework.recipes.shared.SharedValue.access$100(SharedValue.java:44)
[junit4] 2> at org.apache.curator.framework.recipes.shared.SharedValue$1.process(SharedValue.java:61)
[junit4] 2> at org.apache.curator.framework.imps.NamespaceWatcher.process(NamespaceWatcher.java:67)
[junit4] 2> at org.apache.zookeeper.ClientCnxn$EventThread.processEvent(ClientCnxn.java:530)
[junit4] 2> at org.apache.zookeeper.ClientCnxn$EventThread.run(ClientCnxn.java:505)
[junit4] 2> Oct 03, 2017 5:16:48 PM com.carrotsearch.randomizedtesting.ThreadLeakControl tryToInterruptAll
[junit4] 2> INFO: All leaked threads terminated.
[junit4] 2> NOTE: test params are: codec=Asserting(Lucene70), sim=RandomSimilarity(queryNorm=true): {}, locale=sr-Latn-ME, timezone=America/Sitka
[junit4] 2> NOTE: Linux 4.10.0-33-generic i386/Oracle Corporation 1.8.0_144 (32-bit)/cpus=8,threads=1,free=69637440,total=320602112
[junit4] 2> NOTE: All tests run in this JVM: [AnalysisAfterCoreReloadTest, DistributedMLTComponentTest, SolrMetricReporterTest, StatsReloadRaceTest, TestFieldCache, SharedFSAutoReplicaFailoverTest, HdfsBasicDistributedZk2Test, SOLR749Test, ChaosMonkeySafeLeaderTest, TestStressRecovery, TestPrepRecovery, TestCustomStream, V2StandaloneTest, TestDynamicFieldCollectionResource, ShardRoutingTest, HttpPartitionTest, TestSystemIdResolver, TestAtomicUpdateErrorCases, TestMultiWordSynonyms, ConcurrentDeleteAndCreateCollectionTest, DistributedFacetPivotLongTailTest, TestBackupRepositoryFactory, TestExpandComponent, TestSolrCloudWithSecureImpersonation]
[junit4] 2> NOTE: reproduce with: ant test -Dtestcase=TestSolrCloudWithSecureImpersonation -Dtests.seed=C72AF9F8FD18D410 -Dtests.multiplier=3 -Dtests.slow=true -Dtests.locale=sr-Latn-ME -Dtests.timezone=America/Sitka -Dtests.asserts=true -Dtests.file.encoding=ISO-8859-1
[junit4] ERROR 0.00s J1 | TestSolrCloudWithSecureImpersonation (suite) <<<
[junit4] > Throwable #1: com.carrotsearch.randomizedtesting.ThreadLeakError: 2 threads leaked from SUITE scope at org.apache.solr.cloud.TestSolrCloudWithSecureImpersonation:
[junit4] > 1) Thread[id=2202, name=jetty-launcher-288-thread-2-EventThread, state=TIMED_WAITING, group=TGRP-TestSolrCloudWithSecureImpersonation]
[junit4] > at sun.misc.Unsafe.park(Native Method)
[junit4] > at java.util.concurrent.locks.LockSupport.parkNanos(LockSupport.java:215)
[junit4] > at java.util.concurrent.locks.AbstractQueuedSynchronizer.doAcquireSharedNanos(AbstractQueuedSynchronizer.java:1037)
[junit4] > at java.util.concurrent.locks.AbstractQueuedSynchronizer.tryAcquireSharedNanos(AbstractQueuedSynchronizer.java:1328)
[junit4] > at java.util.concurrent.CountDownLatch.await(CountDownLatch.java:277)
[junit4] > at org.apache.curator.CuratorZookeeperClient.internalBlockUntilConnectedOrTimedOut(CuratorZookeeperClient.java:323)
[junit4] > at org.apache.curator.RetryLoop.callWithRetry(RetryLoop.java:105)
[junit4] > at org.apache.curator.framework.imps.GetDataBuilderImpl.pathInForeground(GetDataBuilderImpl.java:288)
[junit4] > at org.apache.curator.framework.imps.GetDataBuilderImpl.forPath(GetDataBuilderImpl.java:279)
[junit4] > at org.apache.curator.framework.imps.GetDataBuilderImpl.forPath(GetDataBuilderImpl.java:41)
[junit4] > at org.apache.curator.framework.recipes.shared.SharedValue.readValue(SharedValue.java:244)
[junit4] > at org.apache.curator.framework.recipes.shared.SharedValue.access$100(SharedValue.java:44)
[junit4] > at org.apache.curator.framework.recipes.shared.SharedValue$1.process(SharedValue.java:61)
[junit4] > at org.apache.curator.framework.imps.NamespaceWatcher.process(NamespaceWatcher.java:67)
[junit4] > at org.apache.zookeeper.ClientCnxn$EventThread.processEvent(ClientCnxn.java:530)
[junit4] > at org.apache.zookeeper.ClientCnxn$EventThread.run(ClientCnxn.java:505)
[junit4] > 2) Thread[id=2209, name=jetty-launcher-288-thread-1-EventThread, state=TIMED_WAITING, group=TGRP-TestSolrCloudWithSecureImpersonation]
[junit4] > at sun.misc.Unsafe.park(Native Method)
[junit4] > at java.util.concurrent.locks.LockSupport.parkNanos(LockSupport.java:215)
[junit4] > at java.util.concurrent.locks.AbstractQueuedSynchronizer.doAcquireSharedNanos(AbstractQueuedSynchronizer.java:1037)
[junit4] > at java.util.concurrent.locks.AbstractQueuedSynchronizer.tryAcquireSharedNanos(AbstractQueuedSynchronizer.java:1328)
[junit4] > at java.util.concurrent.CountDownLatch.await(CountDownLatch.java:277)
[junit4] > at org.apache.curator.CuratorZookeeperClient.internalBlockUntilConnectedOrTimedOut(CuratorZookeeperClient.java:323)
[junit4] > at org.apache.curator.RetryLoop.callWithRetry(RetryLoop.java:105)
[junit4] > at org.apache.curator.framework.imps.GetDataBuilderImpl.pathInForeground(GetDataBuilderImpl.java:288)
[junit4] > at org.apache.curator.framework.imps.GetDataBuilderImpl.forPath(GetDataBuilderImpl.java:279)
[junit4] > at org.apache.curator.framework.imps.GetDataBuilderImpl.forPath(GetDataBuilderImpl.java:41)
[junit4] > at org.apache.curator.framework.recipes.shared.SharedValue.readValue(SharedValue.java:244)
[junit4] > at org.apache.curator.framework.recipes.shared.SharedValue.access$100(SharedValue.java:44)
[junit4] > at org.apache.curator.framework.recipes.shared.SharedValue$1.process(SharedValue.java:61)
[junit4] > at org.apache.curator.framework.imps.NamespaceWatcher.process(NamespaceWatcher.java:67)
[junit4] > at org.apache.zookeeper.ClientCnxn$EventThread.processEvent(ClientCnxn.java:530)
[junit4] > at org.apache.zookeeper.ClientCnxn$EventThread.run(ClientCnxn.java:505)
[junit4] > at __randomizedtesting.SeedInfo.seed([C72AF9F8FD18D410]:0)
[junit4] Completed [89/730 (1!)] on J1 in 53.39s, 12 tests, 1 error <<< FAILURES!
[...truncated 41773 lines...]