You are viewing a plain text version of this content. The canonical link for it is here.
Posted to commits@phoenix.apache.org by Apache Jenkins Server <je...@builds.apache.org> on 2014/09/03 08:34:03 UTC
Build failed in Jenkins: Phoenix | 4.0 | Hadoop2 #91
See <https://builds.apache.org/job/Phoenix-4.0-hadoop2/91/changes>
Changes:
[rajeshbabu] PHOENIX-1139 Failed to disable local index when index update fails(Rajeshbabu)
------------------------------------------
[...truncated 1452 lines...]
ScanQueryIT.testScan:86 null
QueryIT.testSimpleInListStatement:443->BaseQueryIT.assertValueEqualsResultSet:131->BaseTest.assertValuesEqualsResultSet:1287 expected:<0> but was:<2>
ScanQueryIT.testAllScan:229 null
ScanQueryIT.testScan:86 null
CastAndCoerceIT.testCastOperatorInSelect:69 null
CastAndCoerceIT.testCoerceDateToBigInt:210 null
CastAndCoerceIT.testCastOperatorInSelect:69 null
CastAndCoerceIT.testCoerceDateToBigInt:210 null
CastAndCoerceIT.testCastOperatorInSelect:69 null
CastAndCoerceIT.testCoerceDateToBigInt:210 null
ClientTimeArithmeticQueryIT.testIntSubtractionExpression:186->BaseQueryIT.assertValueEqualsResultSet:131->BaseTest.assertValuesEqualsResultSet:1287 expected:<0> but was:<4>
ClientTimeArithmeticQueryIT.testDecimalSubtraction1Expression:200->BaseQueryIT.assertValueEqualsResultSet:131->BaseTest.assertValuesEqualsResultSet:1287 expected:<0> but was:<3>
ClientTimeArithmeticQueryIT.testNegateExpression:431 null
ClientTimeArithmeticQueryIT.testConstantSubtractionExpression:314 null
ClientTimeArithmeticQueryIT.testIntToDecimalDivideExpression:382->BaseQueryIT.assertValueEqualsResultSet:131->BaseTest.assertValuesEqualsResultSet:1287 expected:<0> but was:<3>
ClientTimeArithmeticQueryIT.testIntAddExpression:530 null
ClientTimeArithmeticQueryIT.testSelectWithDivideExpression:413 null
ClientTimeArithmeticQueryIT.testDateAdd:88->BaseTest.assertValuesEqualsResultSet:1287 expected:<0> but was:<3>
ClientTimeArithmeticQueryIT.testDateSubtract:593->BaseTest.assertValuesEqualsResultSet:1287 expected:<0> but was:<3>
ClientTimeArithmeticQueryIT.testIntMultiplyExpression:448 null
ClientTimeArithmeticQueryIT.testConstantDivideExpression:397 null
ClientTimeArithmeticQueryIT.testIntDivideExpression:331 null
ClientTimeArithmeticQueryIT.testIntToDecimalMultiplyExpression:499->BaseQueryIT.assertValueEqualsResultSet:131->BaseTest.assertValuesEqualsResultSet:1287 expected:<0> but was:<3>
ClientTimeArithmeticQueryIT.testIntSubtractionExpression:186->BaseQueryIT.assertValueEqualsResultSet:131->BaseTest.assertValuesEqualsResultSet:1287 expected:<0> but was:<4>
ClientTimeArithmeticQueryIT.testDecimalSubtraction1Expression:200->BaseQueryIT.assertValueEqualsResultSet:131->BaseTest.assertValuesEqualsResultSet:1287 expected:<0> but was:<3>
ClientTimeArithmeticQueryIT.testNegateExpression:431 null
ClientTimeArithmeticQueryIT.testConstantSubtractionExpression:314 null
ClientTimeArithmeticQueryIT.testIntToDecimalDivideExpression:382->BaseQueryIT.assertValueEqualsResultSet:131->BaseTest.assertValuesEqualsResultSet:1287 expected:<0> but was:<3>
ClientTimeArithmeticQueryIT.testIntAddExpression:530 null
ClientTimeArithmeticQueryIT.testSelectWithDivideExpression:413 null
ClientTimeArithmeticQueryIT.testDateAdd:88->BaseTest.assertValuesEqualsResultSet:1287 expected:<0> but was:<3>
ClientTimeArithmeticQueryIT.testDateSubtract:593->BaseTest.assertValuesEqualsResultSet:1287 expected:<0> but was:<3>
ClientTimeArithmeticQueryIT.testIntMultiplyExpression:448 null
ClientTimeArithmeticQueryIT.testConstantDivideExpression:397 null
ClientTimeArithmeticQueryIT.testIntDivideExpression:331 null
ClientTimeArithmeticQueryIT.testIntToDecimalMultiplyExpression:499->BaseQueryIT.assertValueEqualsResultSet:131->BaseTest.assertValuesEqualsResultSet:1287 expected:<0> but was:<3>
ClientTimeArithmeticQueryIT.testIntSubtractionExpression:186->BaseQueryIT.assertValueEqualsResultSet:131->BaseTest.assertValuesEqualsResultSet:1287 expected:<0> but was:<4>
ClientTimeArithmeticQueryIT.testDecimalSubtraction1Expression:200->BaseQueryIT.assertValueEqualsResultSet:131->BaseTest.assertValuesEqualsResultSet:1287 expected:<0> but was:<3>
ClientTimeArithmeticQueryIT.testNegateExpression:431 null
ClientTimeArithmeticQueryIT.testConstantSubtractionExpression:314 null
ClientTimeArithmeticQueryIT.testIntToDecimalDivideExpression:382->BaseQueryIT.assertValueEqualsResultSet:131->BaseTest.assertValuesEqualsResultSet:1287 expected:<0> but was:<3>
ClientTimeArithmeticQueryIT.testIntAddExpression:530 null
ClientTimeArithmeticQueryIT.testSelectWithDivideExpression:413 null
ClientTimeArithmeticQueryIT.testDateAdd:88->BaseTest.assertValuesEqualsResultSet:1287 expected:<0> but was:<3>
ClientTimeArithmeticQueryIT.testDateSubtract:593->BaseTest.assertValuesEqualsResultSet:1287 expected:<0> but was:<3>
ClientTimeArithmeticQueryIT.testIntMultiplyExpression:448 null
ClientTimeArithmeticQueryIT.testConstantDivideExpression:397 null
ClientTimeArithmeticQueryIT.testIntDivideExpression:331 null
ClientTimeArithmeticQueryIT.testIntToDecimalMultiplyExpression:499->BaseQueryIT.assertValueEqualsResultSet:131->BaseTest.assertValuesEqualsResultSet:1287 expected:<0> but was:<3>
Tests run: 1266, Failures: 102, Errors: 0, Skipped: 0
[INFO]
[INFO] --- maven-failsafe-plugin:2.17:integration-test (HBaseManagedTimeTests) @ phoenix-core ---
[INFO] Failsafe report directory: <https://builds.apache.org/job/Phoenix-4.0-hadoop2/ws/phoenix-core/target/failsafe-reports>
[INFO] parallel='none', perCoreThreadCount=true, threadCount=0, useUnlimitedThreads=false, threadCountSuites=0, threadCountClasses=0, threadCountMethods=0, parallelOptimized=true
-------------------------------------------------------
T E S T S
-------------------------------------------------------
-------------------------------------------------------
T E S T S
-------------------------------------------------------
Running org.apache.phoenix.end2end.BinaryRowKeyIT
Running org.apache.phoenix.end2end.ExecuteStatementsIT
Running org.apache.phoenix.end2end.FirstValueFunctionIT
Running org.apache.phoenix.end2end.UpsertBigValuesIT
Running org.apache.phoenix.end2end.ArithmeticQueryIT
Running org.apache.phoenix.end2end.LastValueFunctionIT
Tests run: 3, Failures: 0, Errors: 0, Skipped: 0, Time elapsed: 3.038 sec - in org.apache.phoenix.end2end.BinaryRowKeyIT
Running org.apache.phoenix.end2end.salted.SaltedTableUpsertSelectIT
Running org.apache.phoenix.end2end.SkipScanAfterManualSplitIT
Tests run: 7, Failures: 0, Errors: 0, Skipped: 0, Time elapsed: 3.147 sec - in org.apache.phoenix.end2end.FirstValueFunctionIT
Running org.apache.phoenix.end2end.RoundFloorCeilFunctionsEnd2EndIT
Tests run: 11, Failures: 0, Errors: 0, Skipped: 0, Time elapsed: 6.317 sec - in org.apache.phoenix.end2end.LastValueFunctionIT
Running org.apache.phoenix.end2end.LpadFunctionIT
Tests run: 5, Failures: 0, Errors: 0, Skipped: 0, Time elapsed: 7.447 sec - in org.apache.phoenix.end2end.salted.SaltedTableUpsertSelectIT
Running org.apache.phoenix.end2end.UpsertSelectAutoCommitIT
Tests run: 4, Failures: 0, Errors: 0, Skipped: 0, Time elapsed: 9.711 sec - in org.apache.phoenix.end2end.UpsertBigValuesIT
Running org.apache.phoenix.end2end.ViewIT
Tests run: 2, Failures: 0, Errors: 0, Skipped: 0, Time elapsed: 10.567 sec - in org.apache.phoenix.end2end.ExecuteStatementsIT
Tests run: 30, Failures: 0, Errors: 0, Skipped: 0, Time elapsed: 7.049 sec - in org.apache.phoenix.end2end.RoundFloorCeilFunctionsEnd2EndIT
Running org.apache.phoenix.end2end.AlterTableIT
Running org.apache.phoenix.end2end.ReadOnlyIT
Tests run: 10, Failures: 0, Errors: 0, Skipped: 0, Time elapsed: 6.347 sec - in org.apache.phoenix.end2end.LpadFunctionIT
Tests run: 1, Failures: 0, Errors: 0, Skipped: 0, Time elapsed: 2.852 sec - in org.apache.phoenix.end2end.ReadOnlyIT
Running org.apache.phoenix.end2end.SaltedViewIT
Tests run: 20, Failures: 0, Errors: 0, Skipped: 0, Time elapsed: 14.909 sec - in org.apache.phoenix.end2end.ArithmeticQueryIT
Running org.apache.phoenix.end2end.MD5FunctionIT
Tests run: 2, Failures: 0, Errors: 0, Skipped: 0, Time elapsed: 8.561 sec - in org.apache.phoenix.end2end.UpsertSelectAutoCommitIT
Running org.apache.phoenix.end2end.ServerExceptionIT
Tests run: 8, Failures: 0, Errors: 0, Skipped: 0, Time elapsed: 8.914 sec - in org.apache.phoenix.end2end.ViewIT
Running org.apache.phoenix.end2end.DecodeFunctionIT
Tests run: 2, Failures: 0, Errors: 0, Skipped: 0, Time elapsed: 4.883 sec - in org.apache.phoenix.end2end.MD5FunctionIT
Running org.apache.phoenix.end2end.index.ImmutableIndexIT
Tests run: 1, Failures: 0, Errors: 0, Skipped: 0, Time elapsed: 2.757 sec - in org.apache.phoenix.end2end.ServerExceptionIT
Running org.apache.phoenix.end2end.index.MutableIndexIT
Tests run: 6, Failures: 0, Errors: 0, Skipped: 0, Time elapsed: 2.734 sec - in org.apache.phoenix.end2end.DecodeFunctionIT
Running org.apache.phoenix.end2end.index.DropViewIT
Tests run: 2, Failures: 0, Errors: 0, Skipped: 0, Time elapsed: 9.369 sec - in org.apache.phoenix.end2end.SaltedViewIT
Running org.apache.phoenix.end2end.index.SaltedIndexIT
Tests run: 2, Failures: 0, Errors: 0, Skipped: 0, Time elapsed: 23.029 sec - in org.apache.phoenix.end2end.SkipScanAfterManualSplitIT
Running org.apache.phoenix.end2end.index.ViewIndexIT
Tests run: 1, Failures: 0, Errors: 0, Skipped: 0, Time elapsed: 4.447 sec - in org.apache.phoenix.end2end.index.DropViewIT
Running org.apache.phoenix.end2end.index.LocalIndexIT
Running org.apache.phoenix.end2end.ReverseScanIT
Tests run: 1, Failures: 0, Errors: 0, Skipped: 0, Time elapsed: 4.417 sec - in org.apache.phoenix.end2end.index.ViewIndexIT
Running org.apache.phoenix.end2end.index.IndexMetadataIT
Tests run: 2, Failures: 0, Errors: 0, Skipped: 0, Time elapsed: 3.051 sec - in org.apache.phoenix.end2end.ReverseScanIT
Running org.apache.phoenix.end2end.QueryPlanIT
Tests run: 7, Failures: 0, Errors: 0, Skipped: 0, Time elapsed: 10.249 sec - in org.apache.phoenix.end2end.index.ImmutableIndexIT
Running org.apache.phoenix.end2end.EncodeFunctionIT
Tests run: 6, Failures: 0, Errors: 0, Skipped: 0, Time elapsed: 5.462 sec - in org.apache.phoenix.end2end.EncodeFunctionIT
Running org.apache.phoenix.end2end.SpillableGroupByIT
Tests run: 1, Failures: 0, Errors: 0, Skipped: 0, Time elapsed: 7.677 sec - in org.apache.phoenix.end2end.QueryPlanIT
Running org.apache.phoenix.end2end.QueryExecWithoutSCNIT
Tests run: 15, Failures: 0, Errors: 0, Skipped: 0, Time elapsed: 28.796 sec - in org.apache.phoenix.end2end.AlterTableIT
Running org.apache.phoenix.end2end.TenantSpecificViewIndexIT
Tests run: 3, Failures: 0, Errors: 0, Skipped: 0, Time elapsed: 16.559 sec - in org.apache.phoenix.end2end.index.SaltedIndexIT
Tests run: 1, Failures: 0, Errors: 0, Skipped: 0, Time elapsed: 3.147 sec - in org.apache.phoenix.end2end.SpillableGroupByIT
Running org.apache.phoenix.end2end.InListIT
Running org.apache.phoenix.end2end.ConvertTimezoneFunctionIT
Tests run: 1, Failures: 0, Errors: 0, Skipped: 0, Time elapsed: 2.462 sec - in org.apache.phoenix.end2end.QueryExecWithoutSCNIT
Running org.apache.phoenix.end2end.CSVCommonsLoaderIT
Tests run: 6, Failures: 0, Errors: 0, Skipped: 0, Time elapsed: 2.791 sec - in org.apache.phoenix.end2end.ConvertTimezoneFunctionIT
Running org.apache.phoenix.end2end.ReverseFunctionIT
Tests run: 5, Failures: 0, Errors: 0, Skipped: 0, Time elapsed: 2.659 sec - in org.apache.phoenix.end2end.ReverseFunctionIT
Running org.apache.phoenix.end2end.DeleteIT
Tests run: 4, Failures: 0, Errors: 0, Skipped: 0, Time elapsed: 18.092 sec - in org.apache.phoenix.end2end.index.IndexMetadataIT
Running org.apache.phoenix.end2end.TimezoneOffsetFunctionIT
Tests run: 13, Failures: 0, Errors: 0, Skipped: 0, Time elapsed: 8.815 sec - in org.apache.phoenix.end2end.CSVCommonsLoaderIT
Running org.apache.phoenix.end2end.DynamicFamilyIT
Tests run: 6, Failures: 0, Errors: 0, Skipped: 0, Time elapsed: 3.374 sec - in org.apache.phoenix.end2end.TimezoneOffsetFunctionIT
Running org.apache.phoenix.end2end.SkipScanQueryIT
Tests run: 6, Failures: 0, Errors: 0, Skipped: 0, Time elapsed: 12.548 sec - in org.apache.phoenix.end2end.TenantSpecificViewIndexIT
Running org.apache.phoenix.end2end.HashJoinIT
Tests run: 4, Failures: 0, Errors: 0, Skipped: 0, Time elapsed: 4.064 sec - in org.apache.phoenix.end2end.DynamicFamilyIT
Running org.apache.phoenix.end2end.QueryMoreIT
Tests run: 8, Failures: 0, Errors: 0, Skipped: 0, Time elapsed: 10.26 sec - in org.apache.phoenix.end2end.SkipScanQueryIT
Running org.apache.phoenix.end2end.StatementHintsIT
Tests run: 2, Failures: 0, Errors: 0, Skipped: 0, Time elapsed: 1.836 sec - in org.apache.phoenix.end2end.StatementHintsIT
Running org.apache.phoenix.end2end.ModulusExpressionIT
Tests run: 19, Failures: 0, Errors: 0, Skipped: 0, Time elapsed: 21.665 sec - in org.apache.phoenix.end2end.DeleteIT
Tests run: 11, Failures: 0, Errors: 0, Skipped: 0, Time elapsed: 3.896 sec - in org.apache.phoenix.end2end.ModulusExpressionIT
Running org.apache.phoenix.end2end.TenantSpecificViewIndexSaltedIT
Running org.apache.phoenix.end2end.PhoenixEncodeDecodeIT
Tests run: 5, Failures: 0, Errors: 0, Skipped: 0, Time elapsed: 6.662 sec - in org.apache.phoenix.end2end.PhoenixEncodeDecodeIT
Running org.apache.phoenix.end2end.SortOrderFIT
Tests run: 4, Failures: 0, Errors: 0, Skipped: 0, Time elapsed: 9.054 sec - in org.apache.phoenix.end2end.TenantSpecificViewIndexSaltedIT
Running org.apache.phoenix.end2end.AutoCommitIT
Tests run: 1, Failures: 0, Errors: 0, Skipped: 0, Time elapsed: 2.259 sec - in org.apache.phoenix.end2end.AutoCommitIT
Running org.apache.phoenix.end2end.NthValueFunctionIT
Tests run: 30, Failures: 0, Errors: 0, Skipped: 0, Time elapsed: 6.284 sec - in org.apache.phoenix.end2end.SortOrderFIT
Running org.apache.phoenix.trace.PhoenixTracingEndToEndIT
Tests run: 5, Failures: 0, Errors: 0, Skipped: 0, Time elapsed: 4.595 sec - in org.apache.phoenix.end2end.NthValueFunctionIT
Running org.apache.phoenix.trace.PhoenixTableMetricsWriterIT
Tests run: 4, Failures: 0, Errors: 0, Skipped: 0, Time elapsed: 32.605 sec - in org.apache.phoenix.end2end.QueryMoreIT
Tests run: 2, Failures: 0, Errors: 0, Skipped: 0, Time elapsed: 2.826 sec - in org.apache.phoenix.trace.PhoenixTableMetricsWriterIT
Running org.apache.phoenix.trace.PhoenixTraceReaderIT
Tests run: 2, Failures: 0, Errors: 0, Skipped: 0, Time elapsed: 1.853 sec - in org.apache.phoenix.trace.PhoenixTraceReaderIT
Tests run: 25, Failures: 0, Errors: 0, Skipped: 0, Time elapsed: 72.666 sec - in org.apache.phoenix.end2end.InListIT
Tests run: 16, Failures: 0, Errors: 0, Skipped: 0, Time elapsed: 86.855 sec - in org.apache.phoenix.end2end.index.LocalIndexIT
Tests run: 26, Failures: 0, Errors: 0, Skipped: 0, Time elapsed: 98.202 sec - in org.apache.phoenix.end2end.index.MutableIndexIT
Tests run: 96, Failures: 0, Errors: 0, Skipped: 0, Time elapsed: 82.424 sec - in org.apache.phoenix.end2end.HashJoinIT
Tests run: 4, Failures: 0, Errors: 0, Skipped: 0, Time elapsed: 65.62 sec - in org.apache.phoenix.trace.PhoenixTracingEndToEndIT
Results :
Tests run: 458, Failures: 0, Errors: 0, Skipped: 0
[INFO]
[INFO] --- maven-failsafe-plugin:2.17:integration-test (NeedTheirOwnClusterTests) @ phoenix-core ---
[INFO] Failsafe report directory: <https://builds.apache.org/job/Phoenix-4.0-hadoop2/ws/phoenix-core/target/failsafe-reports>
[INFO] parallel='none', perCoreThreadCount=true, threadCount=0, useUnlimitedThreads=false, threadCountSuites=0, threadCountClasses=0, threadCountMethods=0, parallelOptimized=true
-------------------------------------------------------
T E S T S
-------------------------------------------------------
-------------------------------------------------------
T E S T S
-------------------------------------------------------
Running org.apache.phoenix.end2end.index.MutableIndexFailureIT
Running org.apache.phoenix.hbase.index.FailForUnsupportedHBaseVersionsIT
Running org.apache.phoenix.hbase.index.covered.EndToEndCoveredColumnsIndexBuilderIT
Running org.apache.phoenix.hbase.index.covered.example.EndToEndCoveredIndexingIT
Running org.apache.phoenix.hbase.index.balancer.IndexLoadBalancerIT
Tests run: 2, Failures: 0, Errors: 0, Skipped: 0, Time elapsed: 8.012 sec - in org.apache.phoenix.hbase.index.covered.EndToEndCoveredColumnsIndexBuilderIT
Tests run: 2, Failures: 0, Errors: 0, Skipped: 0, Time elapsed: 18.996 sec - in org.apache.phoenix.hbase.index.FailForUnsupportedHBaseVersionsIT
Running org.apache.phoenix.end2end.ContextClassloaderIT
Running org.apache.phoenix.hbase.index.covered.example.FailWithoutRetriesIT
Running org.apache.phoenix.hbase.index.covered.example.EndtoEndIndexingWithCompressionIT
Running org.apache.phoenix.mapreduce.CsvBulkLoadToolIT
Tests run: 3, Failures: 0, Errors: 0, Skipped: 0, Time elapsed: 8.443 sec - in org.apache.phoenix.end2end.ContextClassloaderIT
Tests run: 1, Failures: 0, Errors: 0, Skipped: 0, Time elapsed: 8.614 sec - in org.apache.phoenix.hbase.index.covered.example.FailWithoutRetriesIT
Tests run: 11, Failures: 0, Errors: 0, Skipped: 0, Time elapsed: 47.989 sec - in org.apache.phoenix.hbase.index.covered.example.EndToEndCoveredIndexingIT
Tests run: 11, Failures: 0, Errors: 0, Skipped: 0, Time elapsed: 48.753 sec - in org.apache.phoenix.hbase.index.covered.example.EndtoEndIndexingWithCompressionIT
Tests run: 9, Failures: 0, Errors: 0, Skipped: 0, Time elapsed: 100.976 sec - in org.apache.phoenix.hbase.index.balancer.IndexLoadBalancerIT
Tests run: 3, Failures: 0, Errors: 0, Skipped: 0, Time elapsed: 148.387 sec - in org.apache.phoenix.end2end.index.MutableIndexFailureIT
Tests run: 4, Failures: 0, Errors: 0, Skipped: 0, Time elapsed: 171.994 sec - in org.apache.phoenix.mapreduce.CsvBulkLoadToolIT
Results :
Tests run: 46, Failures: 0, Errors: 0, Skipped: 0
[INFO]
[INFO] --- maven-failsafe-plugin:2.17:verify (ClientManagedTimeTests) @ phoenix-core ---
[INFO] Failsafe report directory: <https://builds.apache.org/job/Phoenix-4.0-hadoop2/ws/phoenix-core/target/failsafe-reports>
[INFO] ------------------------------------------------------------------------
[INFO] Reactor Summary:
[INFO]
[INFO] Apache Phoenix .................................... SUCCESS [1.929s]
[INFO] Phoenix Hadoop Compatibility ...................... SUCCESS [1.748s]
[INFO] Phoenix Hadoop2 Compatibility ..................... SUCCESS [2.770s]
[INFO] Phoenix Core ...................................... FAILURE [10:53.912s]
[INFO] Phoenix - Flume ................................... SKIPPED
[INFO] Phoenix - Pig ..................................... SKIPPED
[INFO] Phoenix Assembly .................................. SKIPPED
[INFO] ------------------------------------------------------------------------
[INFO] BUILD FAILURE
[INFO] ------------------------------------------------------------------------
[INFO] Total time: 11:00.790s
[INFO] Finished at: Wed Sep 03 06:29:54 UTC 2014
[INFO] Final Memory: 47M/334M
[INFO] ------------------------------------------------------------------------
[ERROR] Failed to execute goal org.apache.maven.plugins:maven-failsafe-plugin:2.17:verify (ClientManagedTimeTests) on project phoenix-core: There are test failures.
[ERROR]
[ERROR] Please refer to <https://builds.apache.org/job/Phoenix-4.0-hadoop2/ws/phoenix-core/target/failsafe-reports> for the individual test results.
[ERROR] -> [Help 1]
[ERROR]
[ERROR] To see the full stack trace of the errors, re-run Maven with the -e switch.
[ERROR] Re-run Maven using the -X switch to enable full debug logging.
[ERROR]
[ERROR] For more information about the errors and possible solutions, please read the following articles:
[ERROR] [Help 1] http://cwiki.apache.org/confluence/display/MAVEN/MojoFailureException
[ERROR]
[ERROR] After correcting the problems, you can resume the build with the command
[ERROR] mvn <goals> -rf :phoenix-core
Build step 'Invoke top-level Maven targets' marked build as failure
Archiving artifacts
Sending artifact delta relative to Phoenix | 4.0 | Hadoop2 #89
Archived 667 artifacts
Archive block size is 32768
Received 4338 blocks and 218048479 bytes
Compression is 39.5%
Took 3 min 32 sec
Recording test results
Updating PHOENIX-1139
Jenkins build is back to normal : Phoenix | 4.0 | Hadoop2 #93
Posted by Apache Jenkins Server <je...@builds.apache.org>.
See <https://builds.apache.org/job/Phoenix-4.0-hadoop2/93/changes>
Build failed in Jenkins: Phoenix | 4.0 | Hadoop2 #92
Posted by Apache Jenkins Server <je...@builds.apache.org>.
See <https://builds.apache.org/job/Phoenix-4.0-hadoop2/92/>
------------------------------------------
[...truncated 1432 lines...]
QueryIT.testSimpleInListStatement:443->BaseQueryIT.assertValueEqualsResultSet:131->BaseTest.assertValuesEqualsResultSet:1287 expected:<0> but was:<2>
ScanQueryIT.testAllScan:229 null
ScanQueryIT.testScan:86 null
ScanQueryIT.testAllScan:229 null
ScanQueryIT.testScan:86 null
CastAndCoerceIT.testCastOperatorInSelect:69 null
CastAndCoerceIT.testCoerceDateToBigInt:210 null
CastAndCoerceIT.testCastOperatorInSelect:69 null
CastAndCoerceIT.testCoerceDateToBigInt:210 null
CastAndCoerceIT.testCastOperatorInSelect:69 null
CastAndCoerceIT.testCoerceDateToBigInt:210 null
ClientTimeArithmeticQueryIT.testIntSubtractionExpression:186->BaseQueryIT.assertValueEqualsResultSet:131->BaseTest.assertValuesEqualsResultSet:1287 expected:<0> but was:<4>
ClientTimeArithmeticQueryIT.testDecimalSubtraction1Expression:200->BaseQueryIT.assertValueEqualsResultSet:131->BaseTest.assertValuesEqualsResultSet:1287 expected:<0> but was:<3>
ClientTimeArithmeticQueryIT.testNegateExpression:431 null
ClientTimeArithmeticQueryIT.testConstantSubtractionExpression:314 null
ClientTimeArithmeticQueryIT.testIntToDecimalDivideExpression:382->BaseQueryIT.assertValueEqualsResultSet:131->BaseTest.assertValuesEqualsResultSet:1287 expected:<0> but was:<3>
ClientTimeArithmeticQueryIT.testIntAddExpression:530 null
ClientTimeArithmeticQueryIT.testSelectWithDivideExpression:413 null
ClientTimeArithmeticQueryIT.testDateAdd:88->BaseTest.assertValuesEqualsResultSet:1287 expected:<0> but was:<3>
ClientTimeArithmeticQueryIT.testDateSubtract:593->BaseTest.assertValuesEqualsResultSet:1287 expected:<0> but was:<3>
ClientTimeArithmeticQueryIT.testIntMultiplyExpression:448 null
ClientTimeArithmeticQueryIT.testConstantDivideExpression:397 null
ClientTimeArithmeticQueryIT.testIntDivideExpression:331 null
ClientTimeArithmeticQueryIT.testIntToDecimalMultiplyExpression:499->BaseQueryIT.assertValueEqualsResultSet:131->BaseTest.assertValuesEqualsResultSet:1287 expected:<0> but was:<3>
ClientTimeArithmeticQueryIT.testIntSubtractionExpression:186->BaseQueryIT.assertValueEqualsResultSet:131->BaseTest.assertValuesEqualsResultSet:1287 expected:<0> but was:<4>
ClientTimeArithmeticQueryIT.testDecimalSubtraction1Expression:200->BaseQueryIT.assertValueEqualsResultSet:131->BaseTest.assertValuesEqualsResultSet:1287 expected:<0> but was:<3>
ClientTimeArithmeticQueryIT.testNegateExpression:431 null
ClientTimeArithmeticQueryIT.testConstantSubtractionExpression:314 null
ClientTimeArithmeticQueryIT.testIntToDecimalDivideExpression:382->BaseQueryIT.assertValueEqualsResultSet:131->BaseTest.assertValuesEqualsResultSet:1287 expected:<0> but was:<3>
ClientTimeArithmeticQueryIT.testIntAddExpression:530 null
ClientTimeArithmeticQueryIT.testSelectWithDivideExpression:413 null
ClientTimeArithmeticQueryIT.testDateAdd:88->BaseTest.assertValuesEqualsResultSet:1287 expected:<0> but was:<3>
ClientTimeArithmeticQueryIT.testDateSubtract:593->BaseTest.assertValuesEqualsResultSet:1287 expected:<0> but was:<3>
ClientTimeArithmeticQueryIT.testIntMultiplyExpression:448 null
ClientTimeArithmeticQueryIT.testConstantDivideExpression:397 null
ClientTimeArithmeticQueryIT.testIntDivideExpression:331 null
ClientTimeArithmeticQueryIT.testIntToDecimalMultiplyExpression:499->BaseQueryIT.assertValueEqualsResultSet:131->BaseTest.assertValuesEqualsResultSet:1287 expected:<0> but was:<3>
ClientTimeArithmeticQueryIT.testIntSubtractionExpression:186->BaseQueryIT.assertValueEqualsResultSet:131->BaseTest.assertValuesEqualsResultSet:1287 expected:<0> but was:<4>
ClientTimeArithmeticQueryIT.testDecimalSubtraction1Expression:200->BaseQueryIT.assertValueEqualsResultSet:131->BaseTest.assertValuesEqualsResultSet:1287 expected:<0> but was:<3>
ClientTimeArithmeticQueryIT.testNegateExpression:431 null
ClientTimeArithmeticQueryIT.testConstantSubtractionExpression:314 null
ClientTimeArithmeticQueryIT.testIntToDecimalDivideExpression:382->BaseQueryIT.assertValueEqualsResultSet:131->BaseTest.assertValuesEqualsResultSet:1287 expected:<0> but was:<3>
ClientTimeArithmeticQueryIT.testIntAddExpression:530 null
ClientTimeArithmeticQueryIT.testSelectWithDivideExpression:413 null
ClientTimeArithmeticQueryIT.testDateAdd:88->BaseTest.assertValuesEqualsResultSet:1287 expected:<0> but was:<3>
ClientTimeArithmeticQueryIT.testDateSubtract:593->BaseTest.assertValuesEqualsResultSet:1287 expected:<0> but was:<3>
ClientTimeArithmeticQueryIT.testIntMultiplyExpression:448 null
ClientTimeArithmeticQueryIT.testConstantDivideExpression:397 null
ClientTimeArithmeticQueryIT.testIntDivideExpression:331 null
ClientTimeArithmeticQueryIT.testIntToDecimalMultiplyExpression:499->BaseQueryIT.assertValueEqualsResultSet:131->BaseTest.assertValuesEqualsResultSet:1287 expected:<0> but was:<3>
Tests run: 1266, Failures: 102, Errors: 0, Skipped: 0
[INFO]
[INFO] --- maven-failsafe-plugin:2.17:integration-test (HBaseManagedTimeTests) @ phoenix-core ---
[INFO] Failsafe report directory: <https://builds.apache.org/job/Phoenix-4.0-hadoop2/ws/phoenix-core/target/failsafe-reports>
[INFO] parallel='none', perCoreThreadCount=true, threadCount=0, useUnlimitedThreads=false, threadCountSuites=0, threadCountClasses=0, threadCountMethods=0, parallelOptimized=true
-------------------------------------------------------
T E S T S
-------------------------------------------------------
-------------------------------------------------------
T E S T S
-------------------------------------------------------
Running org.apache.phoenix.end2end.BinaryRowKeyIT
Running org.apache.phoenix.end2end.UpsertBigValuesIT
Running org.apache.phoenix.end2end.SkipScanAfterManualSplitIT
Running org.apache.phoenix.end2end.ArithmeticQueryIT
Tests run: 3, Failures: 0, Errors: 0, Skipped: 0, Time elapsed: 2.386 sec - in org.apache.phoenix.end2end.BinaryRowKeyIT
Running org.apache.phoenix.end2end.FirstValueFunctionIT
Running org.apache.phoenix.end2end.salted.SaltedTableUpsertSelectIT
Running org.apache.phoenix.end2end.ExecuteStatementsIT
Running org.apache.phoenix.end2end.LastValueFunctionIT
Tests run: 7, Failures: 0, Errors: 0, Skipped: 0, Time elapsed: 4.304 sec - in org.apache.phoenix.end2end.FirstValueFunctionIT
Running org.apache.phoenix.end2end.RoundFloorCeilFunctionsEnd2EndIT
Tests run: 11, Failures: 0, Errors: 0, Skipped: 0, Time elapsed: 5.983 sec - in org.apache.phoenix.end2end.LastValueFunctionIT
Running org.apache.phoenix.end2end.LpadFunctionIT
Tests run: 5, Failures: 0, Errors: 0, Skipped: 0, Time elapsed: 7.509 sec - in org.apache.phoenix.end2end.salted.SaltedTableUpsertSelectIT
Running org.apache.phoenix.end2end.UpsertSelectAutoCommitIT
Tests run: 4, Failures: 0, Errors: 0, Skipped: 0, Time elapsed: 9.542 sec - in org.apache.phoenix.end2end.UpsertBigValuesIT
Running org.apache.phoenix.end2end.ViewIT
Tests run: 30, Failures: 0, Errors: 0, Skipped: 0, Time elapsed: 5.731 sec - in org.apache.phoenix.end2end.RoundFloorCeilFunctionsEnd2EndIT
Running org.apache.phoenix.end2end.ReadOnlyIT
Tests run: 2, Failures: 0, Errors: 0, Skipped: 0, Time elapsed: 10.867 sec - in org.apache.phoenix.end2end.ExecuteStatementsIT
Running org.apache.phoenix.end2end.AlterTableIT
Tests run: 1, Failures: 0, Errors: 0, Skipped: 0, Time elapsed: 1.772 sec - in org.apache.phoenix.end2end.ReadOnlyIT
Running org.apache.phoenix.end2end.SaltedViewIT
Tests run: 10, Failures: 0, Errors: 0, Skipped: 0, Time elapsed: 6.284 sec - in org.apache.phoenix.end2end.LpadFunctionIT
Tests run: 20, Failures: 0, Errors: 0, Skipped: 0, Time elapsed: 15.973 sec - in org.apache.phoenix.end2end.ArithmeticQueryIT
Running org.apache.phoenix.end2end.MD5FunctionIT
Tests run: 2, Failures: 0, Errors: 0, Skipped: 0, Time elapsed: 8.087 sec - in org.apache.phoenix.end2end.UpsertSelectAutoCommitIT
Running org.apache.phoenix.end2end.ServerExceptionIT
Tests run: 1, Failures: 0, Errors: 0, Skipped: 0, Time elapsed: 1.701 sec - in org.apache.phoenix.end2end.ServerExceptionIT
Running org.apache.phoenix.end2end.DecodeFunctionIT
Tests run: 8, Failures: 0, Errors: 0, Skipped: 0, Time elapsed: 10.107 sec - in org.apache.phoenix.end2end.ViewIT
Running org.apache.phoenix.end2end.index.ImmutableIndexIT
Tests run: 2, Failures: 0, Errors: 0, Skipped: 0, Time elapsed: 4.308 sec - in org.apache.phoenix.end2end.MD5FunctionIT
Tests run: 6, Failures: 0, Errors: 0, Skipped: 0, Time elapsed: 2.229 sec - in org.apache.phoenix.end2end.DecodeFunctionIT
Running org.apache.phoenix.end2end.index.DropViewIT
Running org.apache.phoenix.end2end.index.MutableIndexIT
Tests run: 2, Failures: 0, Errors: 0, Skipped: 0, Time elapsed: 21.797 sec - in org.apache.phoenix.end2end.SkipScanAfterManualSplitIT
Running org.apache.phoenix.end2end.index.SaltedIndexIT
Tests run: 2, Failures: 0, Errors: 0, Skipped: 0, Time elapsed: 8.97 sec - in org.apache.phoenix.end2end.SaltedViewIT
Running org.apache.phoenix.end2end.index.ViewIndexIT
Tests run: 1, Failures: 0, Errors: 0, Skipped: 0, Time elapsed: 3.529 sec - in org.apache.phoenix.end2end.index.DropViewIT
Running org.apache.phoenix.end2end.index.LocalIndexIT
Running org.apache.phoenix.end2end.ReverseScanIT
Tests run: 1, Failures: 0, Errors: 0, Skipped: 0, Time elapsed: 4.361 sec - in org.apache.phoenix.end2end.index.ViewIndexIT
Running org.apache.phoenix.end2end.index.IndexMetadataIT
Tests run: 2, Failures: 0, Errors: 0, Skipped: 0, Time elapsed: 3.293 sec - in org.apache.phoenix.end2end.ReverseScanIT
Running org.apache.phoenix.end2end.QueryPlanIT
Tests run: 7, Failures: 0, Errors: 0, Skipped: 0, Time elapsed: 11.519 sec - in org.apache.phoenix.end2end.index.ImmutableIndexIT
Running org.apache.phoenix.end2end.EncodeFunctionIT
Tests run: 1, Failures: 0, Errors: 0, Skipped: 0, Time elapsed: 7.166 sec - in org.apache.phoenix.end2end.QueryPlanIT
Running org.apache.phoenix.end2end.SpillableGroupByIT
Tests run: 3, Failures: 0, Errors: 0, Skipped: 0, Time elapsed: 14.842 sec - in org.apache.phoenix.end2end.index.SaltedIndexIT
Running org.apache.phoenix.end2end.QueryExecWithoutSCNIT
Tests run: 6, Failures: 0, Errors: 0, Skipped: 0, Time elapsed: 7.983 sec - in org.apache.phoenix.end2end.EncodeFunctionIT
Running org.apache.phoenix.end2end.TenantSpecificViewIndexIT
Tests run: 1, Failures: 0, Errors: 0, Skipped: 0, Time elapsed: 3.004 sec - in org.apache.phoenix.end2end.QueryExecWithoutSCNIT
Tests run: 15, Failures: 0, Errors: 0, Skipped: 0, Time elapsed: 27.873 sec - in org.apache.phoenix.end2end.AlterTableIT
Running org.apache.phoenix.end2end.ConvertTimezoneFunctionIT
Running org.apache.phoenix.end2end.InListIT
Tests run: 1, Failures: 0, Errors: 0, Skipped: 0, Time elapsed: 3.906 sec - in org.apache.phoenix.end2end.SpillableGroupByIT
Running org.apache.phoenix.end2end.CSVCommonsLoaderIT
Tests run: 6, Failures: 0, Errors: 0, Skipped: 0, Time elapsed: 2.248 sec - in org.apache.phoenix.end2end.ConvertTimezoneFunctionIT
Running org.apache.phoenix.end2end.ReverseFunctionIT
Tests run: 4, Failures: 0, Errors: 0, Skipped: 0, Time elapsed: 17.818 sec - in org.apache.phoenix.end2end.index.IndexMetadataIT
Running org.apache.phoenix.end2end.DeleteIT
Tests run: 5, Failures: 0, Errors: 0, Skipped: 0, Time elapsed: 2.388 sec - in org.apache.phoenix.end2end.ReverseFunctionIT
Running org.apache.phoenix.end2end.TimezoneOffsetFunctionIT
Tests run: 6, Failures: 0, Errors: 0, Skipped: 0, Time elapsed: 2.14 sec - in org.apache.phoenix.end2end.TimezoneOffsetFunctionIT
Running org.apache.phoenix.end2end.DynamicFamilyIT
Tests run: 13, Failures: 0, Errors: 0, Skipped: 0, Time elapsed: 9.623 sec - in org.apache.phoenix.end2end.CSVCommonsLoaderIT
Running org.apache.phoenix.end2end.SkipScanQueryIT
Tests run: 4, Failures: 0, Errors: 0, Skipped: 0, Time elapsed: 4.499 sec - in org.apache.phoenix.end2end.DynamicFamilyIT
Running org.apache.phoenix.end2end.HashJoinIT
Tests run: 6, Failures: 0, Errors: 0, Skipped: 0, Time elapsed: 13.654 sec - in org.apache.phoenix.end2end.TenantSpecificViewIndexIT
Running org.apache.phoenix.end2end.QueryMoreIT
Tests run: 8, Failures: 0, Errors: 0, Skipped: 0, Time elapsed: 9.867 sec - in org.apache.phoenix.end2end.SkipScanQueryIT
Running org.apache.phoenix.end2end.StatementHintsIT
Tests run: 2, Failures: 0, Errors: 0, Skipped: 0, Time elapsed: 1.827 sec - in org.apache.phoenix.end2end.StatementHintsIT
Running org.apache.phoenix.end2end.ModulusExpressionIT
Tests run: 19, Failures: 0, Errors: 0, Skipped: 0, Time elapsed: 20.189 sec - in org.apache.phoenix.end2end.DeleteIT
Running org.apache.phoenix.end2end.TenantSpecificViewIndexSaltedIT
Tests run: 11, Failures: 0, Errors: 0, Skipped: 0, Time elapsed: 3.685 sec - in org.apache.phoenix.end2end.ModulusExpressionIT
Running org.apache.phoenix.end2end.PhoenixEncodeDecodeIT
Tests run: 5, Failures: 0, Errors: 0, Skipped: 0, Time elapsed: 6.241 sec - in org.apache.phoenix.end2end.PhoenixEncodeDecodeIT
Running org.apache.phoenix.end2end.SortOrderFIT
Tests run: 4, Failures: 0, Errors: 0, Skipped: 0, Time elapsed: 9.651 sec - in org.apache.phoenix.end2end.TenantSpecificViewIndexSaltedIT
Running org.apache.phoenix.end2end.AutoCommitIT
Tests run: 1, Failures: 0, Errors: 0, Skipped: 0, Time elapsed: 2.222 sec - in org.apache.phoenix.end2end.AutoCommitIT
Tests run: 30, Failures: 0, Errors: 0, Skipped: 0, Time elapsed: 4.831 sec - in org.apache.phoenix.end2end.SortOrderFIT
Running org.apache.phoenix.end2end.NthValueFunctionIT
Running org.apache.phoenix.trace.PhoenixTracingEndToEndIT
Tests run: 5, Failures: 0, Errors: 0, Skipped: 0, Time elapsed: 4.1 sec - in org.apache.phoenix.end2end.NthValueFunctionIT
Running org.apache.phoenix.trace.PhoenixTableMetricsWriterIT
Tests run: 2, Failures: 0, Errors: 0, Skipped: 0, Time elapsed: 1.876 sec - in org.apache.phoenix.trace.PhoenixTableMetricsWriterIT
Running org.apache.phoenix.trace.PhoenixTraceReaderIT
Tests run: 4, Failures: 0, Errors: 0, Skipped: 0, Time elapsed: 31.852 sec - in org.apache.phoenix.end2end.QueryMoreIT
Tests run: 2, Failures: 0, Errors: 0, Skipped: 0, Time elapsed: 1.861 sec - in org.apache.phoenix.trace.PhoenixTraceReaderIT
Tests run: 16, Failures: 0, Errors: 0, Skipped: 0, Time elapsed: 84.57 sec - in org.apache.phoenix.end2end.index.LocalIndexIT
Tests run: 25, Failures: 0, Errors: 0, Skipped: 0, Time elapsed: 72.663 sec - in org.apache.phoenix.end2end.InListIT
Tests run: 26, Failures: 0, Errors: 0, Skipped: 0, Time elapsed: 104.375 sec - in org.apache.phoenix.end2end.index.MutableIndexIT
Tests run: 96, Failures: 0, Errors: 0, Skipped: 0, Time elapsed: 80.948 sec - in org.apache.phoenix.end2end.HashJoinIT
Tests run: 4, Failures: 0, Errors: 0, Skipped: 0, Time elapsed: 69.397 sec - in org.apache.phoenix.trace.PhoenixTracingEndToEndIT
Results :
Tests run: 458, Failures: 0, Errors: 0, Skipped: 0
[INFO]
[INFO] --- maven-failsafe-plugin:2.17:integration-test (NeedTheirOwnClusterTests) @ phoenix-core ---
[INFO] Failsafe report directory: <https://builds.apache.org/job/Phoenix-4.0-hadoop2/ws/phoenix-core/target/failsafe-reports>
[INFO] parallel='none', perCoreThreadCount=true, threadCount=0, useUnlimitedThreads=false, threadCountSuites=0, threadCountClasses=0, threadCountMethods=0, parallelOptimized=true
-------------------------------------------------------
T E S T S
-------------------------------------------------------
-------------------------------------------------------
T E S T S
-------------------------------------------------------
Running org.apache.phoenix.end2end.index.MutableIndexFailureIT
Running org.apache.phoenix.hbase.index.FailForUnsupportedHBaseVersionsIT
Running org.apache.phoenix.hbase.index.covered.EndToEndCoveredColumnsIndexBuilderIT
Running org.apache.phoenix.hbase.index.covered.example.EndToEndCoveredIndexingIT
Running org.apache.phoenix.hbase.index.balancer.IndexLoadBalancerIT
Tests run: 2, Failures: 0, Errors: 0, Skipped: 0, Time elapsed: 18.2 sec - in org.apache.phoenix.hbase.index.FailForUnsupportedHBaseVersionsIT
Tests run: 2, Failures: 0, Errors: 0, Skipped: 0, Time elapsed: 7.906 sec - in org.apache.phoenix.hbase.index.covered.EndToEndCoveredColumnsIndexBuilderIT
Running org.apache.phoenix.end2end.ContextClassloaderIT
Running org.apache.phoenix.hbase.index.covered.example.EndtoEndIndexingWithCompressionIT
Running org.apache.phoenix.hbase.index.covered.example.FailWithoutRetriesIT
Running org.apache.phoenix.mapreduce.CsvBulkLoadToolIT
Tests run: 3, Failures: 0, Errors: 0, Skipped: 0, Time elapsed: 7.825 sec - in org.apache.phoenix.end2end.ContextClassloaderIT
Tests run: 1, Failures: 0, Errors: 0, Skipped: 0, Time elapsed: 8.83 sec - in org.apache.phoenix.hbase.index.covered.example.FailWithoutRetriesIT
Tests run: 11, Failures: 0, Errors: 0, Skipped: 0, Time elapsed: 47.883 sec - in org.apache.phoenix.hbase.index.covered.example.EndToEndCoveredIndexingIT
Tests run: 11, Failures: 0, Errors: 0, Skipped: 0, Time elapsed: 48.373 sec - in org.apache.phoenix.hbase.index.covered.example.EndtoEndIndexingWithCompressionIT
Tests run: 9, Failures: 0, Errors: 0, Skipped: 0, Time elapsed: 100.852 sec - in org.apache.phoenix.hbase.index.balancer.IndexLoadBalancerIT
Tests run: 3, Failures: 0, Errors: 0, Skipped: 0, Time elapsed: 148.449 sec - in org.apache.phoenix.end2end.index.MutableIndexFailureIT
Tests run: 4, Failures: 0, Errors: 0, Skipped: 0, Time elapsed: 172.261 sec - in org.apache.phoenix.mapreduce.CsvBulkLoadToolIT
Results :
Tests run: 46, Failures: 0, Errors: 0, Skipped: 0
[INFO]
[INFO] --- maven-failsafe-plugin:2.17:verify (ClientManagedTimeTests) @ phoenix-core ---
[INFO] Failsafe report directory: <https://builds.apache.org/job/Phoenix-4.0-hadoop2/ws/phoenix-core/target/failsafe-reports>
[INFO] ------------------------------------------------------------------------
[INFO] Reactor Summary:
[INFO]
[INFO] Apache Phoenix .................................... SUCCESS [1.736s]
[INFO] Phoenix Hadoop Compatibility ...................... SUCCESS [1.501s]
[INFO] Phoenix Hadoop2 Compatibility ..................... SUCCESS [2.493s]
[INFO] Phoenix Core ...................................... FAILURE [11:01.364s]
[INFO] Phoenix - Flume ................................... SKIPPED
[INFO] Phoenix - Pig ..................................... SKIPPED
[INFO] Phoenix Assembly .................................. SKIPPED
[INFO] ------------------------------------------------------------------------
[INFO] BUILD FAILURE
[INFO] ------------------------------------------------------------------------
[INFO] Total time: 11:07.516s
[INFO] Finished at: Wed Sep 03 12:29:42 UTC 2014
[INFO] Final Memory: 45M/321M
[INFO] ------------------------------------------------------------------------
[ERROR] Failed to execute goal org.apache.maven.plugins:maven-failsafe-plugin:2.17:verify (ClientManagedTimeTests) on project phoenix-core: There are test failures.
[ERROR]
[ERROR] Please refer to <https://builds.apache.org/job/Phoenix-4.0-hadoop2/ws/phoenix-core/target/failsafe-reports> for the individual test results.
[ERROR] -> [Help 1]
[ERROR]
[ERROR] To see the full stack trace of the errors, re-run Maven with the -e switch.
[ERROR] Re-run Maven using the -X switch to enable full debug logging.
[ERROR]
[ERROR] For more information about the errors and possible solutions, please read the following articles:
[ERROR] [Help 1] http://cwiki.apache.org/confluence/display/MAVEN/MojoFailureException
[ERROR]
[ERROR] After correcting the problems, you can resume the build with the command
[ERROR] mvn <goals> -rf :phoenix-core
Build step 'Invoke top-level Maven targets' marked build as failure
Archiving artifacts
Sending artifact delta relative to Phoenix | 4.0 | Hadoop2 #89
Archived 678 artifacts
Archive block size is 32768
Received 4765 blocks and 219314215 bytes
Compression is 41.6%
Took 1 min 41 sec
Recording test results