You are viewing a plain text version of this content. The canonical link for it is here.
Posted to dev@lucene.apache.org by Apache Jenkins Server <je...@builds.apache.org> on 2012/01/31 08:50:51 UTC

[JENKINS] Lucene-Solr-tests-only-trunk - Build # 12319 - Failure

Build: https://builds.apache.org/job/Lucene-Solr-tests-only-trunk/12319/

1 tests failed.
REGRESSION:  org.apache.solr.cloud.RecoveryZkTest.testDistribSearch

Error Message:
java.lang.AssertionError: Some threads threw uncaught exceptions!

Stack Trace:
java.lang.RuntimeException: java.lang.AssertionError: Some threads threw uncaught exceptions!
	at org.apache.lucene.util.LuceneTestCase.tearDown(LuceneTestCase.java:655)
	at org.apache.solr.SolrTestCaseJ4.tearDown(SolrTestCaseJ4.java:89)
	at org.apache.solr.BaseDistributedSearchTestCase.tearDown(BaseDistributedSearchTestCase.java:177)
	at org.apache.solr.cloud.AbstractDistributedZkTestCase.tearDown(AbstractDistributedZkTestCase.java:85)
	at org.apache.solr.cloud.FullSolrCloudTest.tearDown(FullSolrCloudTest.java:1253)
	at org.apache.solr.cloud.RecoveryZkTest.tearDown(RecoveryZkTest.java:132)
	at org.apache.lucene.util.LuceneTestCaseRunner.runChild(LuceneTestCaseRunner.java:165)
	at org.apache.lucene.util.LuceneTestCaseRunner.runChild(LuceneTestCaseRunner.java:57)
	at org.apache.lucene.util.LuceneTestCase.checkUncaughtExceptionsAfter(LuceneTestCase.java:683)
	at org.apache.lucene.util.LuceneTestCase.tearDown(LuceneTestCase.java:627)




Build Log (for compile errors):
[...truncated 7896 lines...]



---------------------------------------------------------------------
To unsubscribe, e-mail: dev-unsubscribe@lucene.apache.org
For additional commands, e-mail: dev-help@lucene.apache.org