You are viewing a plain text version of this content. The canonical link for it is here.
Posted to fop-dev@xmlgraphics.apache.org by Apache Jenkins Server <je...@builds.apache.org> on 2018/06/18 10:11:02 UTC

Build failed in Jenkins: xmlgraphics-commons #83

See <https://builds.apache.org/job/xmlgraphics-commons/83/display/redirect?page=changes>

Changes:

[ssteiner] XGC-112: TIFF resolution wrong on Java 10

------------------------------------------
[...truncated 47.83 KB...]
AU        test/images/no-resolution.bmp
AU        test/images/asf-logo.png
AU        test/images/no-resolution.tif
AU        test/images/basi2c08.png
AU        test/images/bgimg72dpi.gif
AU        test/images/pp0n6a08.png
AU        test/images/no-resolution.png
AU        test/images/corrupt-image.png
AU        test/images/dirOnly.tif
AU        test/images/basn4a08.png
AU        test/images/basn2c08.png
AU        test/images/big-image.png
AU        test/images/basn6a08.png
AU        test/images/basn0g08.png
 U        .
Fetching 'http://svn.apache.org/repos/asf/xmlgraphics/site/trunk/content/commons' at -1 into '<https://builds.apache.org/job/xmlgraphics-commons/ws/docs'>
A         docs/download.mdtext
A         docs/index.mdtext
A         docs/changes.mdtext
A         docs/doap.rdf
A         docs/postscript.mdtext
A         docs/bugs.mdtext
A         docs/images
AU        docs/images/fix.jpg
AU        docs/images/hack.jpg
AU        docs/images/add.jpg
AU        docs/images/warning.png
AU        docs/images/success.png
AU        docs/images/error.png
AU        docs/images/remove.jpg
AU        docs/images/info.png
AU        docs/images/update.jpg
A         docs/image-loader.mdtext
At revision 1833701

At revision 1833701

No changes for http://svn.apache.org/repos/asf/xmlgraphics/site/trunk/content/commons since the previous build
[xmlgraphics-commons] $ /bin/bash -xe /tmp/jenkins3595064489509888399.sh
+ '[' '!' -f findbugs-2.0.3 ']'
+ rm -rf findbugs-2.0.3
+ wget https://ufpr.dl.sourceforge.net/project/findbugs/findbugs/2.0.3/findbugs-2.0.3.zip -O findbugs.zip
--2018-06-18 10:10:57--  https://ufpr.dl.sourceforge.net/project/findbugs/findbugs/2.0.3/findbugs-2.0.3.zip
Resolving ufpr.dl.sourceforge.net (ufpr.dl.sourceforge.net)... 200.236.31.2, 2801:82:80ff:8000::3
Connecting to ufpr.dl.sourceforge.net (ufpr.dl.sourceforge.net)|200.236.31.2|:443... connected.
HTTP request sent, awaiting response... 200 OK
Length: 8478491 (8.1M) [application/octet-stream]
Saving to: 'findbugs.zip'

     0K .......... .......... .......... .......... ..........  0%  116K 71s
    50K .......... .......... .......... .......... ..........  1%  232K 53s
   100K .......... .......... .......... .......... ..........  1% 65.7M 35s
   150K .......... .......... .......... .......... ..........  2%  107M 26s
   200K .......... .......... .......... .......... ..........  3%  232K 28s
   250K .......... .......... .......... .......... ..........  3% 61.0M 23s
   300K .......... .......... .......... .......... ..........  4%  106M 20s
   350K .......... .......... .......... .......... ..........  4%  107M 17s
   400K .......... .......... .......... .......... ..........  5%  234K 19s
   450K .......... .......... .......... .......... ..........  6%  116M 17s
   500K .......... .......... .......... .......... ..........  6%  133M 15s
   550K .......... .......... .......... .......... ..........  7% 78.5M 14s
   600K .......... .......... .......... .......... ..........  7%  114M 13s
   650K .......... .......... .......... .......... ..........  8%  115M 12s
   700K .......... .......... .......... .......... ..........  9%  124M 11s
   750K .......... .......... .......... .......... ..........  9%  121M 10s
   800K .......... .......... .......... .......... .......... 10% 1.28M 10s
   850K .......... .......... .......... .......... .......... 10%  286K 11s
   900K .......... .......... .......... .......... .......... 11%  115M 10s
   950K .......... .......... .......... .......... .......... 12%  138M 9s
  1000K .......... .......... .......... .......... .......... 12%  123M 9s
  1050K .......... .......... .......... .......... .......... 13%  102M 8s
  1100K .......... .......... .......... .......... .......... 13%  128M 8s
  1150K .......... .......... .......... .......... .......... 14%  111M 8s
  1200K .......... .......... .......... .......... .......... 15%  103M 7s
  1250K .......... .......... .......... .......... .......... 15%  110M 7s
  1300K .......... .......... .......... .......... .......... 16%  109M 7s
  1350K .......... .......... .......... .......... .......... 16% 73.9M 6s
  1400K .......... .......... .......... .......... .......... 17% 79.6M 6s
  1450K .......... .......... .......... .......... .......... 18% 69.4M 6s
  1500K .......... .......... .......... .......... .......... 18% 88.2M 6s
  1550K .......... .......... .......... .......... .......... 19% 91.8M 5s
  1600K .......... .......... .......... .......... .......... 19% 1.44M 5s
  1650K .......... .......... .......... .......... .......... 20% 68.1M 5s
  1700K .......... .......... .......... .......... .......... 21%  118M 5s
  1750K .......... .......... .......... .......... .......... 21%  288K 5s
  1800K .......... .......... .......... .......... .......... 22% 69.5M 5s
  1850K .......... .......... .......... .......... .......... 22% 78.8M 5s
  1900K .......... .......... .......... .......... .......... 23% 67.7M 5s
  1950K .......... .......... .......... .......... .......... 24% 77.1M 5s
  2000K .......... .......... .......... .......... .......... 24% 60.8M 5s
  2050K .......... .......... .......... .......... .......... 25% 75.4M 4s
  2100K .......... .......... .......... .......... .......... 25% 71.6M 4s
  2150K .......... .......... .......... .......... .......... 26% 71.4M 4s
  2200K .......... .......... .......... .......... .......... 27% 64.8M 4s
  2250K .......... .......... .......... .......... .......... 27% 71.5M 4s
  2300K .......... .......... .......... .......... .......... 28% 72.7M 4s
  2350K .......... .......... .......... .......... .......... 28% 71.6M 4s
  2400K .......... .......... .......... .......... .......... 29% 60.1M 4s
  2450K .......... .......... .......... .......... .......... 30% 73.4M 4s
  2500K .......... .......... .......... .......... .......... 30% 71.3M 3s
  2550K .......... .......... .......... .......... .......... 31% 72.4M 3s
  2600K .......... .......... .......... .......... .......... 32% 66.7M 3s
  2650K .......... .......... .......... .......... .......... 32% 71.9M 3s
  2700K .......... .......... .......... .......... .......... 33%  106M 3s
  2750K .......... .......... .......... .......... .......... 33%  109M 3s
  2800K .......... .......... .......... .......... .......... 34% 86.6M 3s
  2850K .......... .......... .......... .......... .......... 35%  124M 3s
  2900K .......... .......... .......... .......... .......... 35%  123M 3s
  2950K .......... .......... .......... .......... .......... 36%  127M 3s
  3000K .......... .......... .......... .......... .......... 36%  133M 3s
  3050K .......... .......... .......... .......... .......... 37%  151M 3s
  3100K .......... .......... .......... .......... .......... 38%  155M 2s
  3150K .......... .......... .......... .......... .......... 38%  149M 2s
  3200K .......... .......... .......... .......... .......... 39% 2.03M 2s
  3250K .......... .......... .......... .......... .......... 39% 80.1M 2s
  3300K .......... .......... .......... .......... .......... 40% 97.6M 2s
  3350K .......... .......... .......... .......... .......... 41% 91.1M 2s
  3400K .......... .......... .......... .......... .......... 41% 89.6M 2s
  3450K .......... .......... .......... .......... .......... 42%  132M 2s
  3500K .......... .......... .......... .......... .......... 42%  161M 2s
  3550K .......... .......... .......... .......... .......... 43%  291K 2s
  3600K .......... .......... .......... .......... .......... 44% 91.0M 2s
  3650K .......... .......... .......... .......... .......... 44%  114M 2s
  3700K .......... .......... .......... .......... .......... 45%  111M 2s
  3750K .......... .......... .......... .......... .......... 45%  108M 2s
  3800K .......... .......... .......... .......... .......... 46%  103M 2s
  3850K .......... .......... .......... .......... .......... 47% 68.6M 2s
  3900K .......... .......... .......... .......... .......... 47% 74.7M 2s
  3950K .......... .......... .......... .......... .......... 48% 74.9M 2s
  4000K .......... .......... .......... .......... .......... 48% 60.2M 2s
  4050K .......... .......... .......... .......... .......... 49% 73.5M 2s
  4100K .......... .......... .......... .......... .......... 50% 68.8M 2s
  4150K .......... .......... .......... .......... .......... 50% 72.6M 2s
  4200K .......... .......... .......... .......... .......... 51% 67.2M 2s
  4250K .......... .......... .......... .......... .......... 51% 72.7M 2s
  4300K .......... .......... .......... .......... .......... 52% 74.0M 2s
  4350K .......... .......... .......... .......... .......... 53% 72.7M 2s
  4400K .......... .......... .......... .......... .......... 53% 57.8M 1s
  4450K .......... .......... .......... .......... .......... 54% 73.0M 1s
  4500K .......... .......... .......... .......... .......... 54% 75.1M 1s
  4550K .......... .......... .......... .......... .......... 55% 72.9M 1s
  4600K .......... .......... .......... .......... .......... 56% 64.1M 1s
  4650K .......... .......... .......... .......... .......... 56% 73.8M 1s
  4700K .......... .......... .......... .......... .......... 57% 73.1M 1s
  4750K .......... .......... .......... .......... .......... 57% 83.9M 1s
  4800K .......... .......... .......... .......... .......... 58% 66.7M 1s
  4850K .......... .......... .......... .......... .......... 59% 80.5M 1s
  4900K .......... .......... .......... .......... .......... 59% 80.2M 1s
  4950K .......... .......... .......... .......... .......... 60% 81.1M 1s
  5000K .......... .......... .......... .......... .......... 60% 73.1M 1s
  5050K .......... .......... .......... .......... .......... 61% 88.3M 1s
  5100K .......... .......... .......... .......... .......... 62% 85.5M 1s
  5150K .......... .......... .......... .......... .......... 62% 94.4M 1s
  5200K .......... .......... .......... .......... .......... 63%  105M 1s
  5250K .......... .......... .......... .......... .......... 64%  121M 1s
  5300K .......... .......... .......... .......... .......... 64%  118M 1s
  5350K .......... .......... .......... .......... .......... 65%  125M 1s
  5400K .......... .......... .......... .......... .......... 65%  106M 1s
  5450K .......... .......... .......... .......... .......... 66%  121M 1s
  5500K .......... .......... .......... .......... .......... 67%  122M 1s
  5550K .......... .......... .......... .......... .......... 67%  119M 1s
  5600K .......... .......... .......... .......... .......... 68%  238K 1s
  5650K .......... .......... .......... .......... .......... 68%  114M 1s
  5700K .......... .......... .......... .......... .......... 69%  115M 1s
  5750K .......... .......... .......... .......... .......... 70%  132M 1s
  5800K .......... .......... .......... .......... .......... 70%  124M 1s
  5850K .......... .......... .......... .......... .......... 71%  139M 1s
  5900K .......... .......... .......... .......... .......... 71%  129M 1s
  5950K .......... .......... .......... .......... .......... 72%  127M 1s
  6000K .......... .......... .......... .......... .......... 73%  105M 1s
  6050K .......... .......... .......... .......... .......... 73%  126M 1s
  6100K .......... .......... .......... .......... .......... 74%  123M 1s
  6150K .......... .......... .......... .......... .......... 74%  121M 1s
  6200K .......... .......... .......... .......... .......... 75% 91.2M 1s
  6250K .......... .......... .......... .......... .......... 76%  109M 1s
  6300K .......... .......... .......... .......... .......... 76% 99.6M 1s
  6350K .......... .......... .......... .......... .......... 77% 99.1M 1s
  6400K .......... .......... .......... .......... .......... 77% 81.5M 1s
  6450K .......... .......... .......... .......... .......... 78%  101M 1s
  6500K .......... .......... .......... .......... .......... 79%  102M 1s
  6550K .......... .......... .......... .......... .......... 79% 98.1M 1s
  6600K .......... .......... .......... .......... .......... 80% 89.1M 0s
  6650K .......... .......... .......... .......... .......... 80% 98.4M 0s
  6700K .......... .......... .......... .......... .......... 81%  106M 0s
  6750K .......... .......... .......... .......... .......... 82% 99.2M 0s
  6800K .......... .......... .......... .......... .......... 82% 81.5M 0s
  6850K .......... .......... .......... .......... .......... 83% 93.1M 0s
  6900K .......... .......... .......... .......... .......... 83% 91.9M 0s
  6950K .......... .......... .......... .......... .......... 84% 82.6M 0s
  7000K .......... .......... .......... .......... .......... 85%  106M 0s
  7050K .......... .......... .......... .......... .......... 85%  119M 0s
  7100K .......... .......... .......... .......... .......... 86%  120M 0s
  7150K .......... .......... .......... .......... .......... 86%  116M 0s
  7200K .......... .......... .......... .......... .......... 87% 92.3M 0s
  7250K .......... .......... .......... .......... .......... 88%  121M 0s
  7300K .......... .......... .......... .......... .......... 88%  117M 0s
  7350K .......... .......... .......... .......... .......... 89%  115M 0s
  7400K .......... .......... .......... .......... .......... 89%  103M 0s
  7450K .......... .......... .......... .......... .......... 90%  114M 0s
  7500K .......... .......... .......... .......... .......... 91%  112M 0s
  7550K .......... .......... .......... .......... .......... 91%  127M 0s
  7600K .......... .......... .......... .......... .......... 92% 88.5M 0s
  7650K .......... .......... .......... .......... .......... 92%  111M 0s
  7700K .......... .......... .......... .......... .......... 93%  110M 0s
  7750K .......... .......... .......... .......... .......... 94%  117M 0s
  7800K .......... .......... .......... .......... .......... 94%  104M 0s
  7850K .......... .......... .......... .......... .......... 95%  103M 0s
  7900K .......... .......... .......... .......... .......... 96%  107M 0s
  7950K .......... .......... .......... .......... .......... 96%  118M 0s
  8000K .......... .......... .......... .......... .......... 97% 90.1M 0s
  8050K .......... .......... .......... .......... .......... 97%  103M 0s
  8100K .......... .......... .......... .......... .......... 98% 96.2M 0s
  8150K .......... .......... .......... .......... .......... 99%  112M 0s
  8200K .......... .......... .......... .......... .......... 99%  113M 0s
  8250K .......... .......... .........                       100%  124M=2.0s

2018-06-18 10:11:01 (4.08 MB/s) - 'findbugs.zip' saved [8478491/8478491]

+ unzip -q findbugs.zip
+ '[' '!' -f junit-4.10.jar ']'
+ wget http://central.maven.org/maven2/junit/junit/4.10/junit-4.10.jar
--2018-06-18 10:11:01--  http://central.maven.org/maven2/junit/junit/4.10/junit-4.10.jar
Resolving central.maven.org (central.maven.org)... 151.101.52.209
Connecting to central.maven.org (central.maven.org)|151.101.52.209|:80... connected.
HTTP request sent, awaiting response... 200 OK
Length: 253160 (247K) [application/java-archive]
Saving to: 'junit-4.10.jar'

     0K .......... .......... .......... .......... .......... 20% 5.82M 0s
    50K .......... .......... .......... .......... .......... 40% 11.5M 0s
   100K .......... .......... .......... .......... .......... 60% 50.2M 0s
   150K .......... .......... .......... .......... .......... 80% 39.8M 0s
   200K .......... .......... .......... .......... .......   100% 13.9M=0.02s

2018-06-18 10:11:01 (13.3 MB/s) - 'junit-4.10.jar' saved [253160/253160]

+ cp junit-4.10.jar lib
+ '[' '!' -f lib/build/checkstyle-5.5-all.jar ']'
+ rm -f download
+ rm -rf checkstyle-5.5
+ wget http://sourceforge.net/projects/checkstyle/files/checkstyle/5.5/checkstyle-5.5-bin.zip/download
URL transformed to HTTPS due to an HSTS policy
--2018-06-18 10:11:01--  https://sourceforge.net/projects/checkstyle/files/checkstyle/5.5/checkstyle-5.5-bin.zip/download
Resolving sourceforge.net (sourceforge.net)... 216.105.38.13
Connecting to sourceforge.net (sourceforge.net)|216.105.38.13|:443... connected.
HTTP request sent, awaiting response... 404 Not Found
2018-06-18 10:11:01 ERROR 404: Not Found.

Build step 'Execute shell' marked build as failure

Jenkins build is back to normal : xmlgraphics-commons #86

Posted by Apache Jenkins Server <je...@builds.apache.org>.
See <https://builds.apache.org/job/xmlgraphics-commons/86/display/redirect>


---------------------------------------------------------------------
To unsubscribe, e-mail: general-unsubscribe@xmlgraphics.apache.org
For additional commands, e-mail: general-help@xmlgraphics.apache.org


Build failed in Jenkins: xmlgraphics-commons #85

Posted by Apache Jenkins Server <je...@builds.apache.org>.
See <https://builds.apache.org/job/xmlgraphics-commons/85/display/redirect>

------------------------------------------
[...truncated 47.52 KB...]
AU        src/documentation/content/xdocs/site.xml
A         src/documentation/resources
A         src/documentation/resources/stylesheets
AU        src/documentation/resources/stylesheets/news2rss.xsl
AU        src/documentation/resources/stylesheets/changes2document.xsl
AU        src/documentation/resources/stylesheets/releaseNotes2document.xsl
AU        src/documentation/resources/stylesheets/news2document.xsl
AU        src/documentation/resources/stylesheets/dotdots.xsl
A         src/documentation/resources/images
AU        src/documentation/resources/images/apache-xml-graphics.svg
AU        src/documentation/resources/images/feed-icon-14x14.png
AU        src/documentation/resources/images/apache-xml-graphics.jpg
AU        src/documentation/resources/images/apache-xml-graphics.png
AU        src/documentation/resources/images/apache-xml-graphics.gif
AU        src/documentation/README.txt
A         src/documentation/classes
AU        src/documentation/classes/CatalogManager.properties
AU        build.properties
AU        pom.xml
AU        README
AU        build.xml
 U        .
Fetching 'http://svn.apache.org/repos/asf/xmlgraphics/site/trunk/content/commons' at -1 into '<https://builds.apache.org/job/xmlgraphics-commons/ws/docs'>
A         docs/bugs.mdtext
A         docs/images
AU        docs/images/success.png
AU        docs/images/error.png
AU        docs/images/remove.jpg
AU        docs/images/info.png
AU        docs/images/update.jpg
AU        docs/images/fix.jpg
AU        docs/images/hack.jpg
AU        docs/images/add.jpg
AU        docs/images/warning.png
A         docs/image-loader.mdtext
A         docs/download.mdtext
A         docs/index.mdtext
A         docs/changes.mdtext
A         docs/doap.rdf
A         docs/postscript.mdtext
At revision 1833702

At revision 1833702

No changes for http://svn.eu.apache.org/repos/asf/xmlgraphics/commons/trunk since the previous build
No changes for http://svn.apache.org/repos/asf/xmlgraphics/site/trunk/content/commons since the previous build
[xmlgraphics-commons] $ /bin/bash -xe /tmp/jenkins3200844705195317289.sh
+ '[' '!' -f findbugs-2.0.3 ']'
+ rm -rf findbugs-2.0.3
+ wget https://ufpr.dl.sourceforge.net/project/findbugs/findbugs/2.0.3/findbugs-2.0.3.zip -O findbugs.zip
--2018-06-18 10:29:49--  https://ufpr.dl.sourceforge.net/project/findbugs/findbugs/2.0.3/findbugs-2.0.3.zip
Resolving ufpr.dl.sourceforge.net (ufpr.dl.sourceforge.net)... 200.236.31.2, 2801:82:80ff:8000::3
Connecting to ufpr.dl.sourceforge.net (ufpr.dl.sourceforge.net)|200.236.31.2|:443... connected.
HTTP request sent, awaiting response... 200 OK
Length: 8478491 (8.1M) [application/octet-stream]
Saving to: 'findbugs.zip'

     0K .......... .......... .......... .......... ..........  0%  115K 71s
    50K .......... .......... .......... .......... ..........  1%  231K 53s
   100K .......... .......... .......... .......... ..........  1% 62.6M 35s
   150K .......... .......... .......... .......... ..........  2%  117M 26s
   200K .......... .......... .......... .......... ..........  3%  231K 28s
   250K .......... .......... .......... .......... ..........  3% 73.4M 23s
   300K .......... .......... .......... .......... ..........  4% 78.6M 20s
   350K .......... .......... .......... .......... ..........  4%  113M 17s
   400K .......... .......... .......... .......... ..........  5%  233K 19s
   450K .......... .......... .......... .......... ..........  6% 69.1M 17s
   500K .......... .......... .......... .......... ..........  6% 68.8M 15s
   550K .......... .......... .......... .......... ..........  7% 50.2M 14s
   600K .......... .......... .......... .......... ..........  7% 58.0M 13s
   650K .......... .......... .......... .......... ..........  8% 93.2M 12s
   700K .......... .......... .......... .......... ..........  9% 87.5M 11s
   750K .......... .......... .......... .......... ..........  9% 81.6M 10s
   800K .......... .......... .......... .......... .......... 10%  236K 11s
   850K .......... .......... .......... .......... .......... 10% 61.8M 11s
   900K .......... .......... .......... .......... .......... 11% 71.7M 10s
   950K .......... .......... .......... .......... .......... 12% 66.6M 9s
  1000K .......... .......... .......... .......... .......... 12% 50.1M 9s
  1050K .......... .......... .......... .......... .......... 13% 71.7M 9s
  1100K .......... .......... .......... .......... .......... 13% 60.5M 8s
  1150K .......... .......... .......... .......... .......... 14% 56.8M 8s
  1200K .......... .......... .......... .......... .......... 15% 51.1M 7s
  1250K .......... .......... .......... .......... .......... 15% 82.6M 7s
  1300K .......... .......... .......... .......... .......... 16% 97.8M 7s
  1350K .......... .......... .......... .......... .......... 16%  126M 6s
  1400K .......... .......... .......... .......... .......... 17%  117M 6s
  1450K .......... .......... .......... .......... .......... 18%  101M 6s
  1500K .......... .......... .......... .......... .......... 18% 97.2M 6s
  1550K .......... .......... .......... .......... .......... 19%  101M 5s
  1600K .......... .......... .......... .......... .......... 19% 97.4M 5s
  1650K .......... .......... .......... .......... .......... 20%  243K 6s
  1700K .......... .......... .......... .......... .......... 21%  109M 6s
  1750K .......... .......... .......... .......... .......... 21%  134M 5s
  1800K .......... .......... .......... .......... .......... 22% 74.8M 5s
  1850K .......... .......... .......... .......... .......... 22%  126M 5s
  1900K .......... .......... .......... .......... .......... 23%  108M 5s
  1950K .......... .......... .......... .......... .......... 24%  119M 5s
  2000K .......... .......... .......... .......... .......... 24% 94.1M 5s
  2050K .......... .......... .......... .......... .......... 25%  110M 4s
  2100K .......... .......... .......... .......... .......... 25%  116M 4s
  2150K .......... .......... .......... .......... .......... 26%  114M 4s
  2200K .......... .......... .......... .......... .......... 27%  104M 4s
  2250K .......... .......... .......... .......... .......... 27%  110M 4s
  2300K .......... .......... .......... .......... .......... 28%  113M 4s
  2350K .......... .......... .......... .......... .......... 28% 98.1M 4s
  2400K .......... .......... .......... .......... .......... 29% 83.4M 4s
  2450K .......... .......... .......... .......... .......... 30%  104M 4s
  2500K .......... .......... .......... .......... .......... 30%  105M 3s
  2550K .......... .......... .......... .......... .......... 31%  115M 3s
  2600K .......... .......... .......... .......... .......... 32%  101M 3s
  2650K .......... .......... .......... .......... .......... 32%  102M 3s
  2700K .......... .......... .......... .......... .......... 33%  104M 3s
  2750K .......... .......... .......... .......... .......... 33% 98.5M 3s
  2800K .......... .......... .......... .......... .......... 34% 82.0M 3s
  2850K .......... .......... .......... .......... .......... 35%  104M 3s
  2900K .......... .......... .......... .......... .......... 35%  105M 3s
  2950K .......... .......... .......... .......... .......... 36%  108M 3s
  3000K .......... .......... .......... .......... .......... 36%  109M 3s
  3050K .......... .......... .......... .......... .......... 37%  246K 3s
  3100K .......... .......... .......... .......... .......... 38%  109M 3s
  3150K .......... .......... .......... .......... .......... 38%  115M 3s
  3200K .......... .......... .......... .......... .......... 39% 93.8M 3s
  3250K .......... .......... .......... .......... .......... 39%  101M 3s
  3300K .......... .......... .......... .......... .......... 40%  118M 3s
  3350K .......... .......... .......... .......... .......... 41%  128M 2s
  3400K .......... .......... .......... .......... .......... 41%  108M 2s
  3450K .......... .......... .......... .......... .......... 42%  123M 2s
  3500K .......... .......... .......... .......... .......... 42%  115M 2s
  3550K .......... .......... .......... .......... .......... 43%  126M 2s
  3600K .......... .......... .......... .......... .......... 44% 97.1M 2s
  3650K .......... .......... .......... .......... .......... 44%  123M 2s
  3700K .......... .......... .......... .......... .......... 45%  121M 2s
  3750K .......... .......... .......... .......... .......... 45%  116M 2s
  3800K .......... .......... .......... .......... .......... 46%  110M 2s
  3850K .......... .......... .......... .......... .......... 47%  118M 2s
  3900K .......... .......... .......... .......... .......... 47%  116M 2s
  3950K .......... .......... .......... .......... .......... 48%  120M 2s
  4000K .......... .......... .......... .......... .......... 48% 95.4M 2s
  4050K .......... .......... .......... .......... .......... 49%  119M 2s
  4100K .......... .......... .......... .......... .......... 50%  119M 2s
  4150K .......... .......... .......... .......... .......... 50%  120M 2s
  4200K .......... .......... .......... .......... .......... 51%  102M 2s
  4250K .......... .......... .......... .......... .......... 51%  119M 2s
  4300K .......... .......... .......... .......... .......... 52%  120M 2s
  4350K .......... .......... .......... .......... .......... 53%  117M 2s
  4400K .......... .......... .......... .......... .......... 53% 97.3M 2s
  4450K .......... .......... .......... .......... .......... 54%  119M 1s
  4500K .......... .......... .......... .......... .......... 54%  107M 1s
  4550K .......... .......... .......... .......... .......... 55%  124M 1s
  4600K .......... .......... .......... .......... .......... 56%  111M 1s
  4650K .......... .......... .......... .......... .......... 56%  100M 1s
  4700K .......... .......... .......... .......... .......... 57%  117M 1s
  4750K .......... .......... .......... .......... .......... 57%  119M 1s
  4800K .......... .......... .......... .......... .......... 58%  227K 1s
  4850K .......... .......... .......... .......... .......... 59%  118M 1s
  4900K .......... .......... .......... .......... .......... 59%  121M 1s
  4950K .......... .......... .......... .......... .......... 60%  141M 1s
  5000K .......... .......... .......... .......... .......... 60%  111M 1s
  5050K .......... .......... .......... .......... .......... 61%  120M 1s
  5100K .......... .......... .......... .......... .......... 62%  136M 1s
  5150K .......... .......... .......... .......... .......... 62%  138M 1s
  5200K .......... .......... .......... .......... .......... 63% 89.6M 1s
  5250K .......... .......... .......... .......... .......... 64%  122M 1s
  5300K .......... .......... .......... .......... .......... 64%  117M 1s
  5350K .......... .......... .......... .......... .......... 65%  115M 1s
  5400K .......... .......... .......... .......... .......... 65% 4.66M 1s
  5450K .......... .......... .......... .......... .......... 66%  169M 1s
  5500K .......... .......... .......... .......... .......... 67%  172M 1s
  5550K .......... .......... .......... .......... .......... 67%  167M 1s
  5600K .......... .......... .......... .......... .......... 68%  140M 1s
  5650K .......... .......... .......... .......... .......... 68%  163M 1s
  5700K .......... .......... .......... .......... .......... 69%  163M 1s
  5750K .......... .......... .......... .......... .......... 70%  163M 1s
  5800K .......... .......... .......... .......... .......... 70%  149M 1s
  5850K .......... .......... .......... .......... .......... 71%  158M 1s
  5900K .......... .......... .......... .......... .......... 71%  165M 1s
  5950K .......... .......... .......... .......... .......... 72%  161M 1s
  6000K .......... .......... .......... .......... .......... 73%  132M 1s
  6050K .......... .......... .......... .......... .......... 73%  157M 1s
  6100K .......... .......... .......... .......... .......... 74%  154M 1s
  6150K .......... .......... .......... .......... .......... 74%  162M 1s
  6200K .......... .......... .......... .......... .......... 75%  149M 1s
  6250K .......... .......... .......... .......... .......... 76%  167M 1s
  6300K .......... .......... .......... .......... .......... 76%  160M 1s
  6350K .......... .......... .......... .......... .......... 77%  161M 1s
  6400K .......... .......... .......... .......... .......... 77%  136M 1s
  6450K .......... .......... .......... .......... .......... 78%  161M 1s
  6500K .......... .......... .......... .......... .......... 79%  165M 1s
  6550K .......... .......... .......... .......... .......... 79%  165M 1s
  6600K .......... .......... .......... .......... .......... 80%  151M 0s
  6650K .......... .......... .......... .......... .......... 80%  158M 0s
  6700K .......... .......... .......... .......... .......... 81%  151M 0s
  6750K .......... .......... .......... .......... .......... 82%  165M 0s
  6800K .......... .......... .......... .......... .......... 82%  133M 0s
  6850K .......... .......... .......... .......... .......... 83%  164M 0s
  6900K .......... .......... .......... .......... .......... 83%  167M 0s
  6950K .......... .......... .......... .......... .......... 84%  160M 0s
  7000K .......... .......... .......... .......... .......... 85%  153M 0s
  7050K .......... .......... .......... .......... .......... 85%  167M 0s
  7100K .......... .......... .......... .......... .......... 86%  160M 0s
  7150K .......... .......... .......... .......... .......... 86%  164M 0s
  7200K .......... .......... .......... .......... .......... 87%  133M 0s
  7250K .......... .......... .......... .......... .......... 88%  163M 0s
  7300K .......... .......... .......... .......... .......... 88%  144M 0s
  7350K .......... .......... .......... .......... .......... 89%  170M 0s
  7400K .......... .......... .......... .......... .......... 89%  160M 0s
  7450K .......... .......... .......... .......... .......... 90%  172M 0s
  7500K .......... .......... .......... .......... .......... 91%  174M 0s
  7550K .......... .......... .......... .......... .......... 91%  176M 0s
  7600K .......... .......... .......... .......... .......... 92%  141M 0s
  7650K .......... .......... .......... .......... .......... 92%  174M 0s
  7700K .......... .......... .......... .......... .......... 93%  175M 0s
  7750K .......... .......... .......... .......... .......... 94%  170M 0s
  7800K .......... .......... .......... .......... .......... 94%  162M 0s
  7850K .......... .......... .......... .......... .......... 95%  248K 0s
  7900K .......... .......... .......... .......... .......... 96%  114M 0s
  7950K .......... .......... .......... .......... .......... 96%  127M 0s
  8000K .......... .......... .......... .......... .......... 97% 93.0M 0s
  8050K .......... .......... .......... .......... .......... 97%  120M 0s
  8100K .......... .......... .......... .......... .......... 98%  108M 0s
  8150K .......... .......... .......... .......... .......... 99%  109M 0s
  8200K .......... .......... .......... .......... .......... 99%  102M 0s
  8250K .......... .......... .........                       100%  140M=2.2s

2018-06-18 10:29:52 (3.67 MB/s) - 'findbugs.zip' saved [8478491/8478491]

+ unzip -q findbugs.zip
+ '[' '!' -f junit-4.10.jar ']'
+ wget http://central.maven.org/maven2/junit/junit/4.10/junit-4.10.jar
--2018-06-18 10:29:52--  http://central.maven.org/maven2/junit/junit/4.10/junit-4.10.jar
Resolving central.maven.org (central.maven.org)... 151.101.52.209
Connecting to central.maven.org (central.maven.org)|151.101.52.209|:80... connected.
HTTP request sent, awaiting response... 200 OK
Length: 253160 (247K) [application/java-archive]
Saving to: 'junit-4.10.jar'

     0K .......... .......... .......... .......... .......... 20% 5.61M 0s
    50K .......... .......... .......... .......... .......... 40% 12.8M 0s
   100K .......... .......... .......... .......... .......... 60% 18.6M 0s
   150K .......... .......... .......... .......... .......... 80% 11.7M 0s
   200K .......... .......... .......... .......... .......   100% 11.1M=0.02s

2018-06-18 10:29:53 (10.3 MB/s) - 'junit-4.10.jar' saved [253160/253160]

+ cp junit-4.10.jar lib
+ '[' '!' -f lib/build/checkstyle-5.7-all.jar ']'
+ https://github.com/checkstyle/checkstyle/releases/download/checkstyle-5.7/checkstyle-5.7-all.jar
/tmp/jenkins3200844705195317289.sh: line 14: https://github.com/checkstyle/checkstyle/releases/download/checkstyle-5.7/checkstyle-5.7-all.jar: No such file or directory
Build step 'Execute shell' marked build as failure

---------------------------------------------------------------------
To unsubscribe, e-mail: general-unsubscribe@xmlgraphics.apache.org
For additional commands, e-mail: general-help@xmlgraphics.apache.org


Build failed in Jenkins: xmlgraphics-commons #84

Posted by Apache Jenkins Server <je...@builds.apache.org>.
See <https://builds.apache.org/job/xmlgraphics-commons/84/display/redirect>

------------------------------------------
[...truncated 21.64 KB...]
    [junit] Tests run: 1, Failures: 0, Errors: 0, Skipped: 0, Time elapsed: 0.126 sec
    [junit] 
    [junit] Testsuite: org.apache.xmlgraphics.image.loader.impl.ImageLoaderFactoryPNGTestCase
    [junit] Tests run: 4, Failures: 0, Errors: 0, Skipped: 0, Time elapsed: 0.054 sec
    [junit] 
    [junit] Testsuite: org.apache.xmlgraphics.image.loader.impl.ImageLoaderImageIOTestCase
    [junit] Tests run: 1, Failures: 0, Errors: 0, Skipped: 0, Time elapsed: 0.479 sec
    [junit] 
    [junit] ------------- Standard Error -----------------
    [junit] Jun 18, 2018 10:22:14 AM org.apache.xmlgraphics.image.loader.impl.imageio.ImageLoaderImageIO loadImage
    [junit] WARNING: Image <https://builds.apache.org/job/xmlgraphics-commons/ws/build/test-classes/org/apache/xmlgraphics/image/loader/impl/gray-vs-cmyk-profile.png> has an incompatible color profile. The color profile will be ignored.
    [junit] Color model of loaded bitmap: ColorModel: #pixelBits = 16 numComponents = 2 color space = java.awt.color.ICC_ColorSpace@ac6a45 transparency = 3 has alpha = true isAlphaPre = false
    [junit] Color model of color profile: ColorModel: #pixelBits = 40 numComponents = 5 color space = java.awt.color.ICC_ColorSpace@1d2fc36 transparency = 3 has alpha = true isAlphaPre = false
    [junit] ------------- ---------------- ---------------
    [junit] Testsuite: org.apache.xmlgraphics.image.loader.impl.ImageLoaderPNGTestCase
    [junit] Tests run: 3, Failures: 0, Errors: 0, Skipped: 0, Time elapsed: 0.159 sec
    [junit] 
    [junit] Testsuite: org.apache.xmlgraphics.image.loader.impl.ImageLoaderRawCCITTFaxTestCase
    [junit] Tests run: 1, Failures: 0, Errors: 0, Skipped: 0, Time elapsed: 0.115 sec
    [junit] 
    [junit] Testsuite: org.apache.xmlgraphics.image.loader.impl.ImageLoaderRawPNGTestCase
    [junit] Tests run: 5, Failures: 0, Errors: 0, Skipped: 0, Time elapsed: 0.167 sec
    [junit] 
    [junit] Testsuite: org.apache.xmlgraphics.image.loader.impl.PNGFileTestCase
    [junit] Tests run: 7, Failures: 0, Errors: 0, Skipped: 0, Time elapsed: 0.13 sec
    [junit] 
    [junit] Testsuite: org.apache.xmlgraphics.image.loader.impl.PreloaderJPEGTestCase
    [junit] Tests run: 1, Failures: 0, Errors: 0, Skipped: 0, Time elapsed: 0.214 sec
    [junit] 
    [junit] Testsuite: org.apache.xmlgraphics.image.writer.ImageWriterRegistryTestCase
    [junit] Tests run: 1, Failures: 0, Errors: 0, Skipped: 0, Time elapsed: 0.071 sec
    [junit] 
    [junit] Testsuite: org.apache.xmlgraphics.image.writer.ResolutionTestCase
    [junit] Tests run: 1, Failures: 0, Errors: 0, Skipped: 0, Time elapsed: 0.191 sec
    [junit] 
    [junit] ------------- Standard Error -----------------
    [junit] Problem while writing image using ImageI/O: Metadata Adobe settings incompatible with image type. Metadata modified.
    [junit] Problem while writing image using ImageI/O: Metadata Adobe settings incompatible with image type. Metadata modified.
    [junit] ------------- ---------------- ---------------
    [junit] Testsuite: org.apache.xmlgraphics.image.writer.imageio.ImageIOTIFFImageWriterTestCase
    [junit] Tests run: 2, Failures: 0, Errors: 0, Skipped: 0, Time elapsed: 0.065 sec
    [junit] 
    [junit] ------------- Standard Output ---------------
    [junit] Skipping endianness test for ImageIO-based TIFF writer because JAI ImageIO Tools is not available!
    [junit] Skipping endianness test for ImageIO-based TIFF writer because JAI ImageIO Tools is not available!
    [junit] ------------- ---------------- ---------------
    [junit] Testsuite: org.apache.xmlgraphics.io.TempResourceURIGeneratorTestCase
    [junit] Tests run: 2, Failures: 0, Errors: 0, Skipped: 0, Time elapsed: 0.085 sec
    [junit] 
    [junit] Testsuite: org.apache.xmlgraphics.io.URIResolverAdapterTestCase
    [junit] Tests run: 3, Failures: 0, Errors: 0, Skipped: 2, Time elapsed: 0.077 sec
    [junit] 
    [junit] Testcase: testCatalogResolver(org.apache.xmlgraphics.io.URIResolverAdapterTestCase):SKIPPED: Literally no idea why this doesn't work... Gonna look at the catalog resolver source
    [junit] Testcase: testCatalogResolverInAdapter(org.apache.xmlgraphics.io.URIResolverAdapterTestCase):SKIPPED: Literally no idea why this doesn't work... Gonna look at the catalog resolver source
    [junit] Testsuite: org.apache.xmlgraphics.io.XmlSourceUtilTestCase
    [junit] Tests run: 14, Failures: 0, Errors: 0, Skipped: 0, Time elapsed: 0.389 sec
    [junit] 
    [junit] Testsuite: org.apache.xmlgraphics.java2d.GraphicContextTestCase
    [junit] Tests run: 1, Failures: 0, Errors: 0, Skipped: 0, Time elapsed: 0.073 sec
    [junit] 
    [junit] Testsuite: org.apache.xmlgraphics.java2d.GraphicsConfigurationWithTransparencyTestCase
    [junit] Tests run: 3, Failures: 0, Errors: 0, Skipped: 0, Time elapsed: 0.07 sec
    [junit] 
    [junit] Testsuite: org.apache.xmlgraphics.java2d.GraphicsConfigurationWithoutTransparencyTestCase
    [junit] Tests run: 3, Failures: 0, Errors: 0, Skipped: 0, Time elapsed: 0.103 sec
    [junit] 
    [junit] ------------- Standard Error -----------------
    [junit] Jun 18, 2018 10:22:19 AM org.apache.xmlgraphics.java2d.GraphicsConfigurationWithoutTransparency createCompatibleImage
    [junit] WARNING: Does not support transparencies (alpha channels) in images
    [junit] Jun 18, 2018 10:22:19 AM org.apache.xmlgraphics.java2d.GraphicsConfigurationWithoutTransparency createCompatibleImage
    [junit] WARNING: Does not support transparencies (alpha channels) in images
    [junit] Jun 18, 2018 10:22:19 AM org.apache.xmlgraphics.java2d.GraphicsConfigurationWithoutTransparency getColorModel
    [junit] WARNING: Does not support transparencies (alpha channels) in images
    [junit] ------------- ---------------- ---------------
    [junit] Testsuite: org.apache.xmlgraphics.java2d.color.ColorConverterTestCase
    [junit] Tests run: 1, Failures: 0, Errors: 0, Skipped: 0, Time elapsed: 0.055 sec
    [junit] 
    [junit] Testsuite: org.apache.xmlgraphics.java2d.color.ColorWithAlternativesTestCase
    [junit] Tests run: 2, Failures: 0, Errors: 0, Skipped: 0, Time elapsed: 0.115 sec
    [junit] 
    [junit] Testsuite: org.apache.xmlgraphics.java2d.color.NamedColorTestCase
    [junit] Tests run: 2, Failures: 0, Errors: 0, Skipped: 0, Time elapsed: 0.105 sec
    [junit] 
    [junit] Testsuite: org.apache.xmlgraphics.java2d.color.profile.ColorProfileUtilTestCase
    [junit] Tests run: 1, Failures: 0, Errors: 0, Skipped: 0, Time elapsed: 0.051 sec
    [junit] 
    [junit] Testsuite: org.apache.xmlgraphics.java2d.color.profile.NamedColorProfileParserTestCase
    [junit] Tests run: 1, Failures: 0, Errors: 0, Skipped: 0, Time elapsed: 0.081 sec
    [junit] 
    [junit] Testsuite: org.apache.xmlgraphics.java2d.ps.PSGraphics2DTestCase
    [junit] Tests run: 4, Failures: 0, Errors: 0, Skipped: 0, Time elapsed: 0.392 sec
    [junit] 
    [junit] Testsuite: org.apache.xmlgraphics.ps.ImageEncodingHelperTestCase
    [junit] Tests run: 3, Failures: 0, Errors: 0, Skipped: 0, Time elapsed: 0.306 sec
    [junit] 
    [junit] Testsuite: org.apache.xmlgraphics.ps.PSEscapeTestCase
    [junit] Tests run: 2, Failures: 0, Errors: 0, Skipped: 0, Time elapsed: 0.052 sec
    [junit] 
    [junit] Testsuite: org.apache.xmlgraphics.ps.PSPageDeviceDictionaryTestCase
    [junit] Tests run: 1, Failures: 0, Errors: 0, Skipped: 0, Time elapsed: 0.05 sec
    [junit] 
    [junit] Testsuite: org.apache.xmlgraphics.ps.dsc.DSCParserTestCase
    [junit] Tests run: 4, Failures: 0, Errors: 0, Skipped: 0, Time elapsed: 0.072 sec
    [junit] 
    [junit] Testsuite: org.apache.xmlgraphics.ps.dsc.ListenerTestCase
    [junit] Tests run: 2, Failures: 0, Errors: 0, Skipped: 0, Time elapsed: 0.078 sec
    [junit] 
    [junit] ------------- Standard Output ---------------
    [junit] org.apache.xmlgraphics.ps.dsc.events.DSCHeaderComment@10045eb
    [junit] org.apache.xmlgraphics.ps.dsc.events.DSCCommentBoundingBox@ee7a14
    [junit] org.apache.xmlgraphics.ps.dsc.events.DSCCommentLanguageLevel@6cb8
    [junit] org.apache.xmlgraphics.ps.dsc.events.PostScriptComment@1e1a408
    [junit] org.apache.xmlgraphics.ps.dsc.events.DSCCommentEndComments@d81784
    [junit] org.apache.xmlgraphics.ps.dsc.events.PostScriptLine@f01a1e
    [junit] org.apache.xmlgraphics.ps.dsc.events.PostScriptLine@142a80d
    [junit] org.apache.xmlgraphics.ps.dsc.events.PostScriptComment@126f75b
    [junit] org.apache.xmlgraphics.ps.dsc.events.PostScriptLine@139b78e
    [junit] org.apache.xmlgraphics.ps.dsc.events.PostScriptLine@41d05d
    [junit] org.apache.xmlgraphics.ps.dsc.events.PostScriptLine@d6a05e
    [junit] org.apache.xmlgraphics.ps.dsc.events.DSCCommentEndOfFile@ba8602
    [junit] ------------- ---------------- ---------------
    [junit] Testsuite: org.apache.xmlgraphics.ps.dsc.events.DSCCommentBoundingBoxTestCase
    [junit] Tests run: 1, Failures: 0, Errors: 0, Skipped: 0, Time elapsed: 0.06 sec
    [junit] 
    [junit] Testsuite: org.apache.xmlgraphics.ps.dsc.events.DSCValueParserTestCase
    [junit] Tests run: 2, Failures: 0, Errors: 0, Skipped: 0, Time elapsed: 0.051 sec
    [junit] 
    [junit] Testsuite: org.apache.xmlgraphics.ps.dsc.tools.DSCToolsTestCase
    [junit] Tests run: 1, Failures: 0, Errors: 0, Skipped: 0, Time elapsed: 0.05 sec
    [junit] 
    [junit] Testsuite: org.apache.xmlgraphics.util.ClasspathResourceTestCase
    [junit] Tests run: 2, Failures: 0, Errors: 0, Skipped: 0, Time elapsed: 0.057 sec
    [junit] 
    [junit] Testsuite: org.apache.xmlgraphics.util.DateFormatUtilTestCase
    [junit] Tests run: 5, Failures: 0, Errors: 0, Skipped: 0, Time elapsed: 0.082 sec
    [junit] 
    [junit] Testsuite: org.apache.xmlgraphics.util.DoubleFormatUtilTestCase
    [junit] Tests run: 7, Failures: 0, Errors: 0, Skipped: 2, Time elapsed: 9.827 sec
    [junit] 
    [junit] Testcase: fast(org.apache.xmlgraphics.util.DoubleFormatUtilTestCase):SKIPPED: Disabled since the formatFast method is not accurate.
    [junit] Testcase: performanceCompare(org.apache.xmlgraphics.util.DoubleFormatUtilTestCase):SKIPPED: Disabled since this doesn't test correctness.
    [junit] Testsuite: org.apache.xmlgraphics.util.ServiceTestCase
    [junit] Tests run: 2, Failures: 0, Errors: 0, Skipped: 0, Time elapsed: 0.049 sec
    [junit] 
    [junit] Testsuite: org.apache.xmlgraphics.util.UnitConvTestCase
    [junit] Tests run: 1, Failures: 0, Errors: 0, Skipped: 0, Time elapsed: 0.04 sec
    [junit] 
    [junit] Testsuite: org.apache.xmlgraphics.util.io.ASCII85InputStreamTestCase
    [junit] Tests run: 2, Failures: 0, Errors: 0, Skipped: 0, Time elapsed: 0.072 sec
    [junit] 
    [junit] Testsuite: org.apache.xmlgraphics.util.io.ASCII85OutputStreamTestCase
    [junit] Tests run: 1, Failures: 0, Errors: 0, Skipped: 0, Time elapsed: 0.048 sec
    [junit] 
    [junit] Testsuite: org.apache.xmlgraphics.util.io.Base64TestCase
    [junit] Tests run: 1, Failures: 0, Errors: 0, Skipped: 0, Time elapsed: 0.126 sec
    [junit] 
    [junit] ------------- Standard Output ---------------
    [junit] <https://builds.apache.org/job/xmlgraphics-commons/ws/>
    [junit] ------------- ---------------- ---------------
    [junit] Testsuite: org.apache.xmlgraphics.util.io.SubInputStreamTestCase
    [junit] Tests run: 1, Failures: 0, Errors: 0, Skipped: 0, Time elapsed: 0.049 sec
    [junit] 
    [junit] Testsuite: org.apache.xmlgraphics.util.uri.CommonURIResolverTestCase
    [junit] Tests run: 1, Failures: 0, Errors: 0, Skipped: 0, Time elapsed: 0.073 sec
    [junit] 
    [junit] Testsuite: org.apache.xmlgraphics.util.uri.DataURIResolverTestCase
    [junit] Tests run: 4, Failures: 0, Errors: 0, Skipped: 0, Time elapsed: 0.068 sec
    [junit] 
    [junit] Testsuite: org.apache.xmlgraphics.xmp.XMPParserTestCase
    [junit] Tests run: 6, Failures: 0, Errors: 0, Skipped: 0, Time elapsed: 0.1 sec
    [junit] 
    [junit] Testsuite: org.apache.xmlgraphics.xmp.XMPPropertyTestCase
    [junit] Tests run: 7, Failures: 0, Errors: 0, Skipped: 0, Time elapsed: 0.092 sec
    [junit] 

junit:
     [echo] All Junit tests passed!

info:
     [echo] ------------------- Apache XML Graphics Commons svn-trunk [1999-2018] ----------------
     [echo] See build.properties and build-local.properties for additional build settings
     [echo] Apache Ant(TM) version 1.9.6 compiled on July 8 2015
     [echo] VM: 16.3-b01, Sun Microsystems Inc.
     [echo] JAVA_HOME: /home/jenkins/tools/java/jdk1.6.0_20-32-unlimited-security

init-avail:
     [echo] JUnit Support PRESENT
     [echo] IKVM Support NOT Present

init:

compile-pattern-with-codecs:
     [echo] Internal codecs will be compiled.

compile-pattern-without-codecs:

compile-java:

compile-copy-resources:

compile:

uptodate-jar-main:

jar-main:

package.NET:

package:

checkstyle-avail:

checkstyle:

BUILD FAILED
<https://builds.apache.org/job/xmlgraphics-commons/ws/build.xml>:485: Could not create type checkstyle due to java.lang.NoClassDefFoundError: com/google/common/collect/Lists
	at com.puppycrawl.tools.checkstyle.CheckStyleTask.<init>(CheckStyleTask.java:78)
	at sun.reflect.NativeConstructorAccessorImpl.newInstance0(Native Method)
	at sun.reflect.NativeConstructorAccessorImpl.newInstance(NativeConstructorAccessorImpl.java:39)
	at sun.reflect.DelegatingConstructorAccessorImpl.newInstance(DelegatingConstructorAccessorImpl.java:27)
	at java.lang.reflect.Constructor.newInstance(Constructor.java:513)
	at org.apache.tools.ant.AntTypeDefinition.innerCreateAndSet(AntTypeDefinition.java:329)
	at org.apache.tools.ant.AntTypeDefinition.createAndSet(AntTypeDefinition.java:274)
	at org.apache.tools.ant.AntTypeDefinition.icreate(AntTypeDefinition.java:219)
	at org.apache.tools.ant.AntTypeDefinition.create(AntTypeDefinition.java:206)
	at org.apache.tools.ant.ComponentHelper.createComponent(ComponentHelper.java:285)
	at org.apache.tools.ant.ComponentHelper.createComponent(ComponentHelper.java:263)
	at org.apache.tools.ant.UnknownElement.makeObject(UnknownElement.java:430)
	at org.apache.tools.ant.UnknownElement.maybeConfigure(UnknownElement.java:164)
	at org.apache.tools.ant.Task.perform(Task.java:347)
	at org.apache.tools.ant.Target.execute(Target.java:435)
	at org.apache.tools.ant.Target.performTasks(Target.java:456)
	at org.apache.tools.ant.Project.executeSortedTargets(Project.java:1405)
	at org.apache.tools.ant.Project.executeTarget(Project.java:1376)
	at org.apache.tools.ant.helper.DefaultExecutor.executeTargets(DefaultExecutor.java:41)
	at org.apache.tools.ant.Project.executeTargets(Project.java:1260)
	at org.apache.tools.ant.Main.runBuild(Main.java:853)
	at org.apache.tools.ant.Main.startAnt(Main.java:235)
	at org.apache.tools.ant.launch.Launcher.run(Launcher.java:285)
	at org.apache.tools.ant.launch.Launcher.main(Launcher.java:112)
Caused by: java.lang.ClassNotFoundException: com.google.common.collect.Lists
	at org.apache.tools.ant.AntClassLoader.findClassInComponents(AntClassLoader.java:1388)
	at org.apache.tools.ant.AntClassLoader.findClass(AntClassLoader.java:1337)
	at org.apache.tools.ant.AntClassLoader.loadClass(AntClassLoader.java:1089)
	at java.lang.ClassLoader.loadClass(ClassLoader.java:248)
	... 24 more

Total time: 38 seconds
Build step 'Execute shell' marked build as failure

---------------------------------------------------------------------
To unsubscribe, e-mail: general-unsubscribe@xmlgraphics.apache.org
For additional commands, e-mail: general-help@xmlgraphics.apache.org


Build failed in Jenkins: xmlgraphics-commons #84

Posted by Apache Jenkins Server <je...@builds.apache.org>.
See <https://builds.apache.org/job/xmlgraphics-commons/84/display/redirect>

------------------------------------------
[...truncated 21.64 KB...]
    [junit] Tests run: 1, Failures: 0, Errors: 0, Skipped: 0, Time elapsed: 0.126 sec
    [junit] 
    [junit] Testsuite: org.apache.xmlgraphics.image.loader.impl.ImageLoaderFactoryPNGTestCase
    [junit] Tests run: 4, Failures: 0, Errors: 0, Skipped: 0, Time elapsed: 0.054 sec
    [junit] 
    [junit] Testsuite: org.apache.xmlgraphics.image.loader.impl.ImageLoaderImageIOTestCase
    [junit] Tests run: 1, Failures: 0, Errors: 0, Skipped: 0, Time elapsed: 0.479 sec
    [junit] 
    [junit] ------------- Standard Error -----------------
    [junit] Jun 18, 2018 10:22:14 AM org.apache.xmlgraphics.image.loader.impl.imageio.ImageLoaderImageIO loadImage
    [junit] WARNING: Image <https://builds.apache.org/job/xmlgraphics-commons/ws/build/test-classes/org/apache/xmlgraphics/image/loader/impl/gray-vs-cmyk-profile.png> has an incompatible color profile. The color profile will be ignored.
    [junit] Color model of loaded bitmap: ColorModel: #pixelBits = 16 numComponents = 2 color space = java.awt.color.ICC_ColorSpace@ac6a45 transparency = 3 has alpha = true isAlphaPre = false
    [junit] Color model of color profile: ColorModel: #pixelBits = 40 numComponents = 5 color space = java.awt.color.ICC_ColorSpace@1d2fc36 transparency = 3 has alpha = true isAlphaPre = false
    [junit] ------------- ---------------- ---------------
    [junit] Testsuite: org.apache.xmlgraphics.image.loader.impl.ImageLoaderPNGTestCase
    [junit] Tests run: 3, Failures: 0, Errors: 0, Skipped: 0, Time elapsed: 0.159 sec
    [junit] 
    [junit] Testsuite: org.apache.xmlgraphics.image.loader.impl.ImageLoaderRawCCITTFaxTestCase
    [junit] Tests run: 1, Failures: 0, Errors: 0, Skipped: 0, Time elapsed: 0.115 sec
    [junit] 
    [junit] Testsuite: org.apache.xmlgraphics.image.loader.impl.ImageLoaderRawPNGTestCase
    [junit] Tests run: 5, Failures: 0, Errors: 0, Skipped: 0, Time elapsed: 0.167 sec
    [junit] 
    [junit] Testsuite: org.apache.xmlgraphics.image.loader.impl.PNGFileTestCase
    [junit] Tests run: 7, Failures: 0, Errors: 0, Skipped: 0, Time elapsed: 0.13 sec
    [junit] 
    [junit] Testsuite: org.apache.xmlgraphics.image.loader.impl.PreloaderJPEGTestCase
    [junit] Tests run: 1, Failures: 0, Errors: 0, Skipped: 0, Time elapsed: 0.214 sec
    [junit] 
    [junit] Testsuite: org.apache.xmlgraphics.image.writer.ImageWriterRegistryTestCase
    [junit] Tests run: 1, Failures: 0, Errors: 0, Skipped: 0, Time elapsed: 0.071 sec
    [junit] 
    [junit] Testsuite: org.apache.xmlgraphics.image.writer.ResolutionTestCase
    [junit] Tests run: 1, Failures: 0, Errors: 0, Skipped: 0, Time elapsed: 0.191 sec
    [junit] 
    [junit] ------------- Standard Error -----------------
    [junit] Problem while writing image using ImageI/O: Metadata Adobe settings incompatible with image type. Metadata modified.
    [junit] Problem while writing image using ImageI/O: Metadata Adobe settings incompatible with image type. Metadata modified.
    [junit] ------------- ---------------- ---------------
    [junit] Testsuite: org.apache.xmlgraphics.image.writer.imageio.ImageIOTIFFImageWriterTestCase
    [junit] Tests run: 2, Failures: 0, Errors: 0, Skipped: 0, Time elapsed: 0.065 sec
    [junit] 
    [junit] ------------- Standard Output ---------------
    [junit] Skipping endianness test for ImageIO-based TIFF writer because JAI ImageIO Tools is not available!
    [junit] Skipping endianness test for ImageIO-based TIFF writer because JAI ImageIO Tools is not available!
    [junit] ------------- ---------------- ---------------
    [junit] Testsuite: org.apache.xmlgraphics.io.TempResourceURIGeneratorTestCase
    [junit] Tests run: 2, Failures: 0, Errors: 0, Skipped: 0, Time elapsed: 0.085 sec
    [junit] 
    [junit] Testsuite: org.apache.xmlgraphics.io.URIResolverAdapterTestCase
    [junit] Tests run: 3, Failures: 0, Errors: 0, Skipped: 2, Time elapsed: 0.077 sec
    [junit] 
    [junit] Testcase: testCatalogResolver(org.apache.xmlgraphics.io.URIResolverAdapterTestCase):SKIPPED: Literally no idea why this doesn't work... Gonna look at the catalog resolver source
    [junit] Testcase: testCatalogResolverInAdapter(org.apache.xmlgraphics.io.URIResolverAdapterTestCase):SKIPPED: Literally no idea why this doesn't work... Gonna look at the catalog resolver source
    [junit] Testsuite: org.apache.xmlgraphics.io.XmlSourceUtilTestCase
    [junit] Tests run: 14, Failures: 0, Errors: 0, Skipped: 0, Time elapsed: 0.389 sec
    [junit] 
    [junit] Testsuite: org.apache.xmlgraphics.java2d.GraphicContextTestCase
    [junit] Tests run: 1, Failures: 0, Errors: 0, Skipped: 0, Time elapsed: 0.073 sec
    [junit] 
    [junit] Testsuite: org.apache.xmlgraphics.java2d.GraphicsConfigurationWithTransparencyTestCase
    [junit] Tests run: 3, Failures: 0, Errors: 0, Skipped: 0, Time elapsed: 0.07 sec
    [junit] 
    [junit] Testsuite: org.apache.xmlgraphics.java2d.GraphicsConfigurationWithoutTransparencyTestCase
    [junit] Tests run: 3, Failures: 0, Errors: 0, Skipped: 0, Time elapsed: 0.103 sec
    [junit] 
    [junit] ------------- Standard Error -----------------
    [junit] Jun 18, 2018 10:22:19 AM org.apache.xmlgraphics.java2d.GraphicsConfigurationWithoutTransparency createCompatibleImage
    [junit] WARNING: Does not support transparencies (alpha channels) in images
    [junit] Jun 18, 2018 10:22:19 AM org.apache.xmlgraphics.java2d.GraphicsConfigurationWithoutTransparency createCompatibleImage
    [junit] WARNING: Does not support transparencies (alpha channels) in images
    [junit] Jun 18, 2018 10:22:19 AM org.apache.xmlgraphics.java2d.GraphicsConfigurationWithoutTransparency getColorModel
    [junit] WARNING: Does not support transparencies (alpha channels) in images
    [junit] ------------- ---------------- ---------------
    [junit] Testsuite: org.apache.xmlgraphics.java2d.color.ColorConverterTestCase
    [junit] Tests run: 1, Failures: 0, Errors: 0, Skipped: 0, Time elapsed: 0.055 sec
    [junit] 
    [junit] Testsuite: org.apache.xmlgraphics.java2d.color.ColorWithAlternativesTestCase
    [junit] Tests run: 2, Failures: 0, Errors: 0, Skipped: 0, Time elapsed: 0.115 sec
    [junit] 
    [junit] Testsuite: org.apache.xmlgraphics.java2d.color.NamedColorTestCase
    [junit] Tests run: 2, Failures: 0, Errors: 0, Skipped: 0, Time elapsed: 0.105 sec
    [junit] 
    [junit] Testsuite: org.apache.xmlgraphics.java2d.color.profile.ColorProfileUtilTestCase
    [junit] Tests run: 1, Failures: 0, Errors: 0, Skipped: 0, Time elapsed: 0.051 sec
    [junit] 
    [junit] Testsuite: org.apache.xmlgraphics.java2d.color.profile.NamedColorProfileParserTestCase
    [junit] Tests run: 1, Failures: 0, Errors: 0, Skipped: 0, Time elapsed: 0.081 sec
    [junit] 
    [junit] Testsuite: org.apache.xmlgraphics.java2d.ps.PSGraphics2DTestCase
    [junit] Tests run: 4, Failures: 0, Errors: 0, Skipped: 0, Time elapsed: 0.392 sec
    [junit] 
    [junit] Testsuite: org.apache.xmlgraphics.ps.ImageEncodingHelperTestCase
    [junit] Tests run: 3, Failures: 0, Errors: 0, Skipped: 0, Time elapsed: 0.306 sec
    [junit] 
    [junit] Testsuite: org.apache.xmlgraphics.ps.PSEscapeTestCase
    [junit] Tests run: 2, Failures: 0, Errors: 0, Skipped: 0, Time elapsed: 0.052 sec
    [junit] 
    [junit] Testsuite: org.apache.xmlgraphics.ps.PSPageDeviceDictionaryTestCase
    [junit] Tests run: 1, Failures: 0, Errors: 0, Skipped: 0, Time elapsed: 0.05 sec
    [junit] 
    [junit] Testsuite: org.apache.xmlgraphics.ps.dsc.DSCParserTestCase
    [junit] Tests run: 4, Failures: 0, Errors: 0, Skipped: 0, Time elapsed: 0.072 sec
    [junit] 
    [junit] Testsuite: org.apache.xmlgraphics.ps.dsc.ListenerTestCase
    [junit] Tests run: 2, Failures: 0, Errors: 0, Skipped: 0, Time elapsed: 0.078 sec
    [junit] 
    [junit] ------------- Standard Output ---------------
    [junit] org.apache.xmlgraphics.ps.dsc.events.DSCHeaderComment@10045eb
    [junit] org.apache.xmlgraphics.ps.dsc.events.DSCCommentBoundingBox@ee7a14
    [junit] org.apache.xmlgraphics.ps.dsc.events.DSCCommentLanguageLevel@6cb8
    [junit] org.apache.xmlgraphics.ps.dsc.events.PostScriptComment@1e1a408
    [junit] org.apache.xmlgraphics.ps.dsc.events.DSCCommentEndComments@d81784
    [junit] org.apache.xmlgraphics.ps.dsc.events.PostScriptLine@f01a1e
    [junit] org.apache.xmlgraphics.ps.dsc.events.PostScriptLine@142a80d
    [junit] org.apache.xmlgraphics.ps.dsc.events.PostScriptComment@126f75b
    [junit] org.apache.xmlgraphics.ps.dsc.events.PostScriptLine@139b78e
    [junit] org.apache.xmlgraphics.ps.dsc.events.PostScriptLine@41d05d
    [junit] org.apache.xmlgraphics.ps.dsc.events.PostScriptLine@d6a05e
    [junit] org.apache.xmlgraphics.ps.dsc.events.DSCCommentEndOfFile@ba8602
    [junit] ------------- ---------------- ---------------
    [junit] Testsuite: org.apache.xmlgraphics.ps.dsc.events.DSCCommentBoundingBoxTestCase
    [junit] Tests run: 1, Failures: 0, Errors: 0, Skipped: 0, Time elapsed: 0.06 sec
    [junit] 
    [junit] Testsuite: org.apache.xmlgraphics.ps.dsc.events.DSCValueParserTestCase
    [junit] Tests run: 2, Failures: 0, Errors: 0, Skipped: 0, Time elapsed: 0.051 sec
    [junit] 
    [junit] Testsuite: org.apache.xmlgraphics.ps.dsc.tools.DSCToolsTestCase
    [junit] Tests run: 1, Failures: 0, Errors: 0, Skipped: 0, Time elapsed: 0.05 sec
    [junit] 
    [junit] Testsuite: org.apache.xmlgraphics.util.ClasspathResourceTestCase
    [junit] Tests run: 2, Failures: 0, Errors: 0, Skipped: 0, Time elapsed: 0.057 sec
    [junit] 
    [junit] Testsuite: org.apache.xmlgraphics.util.DateFormatUtilTestCase
    [junit] Tests run: 5, Failures: 0, Errors: 0, Skipped: 0, Time elapsed: 0.082 sec
    [junit] 
    [junit] Testsuite: org.apache.xmlgraphics.util.DoubleFormatUtilTestCase
    [junit] Tests run: 7, Failures: 0, Errors: 0, Skipped: 2, Time elapsed: 9.827 sec
    [junit] 
    [junit] Testcase: fast(org.apache.xmlgraphics.util.DoubleFormatUtilTestCase):SKIPPED: Disabled since the formatFast method is not accurate.
    [junit] Testcase: performanceCompare(org.apache.xmlgraphics.util.DoubleFormatUtilTestCase):SKIPPED: Disabled since this doesn't test correctness.
    [junit] Testsuite: org.apache.xmlgraphics.util.ServiceTestCase
    [junit] Tests run: 2, Failures: 0, Errors: 0, Skipped: 0, Time elapsed: 0.049 sec
    [junit] 
    [junit] Testsuite: org.apache.xmlgraphics.util.UnitConvTestCase
    [junit] Tests run: 1, Failures: 0, Errors: 0, Skipped: 0, Time elapsed: 0.04 sec
    [junit] 
    [junit] Testsuite: org.apache.xmlgraphics.util.io.ASCII85InputStreamTestCase
    [junit] Tests run: 2, Failures: 0, Errors: 0, Skipped: 0, Time elapsed: 0.072 sec
    [junit] 
    [junit] Testsuite: org.apache.xmlgraphics.util.io.ASCII85OutputStreamTestCase
    [junit] Tests run: 1, Failures: 0, Errors: 0, Skipped: 0, Time elapsed: 0.048 sec
    [junit] 
    [junit] Testsuite: org.apache.xmlgraphics.util.io.Base64TestCase
    [junit] Tests run: 1, Failures: 0, Errors: 0, Skipped: 0, Time elapsed: 0.126 sec
    [junit] 
    [junit] ------------- Standard Output ---------------
    [junit] <https://builds.apache.org/job/xmlgraphics-commons/ws/>
    [junit] ------------- ---------------- ---------------
    [junit] Testsuite: org.apache.xmlgraphics.util.io.SubInputStreamTestCase
    [junit] Tests run: 1, Failures: 0, Errors: 0, Skipped: 0, Time elapsed: 0.049 sec
    [junit] 
    [junit] Testsuite: org.apache.xmlgraphics.util.uri.CommonURIResolverTestCase
    [junit] Tests run: 1, Failures: 0, Errors: 0, Skipped: 0, Time elapsed: 0.073 sec
    [junit] 
    [junit] Testsuite: org.apache.xmlgraphics.util.uri.DataURIResolverTestCase
    [junit] Tests run: 4, Failures: 0, Errors: 0, Skipped: 0, Time elapsed: 0.068 sec
    [junit] 
    [junit] Testsuite: org.apache.xmlgraphics.xmp.XMPParserTestCase
    [junit] Tests run: 6, Failures: 0, Errors: 0, Skipped: 0, Time elapsed: 0.1 sec
    [junit] 
    [junit] Testsuite: org.apache.xmlgraphics.xmp.XMPPropertyTestCase
    [junit] Tests run: 7, Failures: 0, Errors: 0, Skipped: 0, Time elapsed: 0.092 sec
    [junit] 

junit:
     [echo] All Junit tests passed!

info:
     [echo] ------------------- Apache XML Graphics Commons svn-trunk [1999-2018] ----------------
     [echo] See build.properties and build-local.properties for additional build settings
     [echo] Apache Ant(TM) version 1.9.6 compiled on July 8 2015
     [echo] VM: 16.3-b01, Sun Microsystems Inc.
     [echo] JAVA_HOME: /home/jenkins/tools/java/jdk1.6.0_20-32-unlimited-security

init-avail:
     [echo] JUnit Support PRESENT
     [echo] IKVM Support NOT Present

init:

compile-pattern-with-codecs:
     [echo] Internal codecs will be compiled.

compile-pattern-without-codecs:

compile-java:

compile-copy-resources:

compile:

uptodate-jar-main:

jar-main:

package.NET:

package:

checkstyle-avail:

checkstyle:

BUILD FAILED
<https://builds.apache.org/job/xmlgraphics-commons/ws/build.xml>:485: Could not create type checkstyle due to java.lang.NoClassDefFoundError: com/google/common/collect/Lists
	at com.puppycrawl.tools.checkstyle.CheckStyleTask.<init>(CheckStyleTask.java:78)
	at sun.reflect.NativeConstructorAccessorImpl.newInstance0(Native Method)
	at sun.reflect.NativeConstructorAccessorImpl.newInstance(NativeConstructorAccessorImpl.java:39)
	at sun.reflect.DelegatingConstructorAccessorImpl.newInstance(DelegatingConstructorAccessorImpl.java:27)
	at java.lang.reflect.Constructor.newInstance(Constructor.java:513)
	at org.apache.tools.ant.AntTypeDefinition.innerCreateAndSet(AntTypeDefinition.java:329)
	at org.apache.tools.ant.AntTypeDefinition.createAndSet(AntTypeDefinition.java:274)
	at org.apache.tools.ant.AntTypeDefinition.icreate(AntTypeDefinition.java:219)
	at org.apache.tools.ant.AntTypeDefinition.create(AntTypeDefinition.java:206)
	at org.apache.tools.ant.ComponentHelper.createComponent(ComponentHelper.java:285)
	at org.apache.tools.ant.ComponentHelper.createComponent(ComponentHelper.java:263)
	at org.apache.tools.ant.UnknownElement.makeObject(UnknownElement.java:430)
	at org.apache.tools.ant.UnknownElement.maybeConfigure(UnknownElement.java:164)
	at org.apache.tools.ant.Task.perform(Task.java:347)
	at org.apache.tools.ant.Target.execute(Target.java:435)
	at org.apache.tools.ant.Target.performTasks(Target.java:456)
	at org.apache.tools.ant.Project.executeSortedTargets(Project.java:1405)
	at org.apache.tools.ant.Project.executeTarget(Project.java:1376)
	at org.apache.tools.ant.helper.DefaultExecutor.executeTargets(DefaultExecutor.java:41)
	at org.apache.tools.ant.Project.executeTargets(Project.java:1260)
	at org.apache.tools.ant.Main.runBuild(Main.java:853)
	at org.apache.tools.ant.Main.startAnt(Main.java:235)
	at org.apache.tools.ant.launch.Launcher.run(Launcher.java:285)
	at org.apache.tools.ant.launch.Launcher.main(Launcher.java:112)
Caused by: java.lang.ClassNotFoundException: com.google.common.collect.Lists
	at org.apache.tools.ant.AntClassLoader.findClassInComponents(AntClassLoader.java:1388)
	at org.apache.tools.ant.AntClassLoader.findClass(AntClassLoader.java:1337)
	at org.apache.tools.ant.AntClassLoader.loadClass(AntClassLoader.java:1089)
	at java.lang.ClassLoader.loadClass(ClassLoader.java:248)
	... 24 more

Total time: 38 seconds
Build step 'Execute shell' marked build as failure