You are viewing a plain text version of this content. The canonical link for it is here.
Posted to notifications@qpid.apache.org by Apache Jenkins Server <je...@builds.apache.org> on 2018/12/14 11:41:09 UTC

Build failed in Jenkins: Qpid-Broker-J-Test-IBMJDK1.8 #2760

See <https://builds.apache.org/job/Qpid-Broker-J-Test-IBMJDK1.8/2760/display/redirect>

------------------------------------------
[...truncated 208.46 KB...]
[INFO] Executing tasks

main:
     [echo] Qpid Test Profile Properties
     [echo] [profile] java-mms.1-0
     [echo] [profile.broker.version] 1.0
     [echo] [profile.virtualhostnode.type] Memory
     [echo] [profile.virtualhostnode.context.blueprint] {"type":"ProvidedStore","globalAddressDomains":"${qpid.globalAddressDomains}"}
     [echo] [profile.test_receive_timeout] 1000
[INFO] Executed tasks
[INFO] 
[INFO] --- maven-enforcer-plugin:3.0.0-M2:enforce (enforce-maven-version) @ qpid-java-doc ---
[INFO] 
[INFO] --- maven-enforcer-plugin:3.0.0-M2:enforce (enforce-minimum-versions) @ qpid-java-doc ---
[INFO] 
[INFO] --- maven-enforcer-plugin:3.0.0-M2:enforce (enforce-versions-standard-properties) @ qpid-java-doc ---
[INFO] 
[INFO] --- maven-enforcer-plugin:3.0.0-M2:enforce (enforce-enableAmqp0x) @ qpid-java-doc ---
[INFO] 
[INFO] --- jacoco-maven-plugin:0.8.2:prepare-agent (default-prepare-agent) @ qpid-java-doc ---
[INFO] argLine set to -javaagent:/home/jenkins/.m2/repository/org/jacoco/org.jacoco.agent/0.8.2/org.jacoco.agent-0.8.2-runtime.jar=destfile=<https://builds.apache.org/job/Qpid-Broker-J-Test-IBMJDK1.8/ws/doc/target/jacoco.exec> -Xmx512m
[INFO] 
[INFO] --- maven-remote-resources-plugin:1.5:process (process-resource-bundles) @ qpid-java-doc ---
[INFO] 
[INFO] --- maven-site-plugin:3.7.1:attach-descriptor (attach-descriptor) @ qpid-java-doc ---
[INFO] No site descriptor found: nothing to attach.
[INFO] 
[INFO] --- maven-assembly-plugin:3.0.0:single (default) @ qpid-java-doc ---
[INFO] Assemblies have been skipped per configuration of the skipAssembly parameter.
[INFO] 
[INFO] ----------------< org.apache.qpid:qpid-java-doc-broker >----------------
[INFO] Building Apache Qpid Broker-J Docbook 7.1.0-SNAPSHOT             [12/46]
[INFO] --------------------------------[ jar ]---------------------------------
[INFO] 
[INFO] --- maven-clean-plugin:3.1.0:clean (default-clean) @ qpid-java-doc-broker ---
[INFO] 
[INFO] --- buildnumber-maven-plugin:1.4:create (default) @ qpid-java-doc-broker ---
[INFO] Executing: /bin/sh -c cd '<https://builds.apache.org/job/Qpid-Broker-J-Test-IBMJDK1.8/ws/doc/java-broker'> && 'git' 'rev-parse' '--verify' 'HEAD'
[INFO] Working directory: <https://builds.apache.org/job/Qpid-Broker-J-Test-IBMJDK1.8/ws/doc/java-broker>
[INFO] Storing buildNumber: dc4ed694cc6dd90a036d8506e690a06589644cc8 at timestamp: 1544787662105
[WARNING] Cannot get the branch information from the git repository: 
Detecting the current branch failed: fatal: ref HEAD is not a symbolic ref

[INFO] Executing: /bin/sh -c cd '<https://builds.apache.org/job/Qpid-Broker-J-Test-IBMJDK1.8/ws/doc/java-broker'> && 'git' 'rev-parse' '--verify' 'HEAD'
[INFO] Working directory: <https://builds.apache.org/job/Qpid-Broker-J-Test-IBMJDK1.8/ws/doc/java-broker>
[INFO] Storing buildScmBranch: UNKNOWN
[INFO] 
[INFO] --- maven-antrun-plugin:1.8:run (output-test-properties) @ qpid-java-doc-broker ---
[INFO] Executing tasks

main:
     [echo] Qpid Test Profile Properties
     [echo] [profile] java-mms.1-0
     [echo] [profile.broker.version] 1.0
     [echo] [profile.virtualhostnode.type] Memory
     [echo] [profile.virtualhostnode.context.blueprint] {"type":"ProvidedStore","globalAddressDomains":"${qpid.globalAddressDomains}"}
     [echo] [profile.test_receive_timeout] 1000
[INFO] Executed tasks
[INFO] 
[INFO] --- maven-enforcer-plugin:3.0.0-M2:enforce (enforce-maven-version) @ qpid-java-doc-broker ---
[INFO] 
[INFO] --- maven-enforcer-plugin:3.0.0-M2:enforce (enforce-minimum-versions) @ qpid-java-doc-broker ---
[INFO] 
[INFO] --- maven-enforcer-plugin:3.0.0-M2:enforce (enforce-versions-standard-properties) @ qpid-java-doc-broker ---
[INFO] 
[INFO] --- maven-enforcer-plugin:3.0.0-M2:enforce (enforce-enableAmqp0x) @ qpid-java-doc-broker ---
[INFO] 
[INFO] --- jacoco-maven-plugin:0.8.2:prepare-agent (default-prepare-agent) @ qpid-java-doc-broker ---
[INFO] argLine set to -javaagent:/home/jenkins/.m2/repository/org/jacoco/org.jacoco.agent/0.8.2/org.jacoco.agent-0.8.2-runtime.jar=destfile=<https://builds.apache.org/job/Qpid-Broker-J-Test-IBMJDK1.8/ws/doc/java-broker/target/jacoco.exec> -Xmx512m
[INFO] 
[INFO] --- maven-resources-plugin:3.1.0:copy-resources (filter-docbook-sources) @ qpid-java-doc-broker ---
[INFO] Using 'UTF-8' encoding to copy filtered resources.
[INFO] Copying 76 resources
[INFO] 
[INFO] --- maven-remote-resources-plugin:1.5:process (process-resource-bundles) @ qpid-java-doc-broker ---
[INFO] 
[INFO] --- maven-resources-plugin:3.1.0:resources (default-resources) @ qpid-java-doc-broker ---
[INFO] Using 'UTF-8' encoding to copy filtered resources.
[INFO] Copying 76 resources
[INFO] 
[INFO] --- maven-compiler-plugin:3.7.0:compile (default-compile) @ qpid-java-doc-broker ---
[INFO] No sources to compile
[INFO] 
[INFO] --- maven-resources-plugin:3.1.0:testResources (default-testResources) @ qpid-java-doc-broker ---
[INFO] Using 'UTF-8' encoding to copy filtered resources.
[INFO] Copying 76 resources
[INFO] 
[INFO] --- maven-compiler-plugin:3.7.0:testCompile (default-testCompile) @ qpid-java-doc-broker ---
[INFO] No sources to compile
[INFO] 
[INFO] --- maven-surefire-plugin:2.22.0:test (default-test) @ qpid-java-doc-broker ---
[INFO] No tests to run.
[INFO] 
[INFO] --- maven-jar-plugin:3.1.0:jar (default-jar) @ qpid-java-doc-broker ---
[WARNING] JAR will be empty - no content was marked for inclusion!
[INFO] Building jar: <https://builds.apache.org/job/Qpid-Broker-J-Test-IBMJDK1.8/ws/doc/java-broker/target/qpid-java-doc-broker-7.1.0-SNAPSHOT.jar>
[INFO] 
[INFO] --- maven-site-plugin:3.7.1:attach-descriptor (attach-descriptor) @ qpid-java-doc-broker ---
[INFO] Skipping because packaging 'jar' is not pom.
[INFO] 
[INFO] --- maven-assembly-plugin:3.0.0:single (default) @ qpid-java-doc-broker ---
[INFO] Assemblies have been skipped per configuration of the skipAssembly parameter.
[INFO] 
[INFO] --------------< org.apache.qpid:qpid-java-doc-perftests >---------------
[INFO] Building Apache Qpid Broker-J Performance Test Docbook 7.1.0-SNAPSHOT [13/46]
[INFO] --------------------------------[ jar ]---------------------------------
[INFO] 
[INFO] --- maven-clean-plugin:3.1.0:clean (default-clean) @ qpid-java-doc-perftests ---
[INFO] 
[INFO] --- buildnumber-maven-plugin:1.4:create (default) @ qpid-java-doc-perftests ---
[INFO] Executing: /bin/sh -c cd '<https://builds.apache.org/job/Qpid-Broker-J-Test-IBMJDK1.8/ws/doc/java-perftests'> && 'git' 'rev-parse' '--verify' 'HEAD'
[INFO] Working directory: <https://builds.apache.org/job/Qpid-Broker-J-Test-IBMJDK1.8/ws/doc/java-perftests>
[INFO] Storing buildNumber: dc4ed694cc6dd90a036d8506e690a06589644cc8 at timestamp: 1544787662704
[WARNING] Cannot get the branch information from the git repository: 
Detecting the current branch failed: fatal: ref HEAD is not a symbolic ref

[INFO] Executing: /bin/sh -c cd '<https://builds.apache.org/job/Qpid-Broker-J-Test-IBMJDK1.8/ws/doc/java-perftests'> && 'git' 'rev-parse' '--verify' 'HEAD'
[INFO] Working directory: <https://builds.apache.org/job/Qpid-Broker-J-Test-IBMJDK1.8/ws/doc/java-perftests>
[INFO] Storing buildScmBranch: UNKNOWN
[INFO] 
[INFO] --- maven-antrun-plugin:1.8:run (output-test-properties) @ qpid-java-doc-perftests ---
[INFO] Executing tasks

main:
     [echo] Qpid Test Profile Properties
     [echo] [profile] java-mms.1-0
     [echo] [profile.broker.version] 1.0
     [echo] [profile.virtualhostnode.type] Memory
     [echo] [profile.virtualhostnode.context.blueprint] {"type":"ProvidedStore","globalAddressDomains":"${qpid.globalAddressDomains}"}
     [echo] [profile.test_receive_timeout] 1000
[INFO] Executed tasks
[INFO] 
[INFO] --- maven-enforcer-plugin:3.0.0-M2:enforce (enforce-maven-version) @ qpid-java-doc-perftests ---
[INFO] 
[INFO] --- maven-enforcer-plugin:3.0.0-M2:enforce (enforce-minimum-versions) @ qpid-java-doc-perftests ---
[INFO] 
[INFO] --- maven-enforcer-plugin:3.0.0-M2:enforce (enforce-versions-standard-properties) @ qpid-java-doc-perftests ---
[INFO] 
[INFO] --- maven-enforcer-plugin:3.0.0-M2:enforce (enforce-enableAmqp0x) @ qpid-java-doc-perftests ---
[INFO] 
[INFO] --- jacoco-maven-plugin:0.8.2:prepare-agent (default-prepare-agent) @ qpid-java-doc-perftests ---
[INFO] argLine set to -javaagent:/home/jenkins/.m2/repository/org/jacoco/org.jacoco.agent/0.8.2/org.jacoco.agent-0.8.2-runtime.jar=destfile=<https://builds.apache.org/job/Qpid-Broker-J-Test-IBMJDK1.8/ws/doc/java-perftests/target/jacoco.exec> -Xmx512m
[INFO] 
[INFO] --- maven-resources-plugin:3.1.0:copy-resources (filter-docbook-sources) @ qpid-java-doc-perftests ---
[INFO] Using 'UTF-8' encoding to copy filtered resources.
[INFO] Copying 1 resource
[INFO] 
[INFO] --- maven-remote-resources-plugin:1.5:process (process-resource-bundles) @ qpid-java-doc-perftests ---
[INFO] 
[INFO] --- maven-resources-plugin:3.1.0:resources (default-resources) @ qpid-java-doc-perftests ---
[INFO] Using 'UTF-8' encoding to copy filtered resources.
[INFO] Copying 1 resource
[INFO] 
[INFO] --- maven-compiler-plugin:3.7.0:compile (default-compile) @ qpid-java-doc-perftests ---
[INFO] No sources to compile
[INFO] 
[INFO] --- maven-resources-plugin:3.1.0:testResources (default-testResources) @ qpid-java-doc-perftests ---
[INFO] Using 'UTF-8' encoding to copy filtered resources.
[INFO] Copying 1 resource
[INFO] 
[INFO] --- maven-compiler-plugin:3.7.0:testCompile (default-testCompile) @ qpid-java-doc-perftests ---
[INFO] No sources to compile
[INFO] 
[INFO] --- maven-surefire-plugin:2.22.0:test (default-test) @ qpid-java-doc-perftests ---
[INFO] No tests to run.
[INFO] 
[INFO] --- maven-jar-plugin:3.1.0:jar (default-jar) @ qpid-java-doc-perftests ---
[WARNING] JAR will be empty - no content was marked for inclusion!
[INFO] Building jar: <https://builds.apache.org/job/Qpid-Broker-J-Test-IBMJDK1.8/ws/doc/java-perftests/target/qpid-java-doc-perftests-7.1.0-SNAPSHOT.jar>
[INFO] 
[INFO] --- maven-site-plugin:3.7.1:attach-descriptor (attach-descriptor) @ qpid-java-doc-perftests ---
[INFO] Skipping because packaging 'jar' is not pom.
[INFO] 
[INFO] --- maven-assembly-plugin:3.0.0:single (default) @ qpid-java-doc-perftests ---
[INFO] Assemblies have been skipped per configuration of the skipAssembly parameter.
[INFO] ------------------------------------------------------------------------
[INFO] Reactor Summary:
[INFO] 
[INFO] Apache Qpid Broker-J Parent 7.1.0-SNAPSHOT ......... SUCCESS [  5.063 s]
[INFO] Apache Qpid Broker-J Code Generation ............... SUCCESS [  4.137 s]
[INFO] Apache Qpid Broker-J Test Utilities ................ SUCCESS [  2.166 s]
[INFO] Apache Qpid Broker-J Core .......................... FAILURE [01:28 min]
[INFO] Apache Qpid Broker-J LogBack Logging Plug-in ....... SKIPPED
[INFO] Apache Qpid Broker-J Access Control Plug-in ........ SKIPPED
[INFO] Apache Qpid Broker-J AMQP 0-10 Protocol Plug-in .... SKIPPED
[INFO] Apache Qpid Broker-J AMQP 0-8 Protocol Plug-in ..... SKIPPED
[INFO] Apache Qpid Broker-J AMQP 1-0 Protocol Plug-in ..... SKIPPED
[INFO] Apache Qpid Broker-J AMQP 0-8 to 0-10 Message Conversion Plug-in SKIPPED
[INFO] Apache Qpid Broker-J AMQP 0-8 to 1-0 Message Conversion Plug-in SKIPPED
[INFO] Apache Qpid Broker-J AMQP 0-10 to 1-0 Message Conversion Plug-in SKIPPED
[INFO] Apache Qpid Broker-J JDBC Message Store Plug-in .... SKIPPED
[INFO] Apache Qpid Broker-J Derby Message Store Plug-in ... SKIPPED
[INFO] Apache Qpid Broker-J JDBC Message Store Connection Pooling Plug-in SKIPPED
[INFO] Apache Qpid AMQP 1.0 JDBC Link Store Plug-in ....... SKIPPED
[INFO] Apache Qpid Broker-J HTTP Management Plug-in ....... SKIPPED
[INFO] Apache Qpid Broker-J AMQP Management Protocol Plug-in SKIPPED
[INFO] Apache Qpid Broker-J Memory Message Store Plug-in .. SKIPPED
[INFO] Apache Qpid Broker-J WebSocket Plug-in ............. SKIPPED
[INFO] Apache Qpid Broker-J BDB Message Store Plug-in ..... SKIPPED
[INFO] Apache Qpid AMQP 1.0 BDB Link Store Plug-in ........ SKIPPED
[INFO] Apache Qpid Broker-J ............................... SKIPPED
[INFO] Apache Qpid Broker-J Bundles ....................... SKIPPED
[INFO] Apache Qpid Broker-J Tools ......................... SUCCESS [  0.537 s]
[INFO] Apache Qpid Broker-J System Test Parent ............ SUCCESS [  0.190 s]
[INFO] Apache Qpid Broker-J System Test Utils ............. SKIPPED
[INFO] Apache Qpid Broker-J JMS System Tests Core ......... SKIPPED
[INFO] Apache Qpid Broker-J JMS 1.1 System Tests .......... SKIPPED
[INFO] Apache Qpid Broker-J JMS 2.0 System Tests .......... SKIPPED
[INFO] Apache Qpid Broker-J HTTP system tests ............. SKIPPED
[INFO] Apache Qpid Broker-J Protocol Tests Core ........... SUCCESS [  0.996 s]
[INFO] Apache Qpid Protocol Tests for AMQP 0-8,0-9,0-9-1 .. SKIPPED
[INFO] Apache Qpid Protocol Tests for AMQP 0-10 ........... SKIPPED
[INFO] Apache Qpid Protocol Tests for AMQP 1.0 ............ SKIPPED
[INFO] Apache Qpid Broker-J System Tests Spawn Broker Admin SKIPPED
[INFO] Apache Qpid Broker-J End to End Conversion Tests ... SKIPPED
[INFO] Apache Qpid Broker-J Performance Tests ............. SUCCESS [ 28.101 s]
[INFO] Apache Qpid Broker-J Performance Test System Tests . SKIPPED
[INFO] Apache Qpid Broker-J Performance Tests Visualisation JFC SKIPPED
[INFO] Apache Qpid Broker-J BDB Store System Tests ........ SKIPPED
[INFO] Apache Qpid Joram JMS Tests ........................ SUCCESS [  0.700 s]
[INFO] Apache Qpid Broker-J JMS TCK Configuration ......... SUCCESS [  0.389 s]
[INFO] Apache Qpid Broker-J Docbook ....................... SUCCESS [  0.090 s]
[INFO] Apache Qpid Broker-J Docbook ....................... SUCCESS [  0.600 s]
[INFO] Apache Qpid Broker-J Performance Test Docbook 7.1.0-SNAPSHOT SUCCESS [  0.110 s]
[INFO] ------------------------------------------------------------------------
[INFO] BUILD FAILURE
[INFO] ------------------------------------------------------------------------
[INFO] Total time: 02:13 min
[INFO] Finished at: 2018-12-14T11:41:02Z
[INFO] ------------------------------------------------------------------------
[ERROR] Failed to execute goal org.apache.maven.plugins:maven-surefire-plugin:2.22.0:test (default-test) on project qpid-broker-core: There are test failures.
[ERROR] 
[ERROR] Please refer to <https://builds.apache.org/job/Qpid-Broker-J-Test-IBMJDK1.8/2760/artifact/broker-core/target/surefire-reports/java-mms.1-0> for the individual test results.
[ERROR] Please refer to dump files (if any exist) [date]-jvmRun[N].dump, [date].dumpstream and [date]-jvmRun[N].dumpstream.
[ERROR] -> [Help 1]
[ERROR] 
[ERROR] To see the full stack trace of the errors, re-run Maven with the -e switch.
[ERROR] Re-run Maven using the -X switch to enable full debug logging.
[ERROR] 
[ERROR] For more information about the errors and possible solutions, please read the following articles:
[ERROR] [Help 1] http://cwiki.apache.org/confluence/display/MAVEN/MojoFailureException
[ERROR] 
[ERROR] After correcting the problems, you can resume the build with the command
[ERROR]   mvn <goals> -rf :qpid-broker-core
Build step 'Invoke top-level Maven targets' marked build as failure
[locks-and-latches] Releasing all the locks
[locks-and-latches] All the locks released
Archiving artifacts
Recording test results

Jenkins build is back to normal : Qpid-Broker-J-Test-IBMJDK1.8 #2768

Posted by Apache Jenkins Server <je...@builds.apache.org>.
See <https://builds.apache.org/job/Qpid-Broker-J-Test-IBMJDK1.8/2768/display/redirect>


Build failed in Jenkins: Qpid-Broker-J-Test-IBMJDK1.8 #2767

Posted by Apache Jenkins Server <je...@builds.apache.org>.
See <https://builds.apache.org/job/Qpid-Broker-J-Test-IBMJDK1.8/2767/display/redirect>

------------------------------------------
[...truncated 209.68 KB...]
[INFO] Executing tasks

main:
     [echo] Qpid Test Profile Properties
     [echo] [profile] java-mms.1-0
     [echo] [profile.broker.version] 1.0
     [echo] [profile.virtualhostnode.type] Memory
     [echo] [profile.virtualhostnode.context.blueprint] {"type":"ProvidedStore","globalAddressDomains":"${qpid.globalAddressDomains}"}
     [echo] [profile.test_receive_timeout] 1000
[INFO] Executed tasks
[INFO] 
[INFO] --- maven-enforcer-plugin:3.0.0-M2:enforce (enforce-maven-version) @ qpid-java-doc ---
[INFO] 
[INFO] --- maven-enforcer-plugin:3.0.0-M2:enforce (enforce-minimum-versions) @ qpid-java-doc ---
[INFO] 
[INFO] --- maven-enforcer-plugin:3.0.0-M2:enforce (enforce-versions-standard-properties) @ qpid-java-doc ---
[INFO] 
[INFO] --- maven-enforcer-plugin:3.0.0-M2:enforce (enforce-enableAmqp0x) @ qpid-java-doc ---
[INFO] 
[INFO] --- jacoco-maven-plugin:0.8.2:prepare-agent (default-prepare-agent) @ qpid-java-doc ---
[INFO] argLine set to -javaagent:/home/jenkins/.m2/repository/org/jacoco/org.jacoco.agent/0.8.2/org.jacoco.agent-0.8.2-runtime.jar=destfile=<https://builds.apache.org/job/Qpid-Broker-J-Test-IBMJDK1.8/ws/doc/target/jacoco.exec> -Xmx512m
[INFO] 
[INFO] --- maven-remote-resources-plugin:1.5:process (process-resource-bundles) @ qpid-java-doc ---
[INFO] 
[INFO] --- maven-site-plugin:3.7.1:attach-descriptor (attach-descriptor) @ qpid-java-doc ---
[INFO] No site descriptor found: nothing to attach.
[INFO] 
[INFO] --- maven-assembly-plugin:3.0.0:single (default) @ qpid-java-doc ---
[INFO] Assemblies have been skipped per configuration of the skipAssembly parameter.
[INFO] 
[INFO] ----------------< org.apache.qpid:qpid-java-doc-broker >----------------
[INFO] Building Apache Qpid Broker-J Docbook 8.0.0-SNAPSHOT             [12/46]
[INFO] --------------------------------[ jar ]---------------------------------
[INFO] 
[INFO] --- maven-clean-plugin:3.1.0:clean (default-clean) @ qpid-java-doc-broker ---
[INFO] 
[INFO] --- buildnumber-maven-plugin:1.4:create (default) @ qpid-java-doc-broker ---
[INFO] Executing: /bin/sh -c cd '<https://builds.apache.org/job/Qpid-Broker-J-Test-IBMJDK1.8/ws/doc/java-broker'> && 'git' 'rev-parse' '--verify' 'HEAD'
[INFO] Working directory: <https://builds.apache.org/job/Qpid-Broker-J-Test-IBMJDK1.8/ws/doc/java-broker>
[INFO] Storing buildNumber: 11f3052dcf847bed781236dda46fe0b72839fe3b at timestamp: 1545412369360
[WARNING] Cannot get the branch information from the git repository: 
Detecting the current branch failed: fatal: ref HEAD is not a symbolic ref

[INFO] Executing: /bin/sh -c cd '<https://builds.apache.org/job/Qpid-Broker-J-Test-IBMJDK1.8/ws/doc/java-broker'> && 'git' 'rev-parse' '--verify' 'HEAD'
[INFO] Working directory: <https://builds.apache.org/job/Qpid-Broker-J-Test-IBMJDK1.8/ws/doc/java-broker>
[INFO] Storing buildScmBranch: UNKNOWN
[INFO] 
[INFO] --- maven-antrun-plugin:1.8:run (output-test-properties) @ qpid-java-doc-broker ---
[INFO] Executing tasks

main:
     [echo] Qpid Test Profile Properties
     [echo] [profile] java-mms.1-0
     [echo] [profile.broker.version] 1.0
     [echo] [profile.virtualhostnode.type] Memory
     [echo] [profile.virtualhostnode.context.blueprint] {"type":"ProvidedStore","globalAddressDomains":"${qpid.globalAddressDomains}"}
     [echo] [profile.test_receive_timeout] 1000
[INFO] Executed tasks
[INFO] 
[INFO] --- maven-enforcer-plugin:3.0.0-M2:enforce (enforce-maven-version) @ qpid-java-doc-broker ---
[INFO] 
[INFO] --- maven-enforcer-plugin:3.0.0-M2:enforce (enforce-minimum-versions) @ qpid-java-doc-broker ---
[INFO] 
[INFO] --- maven-enforcer-plugin:3.0.0-M2:enforce (enforce-versions-standard-properties) @ qpid-java-doc-broker ---
[INFO] 
[INFO] --- maven-enforcer-plugin:3.0.0-M2:enforce (enforce-enableAmqp0x) @ qpid-java-doc-broker ---
[INFO] 
[INFO] --- jacoco-maven-plugin:0.8.2:prepare-agent (default-prepare-agent) @ qpid-java-doc-broker ---
[INFO] argLine set to -javaagent:/home/jenkins/.m2/repository/org/jacoco/org.jacoco.agent/0.8.2/org.jacoco.agent-0.8.2-runtime.jar=destfile=<https://builds.apache.org/job/Qpid-Broker-J-Test-IBMJDK1.8/ws/doc/java-broker/target/jacoco.exec> -Xmx512m
[INFO] 
[INFO] --- maven-resources-plugin:3.1.0:copy-resources (filter-docbook-sources) @ qpid-java-doc-broker ---
[INFO] Using 'UTF-8' encoding to copy filtered resources.
[INFO] Copying 76 resources
[INFO] 
[INFO] --- maven-remote-resources-plugin:1.5:process (process-resource-bundles) @ qpid-java-doc-broker ---
[INFO] 
[INFO] --- maven-resources-plugin:3.1.0:resources (default-resources) @ qpid-java-doc-broker ---
[INFO] Using 'UTF-8' encoding to copy filtered resources.
[INFO] Copying 76 resources
[INFO] 
[INFO] --- maven-compiler-plugin:3.7.0:compile (default-compile) @ qpid-java-doc-broker ---
[INFO] No sources to compile
[INFO] 
[INFO] --- maven-resources-plugin:3.1.0:testResources (default-testResources) @ qpid-java-doc-broker ---
[INFO] Using 'UTF-8' encoding to copy filtered resources.
[INFO] Copying 76 resources
[INFO] 
[INFO] --- maven-compiler-plugin:3.7.0:testCompile (default-testCompile) @ qpid-java-doc-broker ---
[INFO] No sources to compile
[INFO] 
[INFO] --- maven-surefire-plugin:2.22.0:test (default-test) @ qpid-java-doc-broker ---
[INFO] No tests to run.
[INFO] 
[INFO] --- maven-jar-plugin:3.1.0:jar (default-jar) @ qpid-java-doc-broker ---
[WARNING] JAR will be empty - no content was marked for inclusion!
[INFO] Building jar: <https://builds.apache.org/job/Qpid-Broker-J-Test-IBMJDK1.8/ws/doc/java-broker/target/qpid-java-doc-broker-8.0.0-SNAPSHOT.jar>
[INFO] 
[INFO] --- maven-site-plugin:3.7.1:attach-descriptor (attach-descriptor) @ qpid-java-doc-broker ---
[INFO] Skipping because packaging 'jar' is not pom.
[INFO] 
[INFO] --- maven-assembly-plugin:3.0.0:single (default) @ qpid-java-doc-broker ---
[INFO] Assemblies have been skipped per configuration of the skipAssembly parameter.
[INFO] 
[INFO] --------------< org.apache.qpid:qpid-java-doc-perftests >---------------
[INFO] Building Apache Qpid Broker-J Performance Test Docbook 8.0.0-SNAPSHOT [13/46]
[INFO] --------------------------------[ jar ]---------------------------------
[INFO] 
[INFO] --- maven-clean-plugin:3.1.0:clean (default-clean) @ qpid-java-doc-perftests ---
[INFO] 
[INFO] --- buildnumber-maven-plugin:1.4:create (default) @ qpid-java-doc-perftests ---
[INFO] Executing: /bin/sh -c cd '<https://builds.apache.org/job/Qpid-Broker-J-Test-IBMJDK1.8/ws/doc/java-perftests'> && 'git' 'rev-parse' '--verify' 'HEAD'
[INFO] Working directory: <https://builds.apache.org/job/Qpid-Broker-J-Test-IBMJDK1.8/ws/doc/java-perftests>
[INFO] Storing buildNumber: 11f3052dcf847bed781236dda46fe0b72839fe3b at timestamp: 1545412369969
[WARNING] Cannot get the branch information from the git repository: 
Detecting the current branch failed: fatal: ref HEAD is not a symbolic ref

[INFO] Executing: /bin/sh -c cd '<https://builds.apache.org/job/Qpid-Broker-J-Test-IBMJDK1.8/ws/doc/java-perftests'> && 'git' 'rev-parse' '--verify' 'HEAD'
[INFO] Working directory: <https://builds.apache.org/job/Qpid-Broker-J-Test-IBMJDK1.8/ws/doc/java-perftests>
[INFO] Storing buildScmBranch: UNKNOWN
[INFO] 
[INFO] --- maven-antrun-plugin:1.8:run (output-test-properties) @ qpid-java-doc-perftests ---
[INFO] Executing tasks

main:
     [echo] Qpid Test Profile Properties
     [echo] [profile] java-mms.1-0
     [echo] [profile.broker.version] 1.0
     [echo] [profile.virtualhostnode.type] Memory
     [echo] [profile.virtualhostnode.context.blueprint] {"type":"ProvidedStore","globalAddressDomains":"${qpid.globalAddressDomains}"}
     [echo] [profile.test_receive_timeout] 1000
[INFO] Executed tasks
[INFO] 
[INFO] --- maven-enforcer-plugin:3.0.0-M2:enforce (enforce-maven-version) @ qpid-java-doc-perftests ---
[INFO] 
[INFO] --- maven-enforcer-plugin:3.0.0-M2:enforce (enforce-minimum-versions) @ qpid-java-doc-perftests ---
[INFO] 
[INFO] --- maven-enforcer-plugin:3.0.0-M2:enforce (enforce-versions-standard-properties) @ qpid-java-doc-perftests ---
[INFO] 
[INFO] --- maven-enforcer-plugin:3.0.0-M2:enforce (enforce-enableAmqp0x) @ qpid-java-doc-perftests ---
[INFO] 
[INFO] --- jacoco-maven-plugin:0.8.2:prepare-agent (default-prepare-agent) @ qpid-java-doc-perftests ---
[INFO] argLine set to -javaagent:/home/jenkins/.m2/repository/org/jacoco/org.jacoco.agent/0.8.2/org.jacoco.agent-0.8.2-runtime.jar=destfile=<https://builds.apache.org/job/Qpid-Broker-J-Test-IBMJDK1.8/ws/doc/java-perftests/target/jacoco.exec> -Xmx512m
[INFO] 
[INFO] --- maven-resources-plugin:3.1.0:copy-resources (filter-docbook-sources) @ qpid-java-doc-perftests ---
[INFO] Using 'UTF-8' encoding to copy filtered resources.
[INFO] Copying 1 resource
[INFO] 
[INFO] --- maven-remote-resources-plugin:1.5:process (process-resource-bundles) @ qpid-java-doc-perftests ---
[INFO] 
[INFO] --- maven-resources-plugin:3.1.0:resources (default-resources) @ qpid-java-doc-perftests ---
[INFO] Using 'UTF-8' encoding to copy filtered resources.
[INFO] Copying 1 resource
[INFO] 
[INFO] --- maven-compiler-plugin:3.7.0:compile (default-compile) @ qpid-java-doc-perftests ---
[INFO] No sources to compile
[INFO] 
[INFO] --- maven-resources-plugin:3.1.0:testResources (default-testResources) @ qpid-java-doc-perftests ---
[INFO] Using 'UTF-8' encoding to copy filtered resources.
[INFO] Copying 1 resource
[INFO] 
[INFO] --- maven-compiler-plugin:3.7.0:testCompile (default-testCompile) @ qpid-java-doc-perftests ---
[INFO] No sources to compile
[INFO] 
[INFO] --- maven-surefire-plugin:2.22.0:test (default-test) @ qpid-java-doc-perftests ---
[INFO] No tests to run.
[INFO] 
[INFO] --- maven-jar-plugin:3.1.0:jar (default-jar) @ qpid-java-doc-perftests ---
[WARNING] JAR will be empty - no content was marked for inclusion!
[INFO] Building jar: <https://builds.apache.org/job/Qpid-Broker-J-Test-IBMJDK1.8/ws/doc/java-perftests/target/qpid-java-doc-perftests-8.0.0-SNAPSHOT.jar>
[INFO] 
[INFO] --- maven-site-plugin:3.7.1:attach-descriptor (attach-descriptor) @ qpid-java-doc-perftests ---
[INFO] Skipping because packaging 'jar' is not pom.
[INFO] 
[INFO] --- maven-assembly-plugin:3.0.0:single (default) @ qpid-java-doc-perftests ---
[INFO] Assemblies have been skipped per configuration of the skipAssembly parameter.
[INFO] ------------------------------------------------------------------------
[INFO] Reactor Summary:
[INFO] 
[INFO] Apache Qpid Broker-J Parent 8.0.0-SNAPSHOT ......... SUCCESS [  6.115 s]
[INFO] Apache Qpid Broker-J Code Generation ............... SUCCESS [  3.863 s]
[INFO] Apache Qpid Broker-J Test Utilities ................ SUCCESS [  0.969 s]
[INFO] Apache Qpid Broker-J Core .......................... FAILURE [01:28 min]
[INFO] Apache Qpid Broker-J LogBack Logging Plug-in ....... SKIPPED
[INFO] Apache Qpid Broker-J Access Control Plug-in ........ SKIPPED
[INFO] Apache Qpid Broker-J AMQP 0-10 Protocol Plug-in .... SKIPPED
[INFO] Apache Qpid Broker-J AMQP 0-8 Protocol Plug-in ..... SKIPPED
[INFO] Apache Qpid Broker-J AMQP 1-0 Protocol Plug-in ..... SKIPPED
[INFO] Apache Qpid Broker-J AMQP 0-8 to 0-10 Message Conversion Plug-in SKIPPED
[INFO] Apache Qpid Broker-J AMQP 0-8 to 1-0 Message Conversion Plug-in SKIPPED
[INFO] Apache Qpid Broker-J AMQP 0-10 to 1-0 Message Conversion Plug-in SKIPPED
[INFO] Apache Qpid Broker-J JDBC Message Store Plug-in .... SKIPPED
[INFO] Apache Qpid Broker-J Derby Message Store Plug-in ... SKIPPED
[INFO] Apache Qpid Broker-J JDBC Message Store Connection Pooling Plug-in SKIPPED
[INFO] Apache Qpid AMQP 1.0 JDBC Link Store Plug-in ....... SKIPPED
[INFO] Apache Qpid Broker-J HTTP Management Plug-in ....... SKIPPED
[INFO] Apache Qpid Broker-J AMQP Management Protocol Plug-in SKIPPED
[INFO] Apache Qpid Broker-J Memory Message Store Plug-in .. SKIPPED
[INFO] Apache Qpid Broker-J WebSocket Plug-in ............. SKIPPED
[INFO] Apache Qpid Broker-J BDB Message Store Plug-in ..... SKIPPED
[INFO] Apache Qpid AMQP 1.0 BDB Link Store Plug-in ........ SKIPPED
[INFO] Apache Qpid Broker-J ............................... SKIPPED
[INFO] Apache Qpid Broker-J Bundles ....................... SKIPPED
[INFO] Apache Qpid Broker-J Tools ......................... SUCCESS [  0.485 s]
[INFO] Apache Qpid Broker-J System Test Parent ............ SUCCESS [  0.230 s]
[INFO] Apache Qpid Broker-J System Test Utils ............. SKIPPED
[INFO] Apache Qpid Broker-J JMS System Tests Core ......... SKIPPED
[INFO] Apache Qpid Broker-J JMS 1.1 System Tests .......... SKIPPED
[INFO] Apache Qpid Broker-J JMS 2.0 System Tests .......... SKIPPED
[INFO] Apache Qpid Broker-J HTTP system tests ............. SKIPPED
[INFO] Apache Qpid Broker-J Protocol Tests Core ........... SUCCESS [  0.934 s]
[INFO] Apache Qpid Protocol Tests for AMQP 0-8,0-9,0-9-1 .. SKIPPED
[INFO] Apache Qpid Protocol Tests for AMQP 0-10 ........... SKIPPED
[INFO] Apache Qpid Protocol Tests for AMQP 1.0 ............ SKIPPED
[INFO] Apache Qpid Broker-J System Tests Spawn Broker Admin SKIPPED
[INFO] Apache Qpid Broker-J End to End Conversion Tests ... SKIPPED
[INFO] Apache Qpid Broker-J Performance Tests ............. SUCCESS [ 30.622 s]
[INFO] Apache Qpid Broker-J Performance Test System Tests . SKIPPED
[INFO] Apache Qpid Broker-J Performance Tests Visualisation JFC SKIPPED
[INFO] Apache Qpid Broker-J BDB Store System Tests ........ SKIPPED
[INFO] Apache Qpid Joram JMS Tests ........................ SUCCESS [  0.591 s]
[INFO] Apache Qpid Broker-J JMS TCK Configuration ......... SUCCESS [  0.373 s]
[INFO] Apache Qpid Broker-J Docbook ....................... SUCCESS [  0.091 s]
[INFO] Apache Qpid Broker-J Docbook ....................... SUCCESS [  0.609 s]
[INFO] Apache Qpid Broker-J Performance Test Docbook 8.0.0-SNAPSHOT SUCCESS [  0.127 s]
[INFO] ------------------------------------------------------------------------
[INFO] BUILD FAILURE
[INFO] ------------------------------------------------------------------------
[INFO] Total time: 02:15 min
[INFO] Finished at: 2018-12-21T17:12:50Z
[INFO] ------------------------------------------------------------------------
[ERROR] Failed to execute goal org.apache.maven.plugins:maven-surefire-plugin:2.22.0:test (default-test) on project qpid-broker-core: There are test failures.
[ERROR] 
[ERROR] Please refer to <https://builds.apache.org/job/Qpid-Broker-J-Test-IBMJDK1.8/2767/artifact/broker-core/target/surefire-reports/java-mms.1-0> for the individual test results.
[ERROR] Please refer to dump files (if any exist) [date]-jvmRun[N].dump, [date].dumpstream and [date]-jvmRun[N].dumpstream.
[ERROR] -> [Help 1]
[ERROR] 
[ERROR] To see the full stack trace of the errors, re-run Maven with the -e switch.
[ERROR] Re-run Maven using the -X switch to enable full debug logging.
[ERROR] 
[ERROR] For more information about the errors and possible solutions, please read the following articles:
[ERROR] [Help 1] http://cwiki.apache.org/confluence/display/MAVEN/MojoFailureException
[ERROR] 
[ERROR] After correcting the problems, you can resume the build with the command
[ERROR]   mvn <goals> -rf :qpid-broker-core
Build step 'Invoke top-level Maven targets' marked build as failure
[locks-and-latches] Releasing all the locks
[locks-and-latches] All the locks released
Archiving artifacts
Recording test results

Build failed in Jenkins: Qpid-Broker-J-Test-IBMJDK1.8 #2766

Posted by Apache Jenkins Server <je...@builds.apache.org>.
See <https://builds.apache.org/job/Qpid-Broker-J-Test-IBMJDK1.8/2766/display/redirect?page=changes>

Changes:

[orudyy] QPID-8259: [Broker-J] REST requests returning inherited context should

------------------------------------------
[...truncated 209.44 KB...]
[INFO] Executing tasks

main:
     [echo] Qpid Test Profile Properties
     [echo] [profile] java-mms.1-0
     [echo] [profile.broker.version] 1.0
     [echo] [profile.virtualhostnode.type] Memory
     [echo] [profile.virtualhostnode.context.blueprint] {"type":"ProvidedStore","globalAddressDomains":"${qpid.globalAddressDomains}"}
     [echo] [profile.test_receive_timeout] 1000
[INFO] Executed tasks
[INFO] 
[INFO] --- maven-enforcer-plugin:3.0.0-M2:enforce (enforce-maven-version) @ qpid-java-doc ---
[INFO] 
[INFO] --- maven-enforcer-plugin:3.0.0-M2:enforce (enforce-minimum-versions) @ qpid-java-doc ---
[INFO] 
[INFO] --- maven-enforcer-plugin:3.0.0-M2:enforce (enforce-versions-standard-properties) @ qpid-java-doc ---
[INFO] 
[INFO] --- maven-enforcer-plugin:3.0.0-M2:enforce (enforce-enableAmqp0x) @ qpid-java-doc ---
[INFO] 
[INFO] --- jacoco-maven-plugin:0.8.2:prepare-agent (default-prepare-agent) @ qpid-java-doc ---
[INFO] argLine set to -javaagent:/home/jenkins/.m2/repository/org/jacoco/org.jacoco.agent/0.8.2/org.jacoco.agent-0.8.2-runtime.jar=destfile=<https://builds.apache.org/job/Qpid-Broker-J-Test-IBMJDK1.8/ws/doc/target/jacoco.exec> -Xmx512m
[INFO] 
[INFO] --- maven-remote-resources-plugin:1.5:process (process-resource-bundles) @ qpid-java-doc ---
[INFO] 
[INFO] --- maven-site-plugin:3.7.1:attach-descriptor (attach-descriptor) @ qpid-java-doc ---
[INFO] No site descriptor found: nothing to attach.
[INFO] 
[INFO] --- maven-assembly-plugin:3.0.0:single (default) @ qpid-java-doc ---
[INFO] Assemblies have been skipped per configuration of the skipAssembly parameter.
[INFO] 
[INFO] ----------------< org.apache.qpid:qpid-java-doc-broker >----------------
[INFO] Building Apache Qpid Broker-J Docbook 8.0.0-SNAPSHOT             [12/46]
[INFO] --------------------------------[ jar ]---------------------------------
[INFO] 
[INFO] --- maven-clean-plugin:3.1.0:clean (default-clean) @ qpid-java-doc-broker ---
[INFO] 
[INFO] --- buildnumber-maven-plugin:1.4:create (default) @ qpid-java-doc-broker ---
[INFO] Executing: /bin/sh -c cd '<https://builds.apache.org/job/Qpid-Broker-J-Test-IBMJDK1.8/ws/doc/java-broker'> && 'git' 'rev-parse' '--verify' 'HEAD'
[INFO] Working directory: <https://builds.apache.org/job/Qpid-Broker-J-Test-IBMJDK1.8/ws/doc/java-broker>
[INFO] Storing buildNumber: 11f3052dcf847bed781236dda46fe0b72839fe3b at timestamp: 1545406571620
[WARNING] Cannot get the branch information from the git repository: 
Detecting the current branch failed: fatal: ref HEAD is not a symbolic ref

[INFO] Executing: /bin/sh -c cd '<https://builds.apache.org/job/Qpid-Broker-J-Test-IBMJDK1.8/ws/doc/java-broker'> && 'git' 'rev-parse' '--verify' 'HEAD'
[INFO] Working directory: <https://builds.apache.org/job/Qpid-Broker-J-Test-IBMJDK1.8/ws/doc/java-broker>
[INFO] Storing buildScmBranch: UNKNOWN
[INFO] 
[INFO] --- maven-antrun-plugin:1.8:run (output-test-properties) @ qpid-java-doc-broker ---
[INFO] Executing tasks

main:
     [echo] Qpid Test Profile Properties
     [echo] [profile] java-mms.1-0
     [echo] [profile.broker.version] 1.0
     [echo] [profile.virtualhostnode.type] Memory
     [echo] [profile.virtualhostnode.context.blueprint] {"type":"ProvidedStore","globalAddressDomains":"${qpid.globalAddressDomains}"}
     [echo] [profile.test_receive_timeout] 1000
[INFO] Executed tasks
[INFO] 
[INFO] --- maven-enforcer-plugin:3.0.0-M2:enforce (enforce-maven-version) @ qpid-java-doc-broker ---
[INFO] 
[INFO] --- maven-enforcer-plugin:3.0.0-M2:enforce (enforce-minimum-versions) @ qpid-java-doc-broker ---
[INFO] 
[INFO] --- maven-enforcer-plugin:3.0.0-M2:enforce (enforce-versions-standard-properties) @ qpid-java-doc-broker ---
[INFO] 
[INFO] --- maven-enforcer-plugin:3.0.0-M2:enforce (enforce-enableAmqp0x) @ qpid-java-doc-broker ---
[INFO] 
[INFO] --- jacoco-maven-plugin:0.8.2:prepare-agent (default-prepare-agent) @ qpid-java-doc-broker ---
[INFO] argLine set to -javaagent:/home/jenkins/.m2/repository/org/jacoco/org.jacoco.agent/0.8.2/org.jacoco.agent-0.8.2-runtime.jar=destfile=<https://builds.apache.org/job/Qpid-Broker-J-Test-IBMJDK1.8/ws/doc/java-broker/target/jacoco.exec> -Xmx512m
[INFO] 
[INFO] --- maven-resources-plugin:3.1.0:copy-resources (filter-docbook-sources) @ qpid-java-doc-broker ---
[INFO] Using 'UTF-8' encoding to copy filtered resources.
[INFO] Copying 76 resources
[INFO] 
[INFO] --- maven-remote-resources-plugin:1.5:process (process-resource-bundles) @ qpid-java-doc-broker ---
[INFO] 
[INFO] --- maven-resources-plugin:3.1.0:resources (default-resources) @ qpid-java-doc-broker ---
[INFO] Using 'UTF-8' encoding to copy filtered resources.
[INFO] Copying 76 resources
[INFO] 
[INFO] --- maven-compiler-plugin:3.7.0:compile (default-compile) @ qpid-java-doc-broker ---
[INFO] No sources to compile
[INFO] 
[INFO] --- maven-resources-plugin:3.1.0:testResources (default-testResources) @ qpid-java-doc-broker ---
[INFO] Using 'UTF-8' encoding to copy filtered resources.
[INFO] Copying 76 resources
[INFO] 
[INFO] --- maven-compiler-plugin:3.7.0:testCompile (default-testCompile) @ qpid-java-doc-broker ---
[INFO] No sources to compile
[INFO] 
[INFO] --- maven-surefire-plugin:2.22.0:test (default-test) @ qpid-java-doc-broker ---
[INFO] No tests to run.
[INFO] 
[INFO] --- maven-jar-plugin:3.1.0:jar (default-jar) @ qpid-java-doc-broker ---
[WARNING] JAR will be empty - no content was marked for inclusion!
[INFO] Building jar: <https://builds.apache.org/job/Qpid-Broker-J-Test-IBMJDK1.8/ws/doc/java-broker/target/qpid-java-doc-broker-8.0.0-SNAPSHOT.jar>
[INFO] 
[INFO] --- maven-site-plugin:3.7.1:attach-descriptor (attach-descriptor) @ qpid-java-doc-broker ---
[INFO] Skipping because packaging 'jar' is not pom.
[INFO] 
[INFO] --- maven-assembly-plugin:3.0.0:single (default) @ qpid-java-doc-broker ---
[INFO] Assemblies have been skipped per configuration of the skipAssembly parameter.
[INFO] 
[INFO] --------------< org.apache.qpid:qpid-java-doc-perftests >---------------
[INFO] Building Apache Qpid Broker-J Performance Test Docbook 8.0.0-SNAPSHOT [13/46]
[INFO] --------------------------------[ jar ]---------------------------------
[INFO] 
[INFO] --- maven-clean-plugin:3.1.0:clean (default-clean) @ qpid-java-doc-perftests ---
[INFO] 
[INFO] --- buildnumber-maven-plugin:1.4:create (default) @ qpid-java-doc-perftests ---
[INFO] Executing: /bin/sh -c cd '<https://builds.apache.org/job/Qpid-Broker-J-Test-IBMJDK1.8/ws/doc/java-perftests'> && 'git' 'rev-parse' '--verify' 'HEAD'
[INFO] Working directory: <https://builds.apache.org/job/Qpid-Broker-J-Test-IBMJDK1.8/ws/doc/java-perftests>
[INFO] Storing buildNumber: 11f3052dcf847bed781236dda46fe0b72839fe3b at timestamp: 1545406572403
[WARNING] Cannot get the branch information from the git repository: 
Detecting the current branch failed: fatal: ref HEAD is not a symbolic ref

[INFO] Executing: /bin/sh -c cd '<https://builds.apache.org/job/Qpid-Broker-J-Test-IBMJDK1.8/ws/doc/java-perftests'> && 'git' 'rev-parse' '--verify' 'HEAD'
[INFO] Working directory: <https://builds.apache.org/job/Qpid-Broker-J-Test-IBMJDK1.8/ws/doc/java-perftests>
[INFO] Storing buildScmBranch: UNKNOWN
[INFO] 
[INFO] --- maven-antrun-plugin:1.8:run (output-test-properties) @ qpid-java-doc-perftests ---
[INFO] Executing tasks

main:
     [echo] Qpid Test Profile Properties
     [echo] [profile] java-mms.1-0
     [echo] [profile.broker.version] 1.0
     [echo] [profile.virtualhostnode.type] Memory
     [echo] [profile.virtualhostnode.context.blueprint] {"type":"ProvidedStore","globalAddressDomains":"${qpid.globalAddressDomains}"}
     [echo] [profile.test_receive_timeout] 1000
[INFO] Executed tasks
[INFO] 
[INFO] --- maven-enforcer-plugin:3.0.0-M2:enforce (enforce-maven-version) @ qpid-java-doc-perftests ---
[INFO] 
[INFO] --- maven-enforcer-plugin:3.0.0-M2:enforce (enforce-minimum-versions) @ qpid-java-doc-perftests ---
[INFO] 
[INFO] --- maven-enforcer-plugin:3.0.0-M2:enforce (enforce-versions-standard-properties) @ qpid-java-doc-perftests ---
[INFO] 
[INFO] --- maven-enforcer-plugin:3.0.0-M2:enforce (enforce-enableAmqp0x) @ qpid-java-doc-perftests ---
[INFO] 
[INFO] --- jacoco-maven-plugin:0.8.2:prepare-agent (default-prepare-agent) @ qpid-java-doc-perftests ---
[INFO] argLine set to -javaagent:/home/jenkins/.m2/repository/org/jacoco/org.jacoco.agent/0.8.2/org.jacoco.agent-0.8.2-runtime.jar=destfile=<https://builds.apache.org/job/Qpid-Broker-J-Test-IBMJDK1.8/ws/doc/java-perftests/target/jacoco.exec> -Xmx512m
[INFO] 
[INFO] --- maven-resources-plugin:3.1.0:copy-resources (filter-docbook-sources) @ qpid-java-doc-perftests ---
[INFO] Using 'UTF-8' encoding to copy filtered resources.
[INFO] Copying 1 resource
[INFO] 
[INFO] --- maven-remote-resources-plugin:1.5:process (process-resource-bundles) @ qpid-java-doc-perftests ---
[INFO] 
[INFO] --- maven-resources-plugin:3.1.0:resources (default-resources) @ qpid-java-doc-perftests ---
[INFO] Using 'UTF-8' encoding to copy filtered resources.
[INFO] Copying 1 resource
[INFO] 
[INFO] --- maven-compiler-plugin:3.7.0:compile (default-compile) @ qpid-java-doc-perftests ---
[INFO] No sources to compile
[INFO] 
[INFO] --- maven-resources-plugin:3.1.0:testResources (default-testResources) @ qpid-java-doc-perftests ---
[INFO] Using 'UTF-8' encoding to copy filtered resources.
[INFO] Copying 1 resource
[INFO] 
[INFO] --- maven-compiler-plugin:3.7.0:testCompile (default-testCompile) @ qpid-java-doc-perftests ---
[INFO] No sources to compile
[INFO] 
[INFO] --- maven-surefire-plugin:2.22.0:test (default-test) @ qpid-java-doc-perftests ---
[INFO] No tests to run.
[INFO] 
[INFO] --- maven-jar-plugin:3.1.0:jar (default-jar) @ qpid-java-doc-perftests ---
[WARNING] JAR will be empty - no content was marked for inclusion!
[INFO] Building jar: <https://builds.apache.org/job/Qpid-Broker-J-Test-IBMJDK1.8/ws/doc/java-perftests/target/qpid-java-doc-perftests-8.0.0-SNAPSHOT.jar>
[INFO] 
[INFO] --- maven-site-plugin:3.7.1:attach-descriptor (attach-descriptor) @ qpid-java-doc-perftests ---
[INFO] Skipping because packaging 'jar' is not pom.
[INFO] 
[INFO] --- maven-assembly-plugin:3.0.0:single (default) @ qpid-java-doc-perftests ---
[INFO] Assemblies have been skipped per configuration of the skipAssembly parameter.
[INFO] ------------------------------------------------------------------------
[INFO] Reactor Summary:
[INFO] 
[INFO] Apache Qpid Broker-J Parent 8.0.0-SNAPSHOT ......... SUCCESS [  5.387 s]
[INFO] Apache Qpid Broker-J Code Generation ............... SUCCESS [  4.056 s]
[INFO] Apache Qpid Broker-J Test Utilities ................ SUCCESS [  1.285 s]
[INFO] Apache Qpid Broker-J Core .......................... FAILURE [01:22 min]
[INFO] Apache Qpid Broker-J LogBack Logging Plug-in ....... SKIPPED
[INFO] Apache Qpid Broker-J Access Control Plug-in ........ SKIPPED
[INFO] Apache Qpid Broker-J AMQP 0-10 Protocol Plug-in .... SKIPPED
[INFO] Apache Qpid Broker-J AMQP 0-8 Protocol Plug-in ..... SKIPPED
[INFO] Apache Qpid Broker-J AMQP 1-0 Protocol Plug-in ..... SKIPPED
[INFO] Apache Qpid Broker-J AMQP 0-8 to 0-10 Message Conversion Plug-in SKIPPED
[INFO] Apache Qpid Broker-J AMQP 0-8 to 1-0 Message Conversion Plug-in SKIPPED
[INFO] Apache Qpid Broker-J AMQP 0-10 to 1-0 Message Conversion Plug-in SKIPPED
[INFO] Apache Qpid Broker-J JDBC Message Store Plug-in .... SKIPPED
[INFO] Apache Qpid Broker-J Derby Message Store Plug-in ... SKIPPED
[INFO] Apache Qpid Broker-J JDBC Message Store Connection Pooling Plug-in SKIPPED
[INFO] Apache Qpid AMQP 1.0 JDBC Link Store Plug-in ....... SKIPPED
[INFO] Apache Qpid Broker-J HTTP Management Plug-in ....... SKIPPED
[INFO] Apache Qpid Broker-J AMQP Management Protocol Plug-in SKIPPED
[INFO] Apache Qpid Broker-J Memory Message Store Plug-in .. SKIPPED
[INFO] Apache Qpid Broker-J WebSocket Plug-in ............. SKIPPED
[INFO] Apache Qpid Broker-J BDB Message Store Plug-in ..... SKIPPED
[INFO] Apache Qpid AMQP 1.0 BDB Link Store Plug-in ........ SKIPPED
[INFO] Apache Qpid Broker-J ............................... SKIPPED
[INFO] Apache Qpid Broker-J Bundles ....................... SKIPPED
[INFO] Apache Qpid Broker-J Tools ......................... SUCCESS [  0.506 s]
[INFO] Apache Qpid Broker-J System Test Parent ............ SUCCESS [  0.220 s]
[INFO] Apache Qpid Broker-J System Test Utils ............. SKIPPED
[INFO] Apache Qpid Broker-J JMS System Tests Core ......... SKIPPED
[INFO] Apache Qpid Broker-J JMS 1.1 System Tests .......... SKIPPED
[INFO] Apache Qpid Broker-J JMS 2.0 System Tests .......... SKIPPED
[INFO] Apache Qpid Broker-J HTTP system tests ............. SKIPPED
[INFO] Apache Qpid Broker-J Protocol Tests Core ........... SUCCESS [  0.846 s]
[INFO] Apache Qpid Protocol Tests for AMQP 0-8,0-9,0-9-1 .. SKIPPED
[INFO] Apache Qpid Protocol Tests for AMQP 0-10 ........... SKIPPED
[INFO] Apache Qpid Protocol Tests for AMQP 1.0 ............ SKIPPED
[INFO] Apache Qpid Broker-J System Tests Spawn Broker Admin SKIPPED
[INFO] Apache Qpid Broker-J End to End Conversion Tests ... SKIPPED
[INFO] Apache Qpid Broker-J Performance Tests ............. SUCCESS [ 27.358 s]
[INFO] Apache Qpid Broker-J Performance Test System Tests . SKIPPED
[INFO] Apache Qpid Broker-J Performance Tests Visualisation JFC SKIPPED
[INFO] Apache Qpid Broker-J BDB Store System Tests ........ SKIPPED
[INFO] Apache Qpid Joram JMS Tests ........................ SUCCESS [  0.567 s]
[INFO] Apache Qpid Broker-J JMS TCK Configuration ......... SUCCESS [  0.362 s]
[INFO] Apache Qpid Broker-J Docbook ....................... SUCCESS [  0.086 s]
[INFO] Apache Qpid Broker-J Docbook ....................... SUCCESS [  0.778 s]
[INFO] Apache Qpid Broker-J Performance Test Docbook 8.0.0-SNAPSHOT SUCCESS [  0.128 s]
[INFO] ------------------------------------------------------------------------
[INFO] BUILD FAILURE
[INFO] ------------------------------------------------------------------------
[INFO] Total time: 02:06 min
[INFO] Finished at: 2018-12-21T15:36:12Z
[INFO] ------------------------------------------------------------------------
[ERROR] Failed to execute goal org.apache.maven.plugins:maven-surefire-plugin:2.22.0:test (default-test) on project qpid-broker-core: There are test failures.
[ERROR] 
[ERROR] Please refer to <https://builds.apache.org/job/Qpid-Broker-J-Test-IBMJDK1.8/2766/artifact/broker-core/target/surefire-reports/java-mms.1-0> for the individual test results.
[ERROR] Please refer to dump files (if any exist) [date]-jvmRun[N].dump, [date].dumpstream and [date]-jvmRun[N].dumpstream.
[ERROR] -> [Help 1]
[ERROR] 
[ERROR] To see the full stack trace of the errors, re-run Maven with the -e switch.
[ERROR] Re-run Maven using the -X switch to enable full debug logging.
[ERROR] 
[ERROR] For more information about the errors and possible solutions, please read the following articles:
[ERROR] [Help 1] http://cwiki.apache.org/confluence/display/MAVEN/MojoFailureException
[ERROR] 
[ERROR] After correcting the problems, you can resume the build with the command
[ERROR]   mvn <goals> -rf :qpid-broker-core
Build step 'Invoke top-level Maven targets' marked build as failure
[locks-and-latches] Releasing all the locks
[locks-and-latches] All the locks released
Archiving artifacts
Recording test results

Build failed in Jenkins: Qpid-Broker-J-Test-IBMJDK1.8 #2765

Posted by Apache Jenkins Server <je...@builds.apache.org>.
See <https://builds.apache.org/job/Qpid-Broker-J-Test-IBMJDK1.8/2765/display/redirect>

------------------------------------------
[...truncated 209.79 KB...]
[INFO] Executing tasks

main:
     [echo] Qpid Test Profile Properties
     [echo] [profile] java-mms.1-0
     [echo] [profile.broker.version] 1.0
     [echo] [profile.virtualhostnode.type] Memory
     [echo] [profile.virtualhostnode.context.blueprint] {"type":"ProvidedStore","globalAddressDomains":"${qpid.globalAddressDomains}"}
     [echo] [profile.test_receive_timeout] 1000
[INFO] Executed tasks
[INFO] 
[INFO] --- maven-enforcer-plugin:3.0.0-M2:enforce (enforce-maven-version) @ qpid-java-doc ---
[INFO] 
[INFO] --- maven-enforcer-plugin:3.0.0-M2:enforce (enforce-minimum-versions) @ qpid-java-doc ---
[INFO] 
[INFO] --- maven-enforcer-plugin:3.0.0-M2:enforce (enforce-versions-standard-properties) @ qpid-java-doc ---
[INFO] 
[INFO] --- maven-enforcer-plugin:3.0.0-M2:enforce (enforce-enableAmqp0x) @ qpid-java-doc ---
[INFO] 
[INFO] --- jacoco-maven-plugin:0.8.2:prepare-agent (default-prepare-agent) @ qpid-java-doc ---
[INFO] argLine set to -javaagent:/home/jenkins/.m2/repository/org/jacoco/org.jacoco.agent/0.8.2/org.jacoco.agent-0.8.2-runtime.jar=destfile=<https://builds.apache.org/job/Qpid-Broker-J-Test-IBMJDK1.8/ws/doc/target/jacoco.exec> -Xmx512m
[INFO] 
[INFO] --- maven-remote-resources-plugin:1.5:process (process-resource-bundles) @ qpid-java-doc ---
[INFO] 
[INFO] --- maven-site-plugin:3.7.1:attach-descriptor (attach-descriptor) @ qpid-java-doc ---
[INFO] No site descriptor found: nothing to attach.
[INFO] 
[INFO] --- maven-assembly-plugin:3.0.0:single (default) @ qpid-java-doc ---
[INFO] Assemblies have been skipped per configuration of the skipAssembly parameter.
[INFO] 
[INFO] ----------------< org.apache.qpid:qpid-java-doc-broker >----------------
[INFO] Building Apache Qpid Broker-J Docbook 8.0.0-SNAPSHOT             [12/46]
[INFO] --------------------------------[ jar ]---------------------------------
[INFO] 
[INFO] --- maven-clean-plugin:3.1.0:clean (default-clean) @ qpid-java-doc-broker ---
[INFO] 
[INFO] --- buildnumber-maven-plugin:1.4:create (default) @ qpid-java-doc-broker ---
[INFO] Executing: /bin/sh -c cd '<https://builds.apache.org/job/Qpid-Broker-J-Test-IBMJDK1.8/ws/doc/java-broker'> && 'git' 'rev-parse' '--verify' 'HEAD'
[INFO] Working directory: <https://builds.apache.org/job/Qpid-Broker-J-Test-IBMJDK1.8/ws/doc/java-broker>
[INFO] Storing buildNumber: 919675f3732e66f129fcc0012da127ca12fea639 at timestamp: 1545236121198
[WARNING] Cannot get the branch information from the git repository: 
Detecting the current branch failed: fatal: ref HEAD is not a symbolic ref

[INFO] Executing: /bin/sh -c cd '<https://builds.apache.org/job/Qpid-Broker-J-Test-IBMJDK1.8/ws/doc/java-broker'> && 'git' 'rev-parse' '--verify' 'HEAD'
[INFO] Working directory: <https://builds.apache.org/job/Qpid-Broker-J-Test-IBMJDK1.8/ws/doc/java-broker>
[INFO] Storing buildScmBranch: UNKNOWN
[INFO] 
[INFO] --- maven-antrun-plugin:1.8:run (output-test-properties) @ qpid-java-doc-broker ---
[INFO] Executing tasks

main:
     [echo] Qpid Test Profile Properties
     [echo] [profile] java-mms.1-0
     [echo] [profile.broker.version] 1.0
     [echo] [profile.virtualhostnode.type] Memory
     [echo] [profile.virtualhostnode.context.blueprint] {"type":"ProvidedStore","globalAddressDomains":"${qpid.globalAddressDomains}"}
     [echo] [profile.test_receive_timeout] 1000
[INFO] Executed tasks
[INFO] 
[INFO] --- maven-enforcer-plugin:3.0.0-M2:enforce (enforce-maven-version) @ qpid-java-doc-broker ---
[INFO] 
[INFO] --- maven-enforcer-plugin:3.0.0-M2:enforce (enforce-minimum-versions) @ qpid-java-doc-broker ---
[INFO] 
[INFO] --- maven-enforcer-plugin:3.0.0-M2:enforce (enforce-versions-standard-properties) @ qpid-java-doc-broker ---
[INFO] 
[INFO] --- maven-enforcer-plugin:3.0.0-M2:enforce (enforce-enableAmqp0x) @ qpid-java-doc-broker ---
[INFO] 
[INFO] --- jacoco-maven-plugin:0.8.2:prepare-agent (default-prepare-agent) @ qpid-java-doc-broker ---
[INFO] argLine set to -javaagent:/home/jenkins/.m2/repository/org/jacoco/org.jacoco.agent/0.8.2/org.jacoco.agent-0.8.2-runtime.jar=destfile=<https://builds.apache.org/job/Qpid-Broker-J-Test-IBMJDK1.8/ws/doc/java-broker/target/jacoco.exec> -Xmx512m
[INFO] 
[INFO] --- maven-resources-plugin:3.1.0:copy-resources (filter-docbook-sources) @ qpid-java-doc-broker ---
[INFO] Using 'UTF-8' encoding to copy filtered resources.
[INFO] Copying 76 resources
[INFO] 
[INFO] --- maven-remote-resources-plugin:1.5:process (process-resource-bundles) @ qpid-java-doc-broker ---
[INFO] 
[INFO] --- maven-resources-plugin:3.1.0:resources (default-resources) @ qpid-java-doc-broker ---
[INFO] Using 'UTF-8' encoding to copy filtered resources.
[INFO] Copying 76 resources
[INFO] 
[INFO] --- maven-compiler-plugin:3.7.0:compile (default-compile) @ qpid-java-doc-broker ---
[INFO] No sources to compile
[INFO] 
[INFO] --- maven-resources-plugin:3.1.0:testResources (default-testResources) @ qpid-java-doc-broker ---
[INFO] Using 'UTF-8' encoding to copy filtered resources.
[INFO] Copying 76 resources
[INFO] 
[INFO] --- maven-compiler-plugin:3.7.0:testCompile (default-testCompile) @ qpid-java-doc-broker ---
[INFO] No sources to compile
[INFO] 
[INFO] --- maven-surefire-plugin:2.22.0:test (default-test) @ qpid-java-doc-broker ---
[INFO] No tests to run.
[INFO] 
[INFO] --- maven-jar-plugin:3.1.0:jar (default-jar) @ qpid-java-doc-broker ---
[WARNING] JAR will be empty - no content was marked for inclusion!
[INFO] Building jar: <https://builds.apache.org/job/Qpid-Broker-J-Test-IBMJDK1.8/ws/doc/java-broker/target/qpid-java-doc-broker-8.0.0-SNAPSHOT.jar>
[INFO] 
[INFO] --- maven-site-plugin:3.7.1:attach-descriptor (attach-descriptor) @ qpid-java-doc-broker ---
[INFO] Skipping because packaging 'jar' is not pom.
[INFO] 
[INFO] --- maven-assembly-plugin:3.0.0:single (default) @ qpid-java-doc-broker ---
[INFO] Assemblies have been skipped per configuration of the skipAssembly parameter.
[INFO] 
[INFO] --------------< org.apache.qpid:qpid-java-doc-perftests >---------------
[INFO] Building Apache Qpid Broker-J Performance Test Docbook 8.0.0-SNAPSHOT [13/46]
[INFO] --------------------------------[ jar ]---------------------------------
[INFO] 
[INFO] --- maven-clean-plugin:3.1.0:clean (default-clean) @ qpid-java-doc-perftests ---
[INFO] 
[INFO] --- buildnumber-maven-plugin:1.4:create (default) @ qpid-java-doc-perftests ---
[INFO] Executing: /bin/sh -c cd '<https://builds.apache.org/job/Qpid-Broker-J-Test-IBMJDK1.8/ws/doc/java-perftests'> && 'git' 'rev-parse' '--verify' 'HEAD'
[INFO] Working directory: <https://builds.apache.org/job/Qpid-Broker-J-Test-IBMJDK1.8/ws/doc/java-perftests>
[INFO] Storing buildNumber: 919675f3732e66f129fcc0012da127ca12fea639 at timestamp: 1545236121931
[WARNING] Cannot get the branch information from the git repository: 
Detecting the current branch failed: fatal: ref HEAD is not a symbolic ref

[INFO] Executing: /bin/sh -c cd '<https://builds.apache.org/job/Qpid-Broker-J-Test-IBMJDK1.8/ws/doc/java-perftests'> && 'git' 'rev-parse' '--verify' 'HEAD'
[INFO] Working directory: <https://builds.apache.org/job/Qpid-Broker-J-Test-IBMJDK1.8/ws/doc/java-perftests>
[INFO] Storing buildScmBranch: UNKNOWN
[INFO] 
[INFO] --- maven-antrun-plugin:1.8:run (output-test-properties) @ qpid-java-doc-perftests ---
[INFO] Executing tasks

main:
     [echo] Qpid Test Profile Properties
     [echo] [profile] java-mms.1-0
     [echo] [profile.broker.version] 1.0
     [echo] [profile.virtualhostnode.type] Memory
     [echo] [profile.virtualhostnode.context.blueprint] {"type":"ProvidedStore","globalAddressDomains":"${qpid.globalAddressDomains}"}
     [echo] [profile.test_receive_timeout] 1000
[INFO] Executed tasks
[INFO] 
[INFO] --- maven-enforcer-plugin:3.0.0-M2:enforce (enforce-maven-version) @ qpid-java-doc-perftests ---
[INFO] 
[INFO] --- maven-enforcer-plugin:3.0.0-M2:enforce (enforce-minimum-versions) @ qpid-java-doc-perftests ---
[INFO] 
[INFO] --- maven-enforcer-plugin:3.0.0-M2:enforce (enforce-versions-standard-properties) @ qpid-java-doc-perftests ---
[INFO] 
[INFO] --- maven-enforcer-plugin:3.0.0-M2:enforce (enforce-enableAmqp0x) @ qpid-java-doc-perftests ---
[INFO] 
[INFO] --- jacoco-maven-plugin:0.8.2:prepare-agent (default-prepare-agent) @ qpid-java-doc-perftests ---
[INFO] argLine set to -javaagent:/home/jenkins/.m2/repository/org/jacoco/org.jacoco.agent/0.8.2/org.jacoco.agent-0.8.2-runtime.jar=destfile=<https://builds.apache.org/job/Qpid-Broker-J-Test-IBMJDK1.8/ws/doc/java-perftests/target/jacoco.exec> -Xmx512m
[INFO] 
[INFO] --- maven-resources-plugin:3.1.0:copy-resources (filter-docbook-sources) @ qpid-java-doc-perftests ---
[INFO] Using 'UTF-8' encoding to copy filtered resources.
[INFO] Copying 1 resource
[INFO] 
[INFO] --- maven-remote-resources-plugin:1.5:process (process-resource-bundles) @ qpid-java-doc-perftests ---
[INFO] 
[INFO] --- maven-resources-plugin:3.1.0:resources (default-resources) @ qpid-java-doc-perftests ---
[INFO] Using 'UTF-8' encoding to copy filtered resources.
[INFO] Copying 1 resource
[INFO] 
[INFO] --- maven-compiler-plugin:3.7.0:compile (default-compile) @ qpid-java-doc-perftests ---
[INFO] No sources to compile
[INFO] 
[INFO] --- maven-resources-plugin:3.1.0:testResources (default-testResources) @ qpid-java-doc-perftests ---
[INFO] Using 'UTF-8' encoding to copy filtered resources.
[INFO] Copying 1 resource
[INFO] 
[INFO] --- maven-compiler-plugin:3.7.0:testCompile (default-testCompile) @ qpid-java-doc-perftests ---
[INFO] No sources to compile
[INFO] 
[INFO] --- maven-surefire-plugin:2.22.0:test (default-test) @ qpid-java-doc-perftests ---
[INFO] No tests to run.
[INFO] 
[INFO] --- maven-jar-plugin:3.1.0:jar (default-jar) @ qpid-java-doc-perftests ---
[WARNING] JAR will be empty - no content was marked for inclusion!
[INFO] Building jar: <https://builds.apache.org/job/Qpid-Broker-J-Test-IBMJDK1.8/ws/doc/java-perftests/target/qpid-java-doc-perftests-8.0.0-SNAPSHOT.jar>
[INFO] 
[INFO] --- maven-site-plugin:3.7.1:attach-descriptor (attach-descriptor) @ qpid-java-doc-perftests ---
[INFO] Skipping because packaging 'jar' is not pom.
[INFO] 
[INFO] --- maven-assembly-plugin:3.0.0:single (default) @ qpid-java-doc-perftests ---
[INFO] Assemblies have been skipped per configuration of the skipAssembly parameter.
[INFO] ------------------------------------------------------------------------
[INFO] Reactor Summary:
[INFO] 
[INFO] Apache Qpid Broker-J Parent 8.0.0-SNAPSHOT ......... SUCCESS [  4.444 s]
[INFO] Apache Qpid Broker-J Code Generation ............... SUCCESS [  3.505 s]
[INFO] Apache Qpid Broker-J Test Utilities ................ SUCCESS [  1.056 s]
[INFO] Apache Qpid Broker-J Core .......................... FAILURE [01:33 min]
[INFO] Apache Qpid Broker-J LogBack Logging Plug-in ....... SKIPPED
[INFO] Apache Qpid Broker-J Access Control Plug-in ........ SKIPPED
[INFO] Apache Qpid Broker-J AMQP 0-10 Protocol Plug-in .... SKIPPED
[INFO] Apache Qpid Broker-J AMQP 0-8 Protocol Plug-in ..... SKIPPED
[INFO] Apache Qpid Broker-J AMQP 1-0 Protocol Plug-in ..... SKIPPED
[INFO] Apache Qpid Broker-J AMQP 0-8 to 0-10 Message Conversion Plug-in SKIPPED
[INFO] Apache Qpid Broker-J AMQP 0-8 to 1-0 Message Conversion Plug-in SKIPPED
[INFO] Apache Qpid Broker-J AMQP 0-10 to 1-0 Message Conversion Plug-in SKIPPED
[INFO] Apache Qpid Broker-J JDBC Message Store Plug-in .... SKIPPED
[INFO] Apache Qpid Broker-J Derby Message Store Plug-in ... SKIPPED
[INFO] Apache Qpid Broker-J JDBC Message Store Connection Pooling Plug-in SKIPPED
[INFO] Apache Qpid AMQP 1.0 JDBC Link Store Plug-in ....... SKIPPED
[INFO] Apache Qpid Broker-J HTTP Management Plug-in ....... SKIPPED
[INFO] Apache Qpid Broker-J AMQP Management Protocol Plug-in SKIPPED
[INFO] Apache Qpid Broker-J Memory Message Store Plug-in .. SKIPPED
[INFO] Apache Qpid Broker-J WebSocket Plug-in ............. SKIPPED
[INFO] Apache Qpid Broker-J BDB Message Store Plug-in ..... SKIPPED
[INFO] Apache Qpid AMQP 1.0 BDB Link Store Plug-in ........ SKIPPED
[INFO] Apache Qpid Broker-J ............................... SKIPPED
[INFO] Apache Qpid Broker-J Bundles ....................... SKIPPED
[INFO] Apache Qpid Broker-J Tools ......................... SUCCESS [  0.525 s]
[INFO] Apache Qpid Broker-J System Test Parent ............ SUCCESS [  0.245 s]
[INFO] Apache Qpid Broker-J System Test Utils ............. SKIPPED
[INFO] Apache Qpid Broker-J JMS System Tests Core ......... SKIPPED
[INFO] Apache Qpid Broker-J JMS 1.1 System Tests .......... SKIPPED
[INFO] Apache Qpid Broker-J JMS 2.0 System Tests .......... SKIPPED
[INFO] Apache Qpid Broker-J HTTP system tests ............. SKIPPED
[INFO] Apache Qpid Broker-J Protocol Tests Core ........... SUCCESS [  0.669 s]
[INFO] Apache Qpid Protocol Tests for AMQP 0-8,0-9,0-9-1 .. SKIPPED
[INFO] Apache Qpid Protocol Tests for AMQP 0-10 ........... SKIPPED
[INFO] Apache Qpid Protocol Tests for AMQP 1.0 ............ SKIPPED
[INFO] Apache Qpid Broker-J System Tests Spawn Broker Admin SKIPPED
[INFO] Apache Qpid Broker-J End to End Conversion Tests ... SKIPPED
[INFO] Apache Qpid Broker-J Performance Tests ............. SUCCESS [ 29.010 s]
[INFO] Apache Qpid Broker-J Performance Test System Tests . SKIPPED
[INFO] Apache Qpid Broker-J Performance Tests Visualisation JFC SKIPPED
[INFO] Apache Qpid Broker-J BDB Store System Tests ........ SKIPPED
[INFO] Apache Qpid Joram JMS Tests ........................ SUCCESS [  0.630 s]
[INFO] Apache Qpid Broker-J JMS TCK Configuration ......... SUCCESS [  0.378 s]
[INFO] Apache Qpid Broker-J Docbook ....................... SUCCESS [  0.086 s]
[INFO] Apache Qpid Broker-J Docbook ....................... SUCCESS [  0.727 s]
[INFO] Apache Qpid Broker-J Performance Test Docbook 8.0.0-SNAPSHOT SUCCESS [  0.128 s]
[INFO] ------------------------------------------------------------------------
[INFO] BUILD FAILURE
[INFO] ------------------------------------------------------------------------
[INFO] Total time: 02:16 min
[INFO] Finished at: 2018-12-19T16:15:22Z
[INFO] ------------------------------------------------------------------------
[ERROR] Failed to execute goal org.apache.maven.plugins:maven-surefire-plugin:2.22.0:test (default-test) on project qpid-broker-core: There are test failures.
[ERROR] 
[ERROR] Please refer to <https://builds.apache.org/job/Qpid-Broker-J-Test-IBMJDK1.8/2765/artifact/broker-core/target/surefire-reports/java-mms.1-0> for the individual test results.
[ERROR] Please refer to dump files (if any exist) [date]-jvmRun[N].dump, [date].dumpstream and [date]-jvmRun[N].dumpstream.
[ERROR] -> [Help 1]
[ERROR] 
[ERROR] To see the full stack trace of the errors, re-run Maven with the -e switch.
[ERROR] Re-run Maven using the -X switch to enable full debug logging.
[ERROR] 
[ERROR] For more information about the errors and possible solutions, please read the following articles:
[ERROR] [Help 1] http://cwiki.apache.org/confluence/display/MAVEN/MojoFailureException
[ERROR] 
[ERROR] After correcting the problems, you can resume the build with the command
[ERROR]   mvn <goals> -rf :qpid-broker-core
Build step 'Invoke top-level Maven targets' marked build as failure
[locks-and-latches] Releasing all the locks
[locks-and-latches] All the locks released
Archiving artifacts
Recording test results

Build failed in Jenkins: Qpid-Broker-J-Test-IBMJDK1.8 #2764

Posted by Apache Jenkins Server <je...@builds.apache.org>.
See <https://builds.apache.org/job/Qpid-Broker-J-Test-IBMJDK1.8/2764/display/redirect>

------------------------------------------
[...truncated 209.76 KB...]
[INFO] Executing tasks

main:
     [echo] Qpid Test Profile Properties
     [echo] [profile] java-mms.1-0
     [echo] [profile.broker.version] 1.0
     [echo] [profile.virtualhostnode.type] Memory
     [echo] [profile.virtualhostnode.context.blueprint] {"type":"ProvidedStore","globalAddressDomains":"${qpid.globalAddressDomains}"}
     [echo] [profile.test_receive_timeout] 1000
[INFO] Executed tasks
[INFO] 
[INFO] --- maven-enforcer-plugin:3.0.0-M2:enforce (enforce-maven-version) @ qpid-java-doc ---
[INFO] 
[INFO] --- maven-enforcer-plugin:3.0.0-M2:enforce (enforce-minimum-versions) @ qpid-java-doc ---
[INFO] 
[INFO] --- maven-enforcer-plugin:3.0.0-M2:enforce (enforce-versions-standard-properties) @ qpid-java-doc ---
[INFO] 
[INFO] --- maven-enforcer-plugin:3.0.0-M2:enforce (enforce-enableAmqp0x) @ qpid-java-doc ---
[INFO] 
[INFO] --- jacoco-maven-plugin:0.8.2:prepare-agent (default-prepare-agent) @ qpid-java-doc ---
[INFO] argLine set to -javaagent:/home/jenkins/.m2/repository/org/jacoco/org.jacoco.agent/0.8.2/org.jacoco.agent-0.8.2-runtime.jar=destfile=<https://builds.apache.org/job/Qpid-Broker-J-Test-IBMJDK1.8/ws/doc/target/jacoco.exec> -Xmx512m
[INFO] 
[INFO] --- maven-remote-resources-plugin:1.5:process (process-resource-bundles) @ qpid-java-doc ---
[INFO] 
[INFO] --- maven-site-plugin:3.7.1:attach-descriptor (attach-descriptor) @ qpid-java-doc ---
[INFO] No site descriptor found: nothing to attach.
[INFO] 
[INFO] --- maven-assembly-plugin:3.0.0:single (default) @ qpid-java-doc ---
[INFO] Assemblies have been skipped per configuration of the skipAssembly parameter.
[INFO] 
[INFO] ----------------< org.apache.qpid:qpid-java-doc-broker >----------------
[INFO] Building Apache Qpid Broker-J Docbook 8.0.0-SNAPSHOT             [12/46]
[INFO] --------------------------------[ jar ]---------------------------------
[INFO] 
[INFO] --- maven-clean-plugin:3.1.0:clean (default-clean) @ qpid-java-doc-broker ---
[INFO] 
[INFO] --- buildnumber-maven-plugin:1.4:create (default) @ qpid-java-doc-broker ---
[INFO] Executing: /bin/sh -c cd '<https://builds.apache.org/job/Qpid-Broker-J-Test-IBMJDK1.8/ws/doc/java-broker'> && 'git' 'rev-parse' '--verify' 'HEAD'
[INFO] Working directory: <https://builds.apache.org/job/Qpid-Broker-J-Test-IBMJDK1.8/ws/doc/java-broker>
[INFO] Storing buildNumber: 919675f3732e66f129fcc0012da127ca12fea639 at timestamp: 1545235953659
[WARNING] Cannot get the branch information from the git repository: 
Detecting the current branch failed: fatal: ref HEAD is not a symbolic ref

[INFO] Executing: /bin/sh -c cd '<https://builds.apache.org/job/Qpid-Broker-J-Test-IBMJDK1.8/ws/doc/java-broker'> && 'git' 'rev-parse' '--verify' 'HEAD'
[INFO] Working directory: <https://builds.apache.org/job/Qpid-Broker-J-Test-IBMJDK1.8/ws/doc/java-broker>
[INFO] Storing buildScmBranch: UNKNOWN
[INFO] 
[INFO] --- maven-antrun-plugin:1.8:run (output-test-properties) @ qpid-java-doc-broker ---
[INFO] Executing tasks

main:
     [echo] Qpid Test Profile Properties
     [echo] [profile] java-mms.1-0
     [echo] [profile.broker.version] 1.0
     [echo] [profile.virtualhostnode.type] Memory
     [echo] [profile.virtualhostnode.context.blueprint] {"type":"ProvidedStore","globalAddressDomains":"${qpid.globalAddressDomains}"}
     [echo] [profile.test_receive_timeout] 1000
[INFO] Executed tasks
[INFO] 
[INFO] --- maven-enforcer-plugin:3.0.0-M2:enforce (enforce-maven-version) @ qpid-java-doc-broker ---
[INFO] 
[INFO] --- maven-enforcer-plugin:3.0.0-M2:enforce (enforce-minimum-versions) @ qpid-java-doc-broker ---
[INFO] 
[INFO] --- maven-enforcer-plugin:3.0.0-M2:enforce (enforce-versions-standard-properties) @ qpid-java-doc-broker ---
[INFO] 
[INFO] --- maven-enforcer-plugin:3.0.0-M2:enforce (enforce-enableAmqp0x) @ qpid-java-doc-broker ---
[INFO] 
[INFO] --- jacoco-maven-plugin:0.8.2:prepare-agent (default-prepare-agent) @ qpid-java-doc-broker ---
[INFO] argLine set to -javaagent:/home/jenkins/.m2/repository/org/jacoco/org.jacoco.agent/0.8.2/org.jacoco.agent-0.8.2-runtime.jar=destfile=<https://builds.apache.org/job/Qpid-Broker-J-Test-IBMJDK1.8/ws/doc/java-broker/target/jacoco.exec> -Xmx512m
[INFO] 
[INFO] --- maven-resources-plugin:3.1.0:copy-resources (filter-docbook-sources) @ qpid-java-doc-broker ---
[INFO] Using 'UTF-8' encoding to copy filtered resources.
[INFO] Copying 76 resources
[INFO] 
[INFO] --- maven-remote-resources-plugin:1.5:process (process-resource-bundles) @ qpid-java-doc-broker ---
[INFO] 
[INFO] --- maven-resources-plugin:3.1.0:resources (default-resources) @ qpid-java-doc-broker ---
[INFO] Using 'UTF-8' encoding to copy filtered resources.
[INFO] Copying 76 resources
[INFO] 
[INFO] --- maven-compiler-plugin:3.7.0:compile (default-compile) @ qpid-java-doc-broker ---
[INFO] No sources to compile
[INFO] 
[INFO] --- maven-resources-plugin:3.1.0:testResources (default-testResources) @ qpid-java-doc-broker ---
[INFO] Using 'UTF-8' encoding to copy filtered resources.
[INFO] Copying 76 resources
[INFO] 
[INFO] --- maven-compiler-plugin:3.7.0:testCompile (default-testCompile) @ qpid-java-doc-broker ---
[INFO] No sources to compile
[INFO] 
[INFO] --- maven-surefire-plugin:2.22.0:test (default-test) @ qpid-java-doc-broker ---
[INFO] No tests to run.
[INFO] 
[INFO] --- maven-jar-plugin:3.1.0:jar (default-jar) @ qpid-java-doc-broker ---
[WARNING] JAR will be empty - no content was marked for inclusion!
[INFO] Building jar: <https://builds.apache.org/job/Qpid-Broker-J-Test-IBMJDK1.8/ws/doc/java-broker/target/qpid-java-doc-broker-8.0.0-SNAPSHOT.jar>
[INFO] 
[INFO] --- maven-site-plugin:3.7.1:attach-descriptor (attach-descriptor) @ qpid-java-doc-broker ---
[INFO] Skipping because packaging 'jar' is not pom.
[INFO] 
[INFO] --- maven-assembly-plugin:3.0.0:single (default) @ qpid-java-doc-broker ---
[INFO] Assemblies have been skipped per configuration of the skipAssembly parameter.
[INFO] 
[INFO] --------------< org.apache.qpid:qpid-java-doc-perftests >---------------
[INFO] Building Apache Qpid Broker-J Performance Test Docbook 8.0.0-SNAPSHOT [13/46]
[INFO] --------------------------------[ jar ]---------------------------------
[INFO] 
[INFO] --- maven-clean-plugin:3.1.0:clean (default-clean) @ qpid-java-doc-perftests ---
[INFO] 
[INFO] --- buildnumber-maven-plugin:1.4:create (default) @ qpid-java-doc-perftests ---
[INFO] Executing: /bin/sh -c cd '<https://builds.apache.org/job/Qpid-Broker-J-Test-IBMJDK1.8/ws/doc/java-perftests'> && 'git' 'rev-parse' '--verify' 'HEAD'
[INFO] Working directory: <https://builds.apache.org/job/Qpid-Broker-J-Test-IBMJDK1.8/ws/doc/java-perftests>
[INFO] Storing buildNumber: 919675f3732e66f129fcc0012da127ca12fea639 at timestamp: 1545235954326
[WARNING] Cannot get the branch information from the git repository: 
Detecting the current branch failed: fatal: ref HEAD is not a symbolic ref

[INFO] Executing: /bin/sh -c cd '<https://builds.apache.org/job/Qpid-Broker-J-Test-IBMJDK1.8/ws/doc/java-perftests'> && 'git' 'rev-parse' '--verify' 'HEAD'
[INFO] Working directory: <https://builds.apache.org/job/Qpid-Broker-J-Test-IBMJDK1.8/ws/doc/java-perftests>
[INFO] Storing buildScmBranch: UNKNOWN
[INFO] 
[INFO] --- maven-antrun-plugin:1.8:run (output-test-properties) @ qpid-java-doc-perftests ---
[INFO] Executing tasks

main:
     [echo] Qpid Test Profile Properties
     [echo] [profile] java-mms.1-0
     [echo] [profile.broker.version] 1.0
     [echo] [profile.virtualhostnode.type] Memory
     [echo] [profile.virtualhostnode.context.blueprint] {"type":"ProvidedStore","globalAddressDomains":"${qpid.globalAddressDomains}"}
     [echo] [profile.test_receive_timeout] 1000
[INFO] Executed tasks
[INFO] 
[INFO] --- maven-enforcer-plugin:3.0.0-M2:enforce (enforce-maven-version) @ qpid-java-doc-perftests ---
[INFO] 
[INFO] --- maven-enforcer-plugin:3.0.0-M2:enforce (enforce-minimum-versions) @ qpid-java-doc-perftests ---
[INFO] 
[INFO] --- maven-enforcer-plugin:3.0.0-M2:enforce (enforce-versions-standard-properties) @ qpid-java-doc-perftests ---
[INFO] 
[INFO] --- maven-enforcer-plugin:3.0.0-M2:enforce (enforce-enableAmqp0x) @ qpid-java-doc-perftests ---
[INFO] 
[INFO] --- jacoco-maven-plugin:0.8.2:prepare-agent (default-prepare-agent) @ qpid-java-doc-perftests ---
[INFO] argLine set to -javaagent:/home/jenkins/.m2/repository/org/jacoco/org.jacoco.agent/0.8.2/org.jacoco.agent-0.8.2-runtime.jar=destfile=<https://builds.apache.org/job/Qpid-Broker-J-Test-IBMJDK1.8/ws/doc/java-perftests/target/jacoco.exec> -Xmx512m
[INFO] 
[INFO] --- maven-resources-plugin:3.1.0:copy-resources (filter-docbook-sources) @ qpid-java-doc-perftests ---
[INFO] Using 'UTF-8' encoding to copy filtered resources.
[INFO] Copying 1 resource
[INFO] 
[INFO] --- maven-remote-resources-plugin:1.5:process (process-resource-bundles) @ qpid-java-doc-perftests ---
[INFO] 
[INFO] --- maven-resources-plugin:3.1.0:resources (default-resources) @ qpid-java-doc-perftests ---
[INFO] Using 'UTF-8' encoding to copy filtered resources.
[INFO] Copying 1 resource
[INFO] 
[INFO] --- maven-compiler-plugin:3.7.0:compile (default-compile) @ qpid-java-doc-perftests ---
[INFO] No sources to compile
[INFO] 
[INFO] --- maven-resources-plugin:3.1.0:testResources (default-testResources) @ qpid-java-doc-perftests ---
[INFO] Using 'UTF-8' encoding to copy filtered resources.
[INFO] Copying 1 resource
[INFO] 
[INFO] --- maven-compiler-plugin:3.7.0:testCompile (default-testCompile) @ qpid-java-doc-perftests ---
[INFO] No sources to compile
[INFO] 
[INFO] --- maven-surefire-plugin:2.22.0:test (default-test) @ qpid-java-doc-perftests ---
[INFO] No tests to run.
[INFO] 
[INFO] --- maven-jar-plugin:3.1.0:jar (default-jar) @ qpid-java-doc-perftests ---
[WARNING] JAR will be empty - no content was marked for inclusion!
[INFO] Building jar: <https://builds.apache.org/job/Qpid-Broker-J-Test-IBMJDK1.8/ws/doc/java-perftests/target/qpid-java-doc-perftests-8.0.0-SNAPSHOT.jar>
[INFO] 
[INFO] --- maven-site-plugin:3.7.1:attach-descriptor (attach-descriptor) @ qpid-java-doc-perftests ---
[INFO] Skipping because packaging 'jar' is not pom.
[INFO] 
[INFO] --- maven-assembly-plugin:3.0.0:single (default) @ qpid-java-doc-perftests ---
[INFO] Assemblies have been skipped per configuration of the skipAssembly parameter.
[INFO] ------------------------------------------------------------------------
[INFO] Reactor Summary:
[INFO] 
[INFO] Apache Qpid Broker-J Parent 8.0.0-SNAPSHOT ......... SUCCESS [  3.812 s]
[INFO] Apache Qpid Broker-J Code Generation ............... SUCCESS [  3.547 s]
[INFO] Apache Qpid Broker-J Test Utilities ................ SUCCESS [  1.209 s]
[INFO] Apache Qpid Broker-J Core .......................... FAILURE [01:20 min]
[INFO] Apache Qpid Broker-J LogBack Logging Plug-in ....... SKIPPED
[INFO] Apache Qpid Broker-J Access Control Plug-in ........ SKIPPED
[INFO] Apache Qpid Broker-J AMQP 0-10 Protocol Plug-in .... SKIPPED
[INFO] Apache Qpid Broker-J AMQP 0-8 Protocol Plug-in ..... SKIPPED
[INFO] Apache Qpid Broker-J AMQP 1-0 Protocol Plug-in ..... SKIPPED
[INFO] Apache Qpid Broker-J AMQP 0-8 to 0-10 Message Conversion Plug-in SKIPPED
[INFO] Apache Qpid Broker-J AMQP 0-8 to 1-0 Message Conversion Plug-in SKIPPED
[INFO] Apache Qpid Broker-J AMQP 0-10 to 1-0 Message Conversion Plug-in SKIPPED
[INFO] Apache Qpid Broker-J JDBC Message Store Plug-in .... SKIPPED
[INFO] Apache Qpid Broker-J Derby Message Store Plug-in ... SKIPPED
[INFO] Apache Qpid Broker-J JDBC Message Store Connection Pooling Plug-in SKIPPED
[INFO] Apache Qpid AMQP 1.0 JDBC Link Store Plug-in ....... SKIPPED
[INFO] Apache Qpid Broker-J HTTP Management Plug-in ....... SKIPPED
[INFO] Apache Qpid Broker-J AMQP Management Protocol Plug-in SKIPPED
[INFO] Apache Qpid Broker-J Memory Message Store Plug-in .. SKIPPED
[INFO] Apache Qpid Broker-J WebSocket Plug-in ............. SKIPPED
[INFO] Apache Qpid Broker-J BDB Message Store Plug-in ..... SKIPPED
[INFO] Apache Qpid AMQP 1.0 BDB Link Store Plug-in ........ SKIPPED
[INFO] Apache Qpid Broker-J ............................... SKIPPED
[INFO] Apache Qpid Broker-J Bundles ....................... SKIPPED
[INFO] Apache Qpid Broker-J Tools ......................... SUCCESS [  0.497 s]
[INFO] Apache Qpid Broker-J System Test Parent ............ SUCCESS [  0.195 s]
[INFO] Apache Qpid Broker-J System Test Utils ............. SKIPPED
[INFO] Apache Qpid Broker-J JMS System Tests Core ......... SKIPPED
[INFO] Apache Qpid Broker-J JMS 1.1 System Tests .......... SKIPPED
[INFO] Apache Qpid Broker-J JMS 2.0 System Tests .......... SKIPPED
[INFO] Apache Qpid Broker-J HTTP system tests ............. SKIPPED
[INFO] Apache Qpid Broker-J Protocol Tests Core ........... SUCCESS [  0.530 s]
[INFO] Apache Qpid Protocol Tests for AMQP 0-8,0-9,0-9-1 .. SKIPPED
[INFO] Apache Qpid Protocol Tests for AMQP 0-10 ........... SKIPPED
[INFO] Apache Qpid Protocol Tests for AMQP 1.0 ............ SKIPPED
[INFO] Apache Qpid Broker-J System Tests Spawn Broker Admin SKIPPED
[INFO] Apache Qpid Broker-J End to End Conversion Tests ... SKIPPED
[INFO] Apache Qpid Broker-J Performance Tests ............. SUCCESS [ 26.364 s]
[INFO] Apache Qpid Broker-J Performance Test System Tests . SKIPPED
[INFO] Apache Qpid Broker-J Performance Tests Visualisation JFC SKIPPED
[INFO] Apache Qpid Broker-J BDB Store System Tests ........ SKIPPED
[INFO] Apache Qpid Joram JMS Tests ........................ SUCCESS [  0.487 s]
[INFO] Apache Qpid Broker-J JMS TCK Configuration ......... SUCCESS [  0.364 s]
[INFO] Apache Qpid Broker-J Docbook ....................... SUCCESS [  0.098 s]
[INFO] Apache Qpid Broker-J Docbook ....................... SUCCESS [  0.667 s]
[INFO] Apache Qpid Broker-J Performance Test Docbook 8.0.0-SNAPSHOT SUCCESS [  0.137 s]
[INFO] ------------------------------------------------------------------------
[INFO] BUILD FAILURE
[INFO] ------------------------------------------------------------------------
[INFO] Total time: 01:59 min
[INFO] Finished at: 2018-12-19T16:12:34Z
[INFO] ------------------------------------------------------------------------
[ERROR] Failed to execute goal org.apache.maven.plugins:maven-surefire-plugin:2.22.0:test (default-test) on project qpid-broker-core: There are test failures.
[ERROR] 
[ERROR] Please refer to <https://builds.apache.org/job/Qpid-Broker-J-Test-IBMJDK1.8/2764/artifact/broker-core/target/surefire-reports/java-mms.1-0> for the individual test results.
[ERROR] Please refer to dump files (if any exist) [date]-jvmRun[N].dump, [date].dumpstream and [date]-jvmRun[N].dumpstream.
[ERROR] -> [Help 1]
[ERROR] 
[ERROR] To see the full stack trace of the errors, re-run Maven with the -e switch.
[ERROR] Re-run Maven using the -X switch to enable full debug logging.
[ERROR] 
[ERROR] For more information about the errors and possible solutions, please read the following articles:
[ERROR] [Help 1] http://cwiki.apache.org/confluence/display/MAVEN/MojoFailureException
[ERROR] 
[ERROR] After correcting the problems, you can resume the build with the command
[ERROR]   mvn <goals> -rf :qpid-broker-core
Build step 'Invoke top-level Maven targets' marked build as failure
[locks-and-latches] Releasing all the locks
[locks-and-latches] All the locks released
Archiving artifacts
Recording test results

Build failed in Jenkins: Qpid-Broker-J-Test-IBMJDK1.8 #2763

Posted by Apache Jenkins Server <je...@builds.apache.org>.
See <https://builds.apache.org/job/Qpid-Broker-J-Test-IBMJDK1.8/2763/display/redirect?page=changes>

Changes:

[orudyy] QPID-8227: [Broker-J] Set system property 'qpid.version'

------------------------------------------
[...truncated 208.52 KB...]
[INFO] Executing tasks

main:
     [echo] Qpid Test Profile Properties
     [echo] [profile] java-mms.1-0
     [echo] [profile.broker.version] 1.0
     [echo] [profile.virtualhostnode.type] Memory
     [echo] [profile.virtualhostnode.context.blueprint] {"type":"ProvidedStore","globalAddressDomains":"${qpid.globalAddressDomains}"}
     [echo] [profile.test_receive_timeout] 1000
[INFO] Executed tasks
[INFO] 
[INFO] --- maven-enforcer-plugin:3.0.0-M2:enforce (enforce-maven-version) @ qpid-java-doc ---
[INFO] 
[INFO] --- maven-enforcer-plugin:3.0.0-M2:enforce (enforce-minimum-versions) @ qpid-java-doc ---
[INFO] 
[INFO] --- maven-enforcer-plugin:3.0.0-M2:enforce (enforce-versions-standard-properties) @ qpid-java-doc ---
[INFO] 
[INFO] --- maven-enforcer-plugin:3.0.0-M2:enforce (enforce-enableAmqp0x) @ qpid-java-doc ---
[INFO] 
[INFO] --- jacoco-maven-plugin:0.8.2:prepare-agent (default-prepare-agent) @ qpid-java-doc ---
[INFO] argLine set to -javaagent:/home/jenkins/.m2/repository/org/jacoco/org.jacoco.agent/0.8.2/org.jacoco.agent-0.8.2-runtime.jar=destfile=<https://builds.apache.org/job/Qpid-Broker-J-Test-IBMJDK1.8/ws/doc/target/jacoco.exec> -Xmx512m
[INFO] 
[INFO] --- maven-remote-resources-plugin:1.5:process (process-resource-bundles) @ qpid-java-doc ---
[INFO] 
[INFO] --- maven-site-plugin:3.7.1:attach-descriptor (attach-descriptor) @ qpid-java-doc ---
[INFO] No site descriptor found: nothing to attach.
[INFO] 
[INFO] --- maven-assembly-plugin:3.0.0:single (default) @ qpid-java-doc ---
[INFO] Assemblies have been skipped per configuration of the skipAssembly parameter.
[INFO] 
[INFO] ----------------< org.apache.qpid:qpid-java-doc-broker >----------------
[INFO] Building Apache Qpid Broker-J Docbook 7.1.0-SNAPSHOT             [12/46]
[INFO] --------------------------------[ jar ]---------------------------------
[INFO] 
[INFO] --- maven-clean-plugin:3.1.0:clean (default-clean) @ qpid-java-doc-broker ---
[INFO] 
[INFO] --- buildnumber-maven-plugin:1.4:create (default) @ qpid-java-doc-broker ---
[INFO] Executing: /bin/sh -c cd '<https://builds.apache.org/job/Qpid-Broker-J-Test-IBMJDK1.8/ws/doc/java-broker'> && 'git' 'rev-parse' '--verify' 'HEAD'
[INFO] Working directory: <https://builds.apache.org/job/Qpid-Broker-J-Test-IBMJDK1.8/ws/doc/java-broker>
[INFO] Storing buildNumber: ca754b799151581796d9597f0b778f67bc8c8efa at timestamp: 1545220732209
[WARNING] Cannot get the branch information from the git repository: 
Detecting the current branch failed: fatal: ref HEAD is not a symbolic ref

[INFO] Executing: /bin/sh -c cd '<https://builds.apache.org/job/Qpid-Broker-J-Test-IBMJDK1.8/ws/doc/java-broker'> && 'git' 'rev-parse' '--verify' 'HEAD'
[INFO] Working directory: <https://builds.apache.org/job/Qpid-Broker-J-Test-IBMJDK1.8/ws/doc/java-broker>
[INFO] Storing buildScmBranch: UNKNOWN
[INFO] 
[INFO] --- maven-antrun-plugin:1.8:run (output-test-properties) @ qpid-java-doc-broker ---
[INFO] Executing tasks

main:
     [echo] Qpid Test Profile Properties
     [echo] [profile] java-mms.1-0
     [echo] [profile.broker.version] 1.0
     [echo] [profile.virtualhostnode.type] Memory
     [echo] [profile.virtualhostnode.context.blueprint] {"type":"ProvidedStore","globalAddressDomains":"${qpid.globalAddressDomains}"}
     [echo] [profile.test_receive_timeout] 1000
[INFO] Executed tasks
[INFO] 
[INFO] --- maven-enforcer-plugin:3.0.0-M2:enforce (enforce-maven-version) @ qpid-java-doc-broker ---
[INFO] 
[INFO] --- maven-enforcer-plugin:3.0.0-M2:enforce (enforce-minimum-versions) @ qpid-java-doc-broker ---
[INFO] 
[INFO] --- maven-enforcer-plugin:3.0.0-M2:enforce (enforce-versions-standard-properties) @ qpid-java-doc-broker ---
[INFO] 
[INFO] --- maven-enforcer-plugin:3.0.0-M2:enforce (enforce-enableAmqp0x) @ qpid-java-doc-broker ---
[INFO] 
[INFO] --- jacoco-maven-plugin:0.8.2:prepare-agent (default-prepare-agent) @ qpid-java-doc-broker ---
[INFO] argLine set to -javaagent:/home/jenkins/.m2/repository/org/jacoco/org.jacoco.agent/0.8.2/org.jacoco.agent-0.8.2-runtime.jar=destfile=<https://builds.apache.org/job/Qpid-Broker-J-Test-IBMJDK1.8/ws/doc/java-broker/target/jacoco.exec> -Xmx512m
[INFO] 
[INFO] --- maven-resources-plugin:3.1.0:copy-resources (filter-docbook-sources) @ qpid-java-doc-broker ---
[INFO] Using 'UTF-8' encoding to copy filtered resources.
[INFO] Copying 76 resources
[INFO] 
[INFO] --- maven-remote-resources-plugin:1.5:process (process-resource-bundles) @ qpid-java-doc-broker ---
[INFO] 
[INFO] --- maven-resources-plugin:3.1.0:resources (default-resources) @ qpid-java-doc-broker ---
[INFO] Using 'UTF-8' encoding to copy filtered resources.
[INFO] Copying 76 resources
[INFO] 
[INFO] --- maven-compiler-plugin:3.7.0:compile (default-compile) @ qpid-java-doc-broker ---
[INFO] No sources to compile
[INFO] 
[INFO] --- maven-resources-plugin:3.1.0:testResources (default-testResources) @ qpid-java-doc-broker ---
[INFO] Using 'UTF-8' encoding to copy filtered resources.
[INFO] Copying 76 resources
[INFO] 
[INFO] --- maven-compiler-plugin:3.7.0:testCompile (default-testCompile) @ qpid-java-doc-broker ---
[INFO] No sources to compile
[INFO] 
[INFO] --- maven-surefire-plugin:2.22.0:test (default-test) @ qpid-java-doc-broker ---
[INFO] No tests to run.
[INFO] 
[INFO] --- maven-jar-plugin:3.1.0:jar (default-jar) @ qpid-java-doc-broker ---
[WARNING] JAR will be empty - no content was marked for inclusion!
[INFO] Building jar: <https://builds.apache.org/job/Qpid-Broker-J-Test-IBMJDK1.8/ws/doc/java-broker/target/qpid-java-doc-broker-7.1.0-SNAPSHOT.jar>
[INFO] 
[INFO] --- maven-site-plugin:3.7.1:attach-descriptor (attach-descriptor) @ qpid-java-doc-broker ---
[INFO] Skipping because packaging 'jar' is not pom.
[INFO] 
[INFO] --- maven-assembly-plugin:3.0.0:single (default) @ qpid-java-doc-broker ---
[INFO] Assemblies have been skipped per configuration of the skipAssembly parameter.
[INFO] 
[INFO] --------------< org.apache.qpid:qpid-java-doc-perftests >---------------
[INFO] Building Apache Qpid Broker-J Performance Test Docbook 7.1.0-SNAPSHOT [13/46]
[INFO] --------------------------------[ jar ]---------------------------------
[INFO] 
[INFO] --- maven-clean-plugin:3.1.0:clean (default-clean) @ qpid-java-doc-perftests ---
[INFO] 
[INFO] --- buildnumber-maven-plugin:1.4:create (default) @ qpid-java-doc-perftests ---
[INFO] Executing: /bin/sh -c cd '<https://builds.apache.org/job/Qpid-Broker-J-Test-IBMJDK1.8/ws/doc/java-perftests'> && 'git' 'rev-parse' '--verify' 'HEAD'
[INFO] Working directory: <https://builds.apache.org/job/Qpid-Broker-J-Test-IBMJDK1.8/ws/doc/java-perftests>
[INFO] Storing buildNumber: ca754b799151581796d9597f0b778f67bc8c8efa at timestamp: 1545220733174
[WARNING] Cannot get the branch information from the git repository: 
Detecting the current branch failed: fatal: ref HEAD is not a symbolic ref

[INFO] Executing: /bin/sh -c cd '<https://builds.apache.org/job/Qpid-Broker-J-Test-IBMJDK1.8/ws/doc/java-perftests'> && 'git' 'rev-parse' '--verify' 'HEAD'
[INFO] Working directory: <https://builds.apache.org/job/Qpid-Broker-J-Test-IBMJDK1.8/ws/doc/java-perftests>
[INFO] Storing buildScmBranch: UNKNOWN
[INFO] 
[INFO] --- maven-antrun-plugin:1.8:run (output-test-properties) @ qpid-java-doc-perftests ---
[INFO] Executing tasks

main:
     [echo] Qpid Test Profile Properties
     [echo] [profile] java-mms.1-0
     [echo] [profile.broker.version] 1.0
     [echo] [profile.virtualhostnode.type] Memory
     [echo] [profile.virtualhostnode.context.blueprint] {"type":"ProvidedStore","globalAddressDomains":"${qpid.globalAddressDomains}"}
     [echo] [profile.test_receive_timeout] 1000
[INFO] Executed tasks
[INFO] 
[INFO] --- maven-enforcer-plugin:3.0.0-M2:enforce (enforce-maven-version) @ qpid-java-doc-perftests ---
[INFO] 
[INFO] --- maven-enforcer-plugin:3.0.0-M2:enforce (enforce-minimum-versions) @ qpid-java-doc-perftests ---
[INFO] 
[INFO] --- maven-enforcer-plugin:3.0.0-M2:enforce (enforce-versions-standard-properties) @ qpid-java-doc-perftests ---
[INFO] 
[INFO] --- maven-enforcer-plugin:3.0.0-M2:enforce (enforce-enableAmqp0x) @ qpid-java-doc-perftests ---
[INFO] 
[INFO] --- jacoco-maven-plugin:0.8.2:prepare-agent (default-prepare-agent) @ qpid-java-doc-perftests ---
[INFO] argLine set to -javaagent:/home/jenkins/.m2/repository/org/jacoco/org.jacoco.agent/0.8.2/org.jacoco.agent-0.8.2-runtime.jar=destfile=<https://builds.apache.org/job/Qpid-Broker-J-Test-IBMJDK1.8/ws/doc/java-perftests/target/jacoco.exec> -Xmx512m
[INFO] 
[INFO] --- maven-resources-plugin:3.1.0:copy-resources (filter-docbook-sources) @ qpid-java-doc-perftests ---
[INFO] Using 'UTF-8' encoding to copy filtered resources.
[INFO] Copying 1 resource
[INFO] 
[INFO] --- maven-remote-resources-plugin:1.5:process (process-resource-bundles) @ qpid-java-doc-perftests ---
[INFO] 
[INFO] --- maven-resources-plugin:3.1.0:resources (default-resources) @ qpid-java-doc-perftests ---
[INFO] Using 'UTF-8' encoding to copy filtered resources.
[INFO] Copying 1 resource
[INFO] 
[INFO] --- maven-compiler-plugin:3.7.0:compile (default-compile) @ qpid-java-doc-perftests ---
[INFO] No sources to compile
[INFO] 
[INFO] --- maven-resources-plugin:3.1.0:testResources (default-testResources) @ qpid-java-doc-perftests ---
[INFO] Using 'UTF-8' encoding to copy filtered resources.
[INFO] Copying 1 resource
[INFO] 
[INFO] --- maven-compiler-plugin:3.7.0:testCompile (default-testCompile) @ qpid-java-doc-perftests ---
[INFO] No sources to compile
[INFO] 
[INFO] --- maven-surefire-plugin:2.22.0:test (default-test) @ qpid-java-doc-perftests ---
[INFO] No tests to run.
[INFO] 
[INFO] --- maven-jar-plugin:3.1.0:jar (default-jar) @ qpid-java-doc-perftests ---
[WARNING] JAR will be empty - no content was marked for inclusion!
[INFO] Building jar: <https://builds.apache.org/job/Qpid-Broker-J-Test-IBMJDK1.8/ws/doc/java-perftests/target/qpid-java-doc-perftests-7.1.0-SNAPSHOT.jar>
[INFO] 
[INFO] --- maven-site-plugin:3.7.1:attach-descriptor (attach-descriptor) @ qpid-java-doc-perftests ---
[INFO] Skipping because packaging 'jar' is not pom.
[INFO] 
[INFO] --- maven-assembly-plugin:3.0.0:single (default) @ qpid-java-doc-perftests ---
[INFO] Assemblies have been skipped per configuration of the skipAssembly parameter.
[INFO] ------------------------------------------------------------------------
[INFO] Reactor Summary:
[INFO] 
[INFO] Apache Qpid Broker-J Parent 7.1.0-SNAPSHOT ......... SUCCESS [  3.624 s]
[INFO] Apache Qpid Broker-J Code Generation ............... SUCCESS [  3.547 s]
[INFO] Apache Qpid Broker-J Test Utilities ................ SUCCESS [  1.600 s]
[INFO] Apache Qpid Broker-J Core .......................... FAILURE [01:37 min]
[INFO] Apache Qpid Broker-J LogBack Logging Plug-in ....... SKIPPED
[INFO] Apache Qpid Broker-J Access Control Plug-in ........ SKIPPED
[INFO] Apache Qpid Broker-J AMQP 0-10 Protocol Plug-in .... SKIPPED
[INFO] Apache Qpid Broker-J AMQP 0-8 Protocol Plug-in ..... SKIPPED
[INFO] Apache Qpid Broker-J AMQP 1-0 Protocol Plug-in ..... SKIPPED
[INFO] Apache Qpid Broker-J AMQP 0-8 to 0-10 Message Conversion Plug-in SKIPPED
[INFO] Apache Qpid Broker-J AMQP 0-8 to 1-0 Message Conversion Plug-in SKIPPED
[INFO] Apache Qpid Broker-J AMQP 0-10 to 1-0 Message Conversion Plug-in SKIPPED
[INFO] Apache Qpid Broker-J JDBC Message Store Plug-in .... SKIPPED
[INFO] Apache Qpid Broker-J Derby Message Store Plug-in ... SKIPPED
[INFO] Apache Qpid Broker-J JDBC Message Store Connection Pooling Plug-in SKIPPED
[INFO] Apache Qpid AMQP 1.0 JDBC Link Store Plug-in ....... SKIPPED
[INFO] Apache Qpid Broker-J HTTP Management Plug-in ....... SKIPPED
[INFO] Apache Qpid Broker-J AMQP Management Protocol Plug-in SKIPPED
[INFO] Apache Qpid Broker-J Memory Message Store Plug-in .. SKIPPED
[INFO] Apache Qpid Broker-J WebSocket Plug-in ............. SKIPPED
[INFO] Apache Qpid Broker-J BDB Message Store Plug-in ..... SKIPPED
[INFO] Apache Qpid AMQP 1.0 BDB Link Store Plug-in ........ SKIPPED
[INFO] Apache Qpid Broker-J ............................... SKIPPED
[INFO] Apache Qpid Broker-J Bundles ....................... SKIPPED
[INFO] Apache Qpid Broker-J Tools ......................... SUCCESS [  0.537 s]
[INFO] Apache Qpid Broker-J System Test Parent ............ SUCCESS [  0.323 s]
[INFO] Apache Qpid Broker-J System Test Utils ............. SKIPPED
[INFO] Apache Qpid Broker-J JMS System Tests Core ......... SKIPPED
[INFO] Apache Qpid Broker-J JMS 1.1 System Tests .......... SKIPPED
[INFO] Apache Qpid Broker-J JMS 2.0 System Tests .......... SKIPPED
[INFO] Apache Qpid Broker-J HTTP system tests ............. SKIPPED
[INFO] Apache Qpid Broker-J Protocol Tests Core ........... SUCCESS [  0.574 s]
[INFO] Apache Qpid Protocol Tests for AMQP 0-8,0-9,0-9-1 .. SKIPPED
[INFO] Apache Qpid Protocol Tests for AMQP 0-10 ........... SKIPPED
[INFO] Apache Qpid Protocol Tests for AMQP 1.0 ............ SKIPPED
[INFO] Apache Qpid Broker-J System Tests Spawn Broker Admin SKIPPED
[INFO] Apache Qpid Broker-J End to End Conversion Tests ... SKIPPED
[INFO] Apache Qpid Broker-J Performance Tests ............. SUCCESS [ 25.897 s]
[INFO] Apache Qpid Broker-J Performance Test System Tests . SKIPPED
[INFO] Apache Qpid Broker-J Performance Tests Visualisation JFC SKIPPED
[INFO] Apache Qpid Broker-J BDB Store System Tests ........ SKIPPED
[INFO] Apache Qpid Joram JMS Tests ........................ SUCCESS [  0.858 s]
[INFO] Apache Qpid Broker-J JMS TCK Configuration ......... SUCCESS [  0.686 s]
[INFO] Apache Qpid Broker-J Docbook ....................... SUCCESS [  0.251 s]
[INFO] Apache Qpid Broker-J Docbook ....................... SUCCESS [  0.966 s]
[INFO] Apache Qpid Broker-J Performance Test Docbook 7.1.0-SNAPSHOT SUCCESS [  0.269 s]
[INFO] ------------------------------------------------------------------------
[INFO] BUILD FAILURE
[INFO] ------------------------------------------------------------------------
[INFO] Total time: 02:18 min
[INFO] Finished at: 2018-12-19T11:58:53Z
[INFO] ------------------------------------------------------------------------
[ERROR] Failed to execute goal org.apache.maven.plugins:maven-surefire-plugin:2.22.0:test (default-test) on project qpid-broker-core: There are test failures.
[ERROR] 
[ERROR] Please refer to <https://builds.apache.org/job/Qpid-Broker-J-Test-IBMJDK1.8/2763/artifact/broker-core/target/surefire-reports/java-mms.1-0> for the individual test results.
[ERROR] Please refer to dump files (if any exist) [date]-jvmRun[N].dump, [date].dumpstream and [date]-jvmRun[N].dumpstream.
[ERROR] -> [Help 1]
[ERROR] 
[ERROR] To see the full stack trace of the errors, re-run Maven with the -e switch.
[ERROR] Re-run Maven using the -X switch to enable full debug logging.
[ERROR] 
[ERROR] For more information about the errors and possible solutions, please read the following articles:
[ERROR] [Help 1] http://cwiki.apache.org/confluence/display/MAVEN/MojoFailureException
[ERROR] 
[ERROR] After correcting the problems, you can resume the build with the command
[ERROR]   mvn <goals> -rf :qpid-broker-core
Build step 'Invoke top-level Maven targets' marked build as failure
[locks-and-latches] Releasing all the locks
[locks-and-latches] All the locks released
Archiving artifacts
Recording test results

Build failed in Jenkins: Qpid-Broker-J-Test-IBMJDK1.8 #2762

Posted by Apache Jenkins Server <je...@builds.apache.org>.
See <https://builds.apache.org/job/Qpid-Broker-J-Test-IBMJDK1.8/2762/display/redirect>

------------------------------------------
[...truncated 209.07 KB...]
[INFO] Executing tasks

main:
     [echo] Qpid Test Profile Properties
     [echo] [profile] java-mms.1-0
     [echo] [profile.broker.version] 1.0
     [echo] [profile.virtualhostnode.type] Memory
     [echo] [profile.virtualhostnode.context.blueprint] {"type":"ProvidedStore","globalAddressDomains":"${qpid.globalAddressDomains}"}
     [echo] [profile.test_receive_timeout] 1000
[INFO] Executed tasks
[INFO] 
[INFO] --- maven-enforcer-plugin:3.0.0-M2:enforce (enforce-maven-version) @ qpid-java-doc ---
[INFO] 
[INFO] --- maven-enforcer-plugin:3.0.0-M2:enforce (enforce-minimum-versions) @ qpid-java-doc ---
[INFO] 
[INFO] --- maven-enforcer-plugin:3.0.0-M2:enforce (enforce-versions-standard-properties) @ qpid-java-doc ---
[INFO] 
[INFO] --- maven-enforcer-plugin:3.0.0-M2:enforce (enforce-enableAmqp0x) @ qpid-java-doc ---
[INFO] 
[INFO] --- jacoco-maven-plugin:0.8.2:prepare-agent (default-prepare-agent) @ qpid-java-doc ---
[INFO] argLine set to -javaagent:/home/jenkins/.m2/repository/org/jacoco/org.jacoco.agent/0.8.2/org.jacoco.agent-0.8.2-runtime.jar=destfile=<https://builds.apache.org/job/Qpid-Broker-J-Test-IBMJDK1.8/ws/doc/target/jacoco.exec> -Xmx512m
[INFO] 
[INFO] --- maven-remote-resources-plugin:1.5:process (process-resource-bundles) @ qpid-java-doc ---
[INFO] 
[INFO] --- maven-site-plugin:3.7.1:attach-descriptor (attach-descriptor) @ qpid-java-doc ---
[INFO] No site descriptor found: nothing to attach.
[INFO] 
[INFO] --- maven-assembly-plugin:3.0.0:single (default) @ qpid-java-doc ---
[INFO] Assemblies have been skipped per configuration of the skipAssembly parameter.
[INFO] 
[INFO] ----------------< org.apache.qpid:qpid-java-doc-broker >----------------
[INFO] Building Apache Qpid Broker-J Docbook 7.1.0-SNAPSHOT             [12/46]
[INFO] --------------------------------[ jar ]---------------------------------
[INFO] 
[INFO] --- maven-clean-plugin:3.1.0:clean (default-clean) @ qpid-java-doc-broker ---
[INFO] 
[INFO] --- buildnumber-maven-plugin:1.4:create (default) @ qpid-java-doc-broker ---
[INFO] Executing: /bin/sh -c cd '<https://builds.apache.org/job/Qpid-Broker-J-Test-IBMJDK1.8/ws/doc/java-broker'> && 'git' 'rev-parse' '--verify' 'HEAD'
[INFO] Working directory: <https://builds.apache.org/job/Qpid-Broker-J-Test-IBMJDK1.8/ws/doc/java-broker>
[INFO] Storing buildNumber: 00f976b1fcc6db515cd3c0a0e4b22bc3a34edfec at timestamp: 1545219768167
[WARNING] Cannot get the branch information from the git repository: 
Detecting the current branch failed: fatal: ref HEAD is not a symbolic ref

[INFO] Executing: /bin/sh -c cd '<https://builds.apache.org/job/Qpid-Broker-J-Test-IBMJDK1.8/ws/doc/java-broker'> && 'git' 'rev-parse' '--verify' 'HEAD'
[INFO] Working directory: <https://builds.apache.org/job/Qpid-Broker-J-Test-IBMJDK1.8/ws/doc/java-broker>
[INFO] Storing buildScmBranch: UNKNOWN
[INFO] 
[INFO] --- maven-antrun-plugin:1.8:run (output-test-properties) @ qpid-java-doc-broker ---
[INFO] Executing tasks

main:
     [echo] Qpid Test Profile Properties
     [echo] [profile] java-mms.1-0
     [echo] [profile.broker.version] 1.0
     [echo] [profile.virtualhostnode.type] Memory
     [echo] [profile.virtualhostnode.context.blueprint] {"type":"ProvidedStore","globalAddressDomains":"${qpid.globalAddressDomains}"}
     [echo] [profile.test_receive_timeout] 1000
[INFO] Executed tasks
[INFO] 
[INFO] --- maven-enforcer-plugin:3.0.0-M2:enforce (enforce-maven-version) @ qpid-java-doc-broker ---
[INFO] 
[INFO] --- maven-enforcer-plugin:3.0.0-M2:enforce (enforce-minimum-versions) @ qpid-java-doc-broker ---
[INFO] 
[INFO] --- maven-enforcer-plugin:3.0.0-M2:enforce (enforce-versions-standard-properties) @ qpid-java-doc-broker ---
[INFO] 
[INFO] --- maven-enforcer-plugin:3.0.0-M2:enforce (enforce-enableAmqp0x) @ qpid-java-doc-broker ---
[INFO] 
[INFO] --- jacoco-maven-plugin:0.8.2:prepare-agent (default-prepare-agent) @ qpid-java-doc-broker ---
[INFO] argLine set to -javaagent:/home/jenkins/.m2/repository/org/jacoco/org.jacoco.agent/0.8.2/org.jacoco.agent-0.8.2-runtime.jar=destfile=<https://builds.apache.org/job/Qpid-Broker-J-Test-IBMJDK1.8/ws/doc/java-broker/target/jacoco.exec> -Xmx512m
[INFO] 
[INFO] --- maven-resources-plugin:3.1.0:copy-resources (filter-docbook-sources) @ qpid-java-doc-broker ---
[INFO] Using 'UTF-8' encoding to copy filtered resources.
[INFO] Copying 76 resources
[INFO] 
[INFO] --- maven-remote-resources-plugin:1.5:process (process-resource-bundles) @ qpid-java-doc-broker ---
[INFO] 
[INFO] --- maven-resources-plugin:3.1.0:resources (default-resources) @ qpid-java-doc-broker ---
[INFO] Using 'UTF-8' encoding to copy filtered resources.
[INFO] Copying 76 resources
[INFO] 
[INFO] --- maven-compiler-plugin:3.7.0:compile (default-compile) @ qpid-java-doc-broker ---
[INFO] No sources to compile
[INFO] 
[INFO] --- maven-resources-plugin:3.1.0:testResources (default-testResources) @ qpid-java-doc-broker ---
[INFO] Using 'UTF-8' encoding to copy filtered resources.
[INFO] Copying 76 resources
[INFO] 
[INFO] --- maven-compiler-plugin:3.7.0:testCompile (default-testCompile) @ qpid-java-doc-broker ---
[INFO] No sources to compile
[INFO] 
[INFO] --- maven-surefire-plugin:2.22.0:test (default-test) @ qpid-java-doc-broker ---
[INFO] No tests to run.
[INFO] 
[INFO] --- maven-jar-plugin:3.1.0:jar (default-jar) @ qpid-java-doc-broker ---
[WARNING] JAR will be empty - no content was marked for inclusion!
[INFO] Building jar: <https://builds.apache.org/job/Qpid-Broker-J-Test-IBMJDK1.8/ws/doc/java-broker/target/qpid-java-doc-broker-7.1.0-SNAPSHOT.jar>
[INFO] 
[INFO] --- maven-site-plugin:3.7.1:attach-descriptor (attach-descriptor) @ qpid-java-doc-broker ---
[INFO] Skipping because packaging 'jar' is not pom.
[INFO] 
[INFO] --- maven-assembly-plugin:3.0.0:single (default) @ qpid-java-doc-broker ---
[INFO] Assemblies have been skipped per configuration of the skipAssembly parameter.
[INFO] 
[INFO] --------------< org.apache.qpid:qpid-java-doc-perftests >---------------
[INFO] Building Apache Qpid Broker-J Performance Test Docbook 7.1.0-SNAPSHOT [13/46]
[INFO] --------------------------------[ jar ]---------------------------------
[INFO] 
[INFO] --- maven-clean-plugin:3.1.0:clean (default-clean) @ qpid-java-doc-perftests ---
[INFO] 
[INFO] --- buildnumber-maven-plugin:1.4:create (default) @ qpid-java-doc-perftests ---
[INFO] Executing: /bin/sh -c cd '<https://builds.apache.org/job/Qpid-Broker-J-Test-IBMJDK1.8/ws/doc/java-perftests'> && 'git' 'rev-parse' '--verify' 'HEAD'
[INFO] Working directory: <https://builds.apache.org/job/Qpid-Broker-J-Test-IBMJDK1.8/ws/doc/java-perftests>
[INFO] Storing buildNumber: 00f976b1fcc6db515cd3c0a0e4b22bc3a34edfec at timestamp: 1545219769034
[WARNING] Cannot get the branch information from the git repository: 
Detecting the current branch failed: fatal: ref HEAD is not a symbolic ref

[INFO] Executing: /bin/sh -c cd '<https://builds.apache.org/job/Qpid-Broker-J-Test-IBMJDK1.8/ws/doc/java-perftests'> && 'git' 'rev-parse' '--verify' 'HEAD'
[INFO] Working directory: <https://builds.apache.org/job/Qpid-Broker-J-Test-IBMJDK1.8/ws/doc/java-perftests>
[INFO] Storing buildScmBranch: UNKNOWN
[INFO] 
[INFO] --- maven-antrun-plugin:1.8:run (output-test-properties) @ qpid-java-doc-perftests ---
[INFO] Executing tasks

main:
     [echo] Qpid Test Profile Properties
     [echo] [profile] java-mms.1-0
     [echo] [profile.broker.version] 1.0
     [echo] [profile.virtualhostnode.type] Memory
     [echo] [profile.virtualhostnode.context.blueprint] {"type":"ProvidedStore","globalAddressDomains":"${qpid.globalAddressDomains}"}
     [echo] [profile.test_receive_timeout] 1000
[INFO] Executed tasks
[INFO] 
[INFO] --- maven-enforcer-plugin:3.0.0-M2:enforce (enforce-maven-version) @ qpid-java-doc-perftests ---
[INFO] 
[INFO] --- maven-enforcer-plugin:3.0.0-M2:enforce (enforce-minimum-versions) @ qpid-java-doc-perftests ---
[INFO] 
[INFO] --- maven-enforcer-plugin:3.0.0-M2:enforce (enforce-versions-standard-properties) @ qpid-java-doc-perftests ---
[INFO] 
[INFO] --- maven-enforcer-plugin:3.0.0-M2:enforce (enforce-enableAmqp0x) @ qpid-java-doc-perftests ---
[INFO] 
[INFO] --- jacoco-maven-plugin:0.8.2:prepare-agent (default-prepare-agent) @ qpid-java-doc-perftests ---
[INFO] argLine set to -javaagent:/home/jenkins/.m2/repository/org/jacoco/org.jacoco.agent/0.8.2/org.jacoco.agent-0.8.2-runtime.jar=destfile=<https://builds.apache.org/job/Qpid-Broker-J-Test-IBMJDK1.8/ws/doc/java-perftests/target/jacoco.exec> -Xmx512m
[INFO] 
[INFO] --- maven-resources-plugin:3.1.0:copy-resources (filter-docbook-sources) @ qpid-java-doc-perftests ---
[INFO] Using 'UTF-8' encoding to copy filtered resources.
[INFO] Copying 1 resource
[INFO] 
[INFO] --- maven-remote-resources-plugin:1.5:process (process-resource-bundles) @ qpid-java-doc-perftests ---
[INFO] 
[INFO] --- maven-resources-plugin:3.1.0:resources (default-resources) @ qpid-java-doc-perftests ---
[INFO] Using 'UTF-8' encoding to copy filtered resources.
[INFO] Copying 1 resource
[INFO] 
[INFO] --- maven-compiler-plugin:3.7.0:compile (default-compile) @ qpid-java-doc-perftests ---
[INFO] No sources to compile
[INFO] 
[INFO] --- maven-resources-plugin:3.1.0:testResources (default-testResources) @ qpid-java-doc-perftests ---
[INFO] Using 'UTF-8' encoding to copy filtered resources.
[INFO] Copying 1 resource
[INFO] 
[INFO] --- maven-compiler-plugin:3.7.0:testCompile (default-testCompile) @ qpid-java-doc-perftests ---
[INFO] No sources to compile
[INFO] 
[INFO] --- maven-surefire-plugin:2.22.0:test (default-test) @ qpid-java-doc-perftests ---
[INFO] No tests to run.
[INFO] 
[INFO] --- maven-jar-plugin:3.1.0:jar (default-jar) @ qpid-java-doc-perftests ---
[WARNING] JAR will be empty - no content was marked for inclusion!
[INFO] Building jar: <https://builds.apache.org/job/Qpid-Broker-J-Test-IBMJDK1.8/ws/doc/java-perftests/target/qpid-java-doc-perftests-7.1.0-SNAPSHOT.jar>
[INFO] 
[INFO] --- maven-site-plugin:3.7.1:attach-descriptor (attach-descriptor) @ qpid-java-doc-perftests ---
[INFO] Skipping because packaging 'jar' is not pom.
[INFO] 
[INFO] --- maven-assembly-plugin:3.0.0:single (default) @ qpid-java-doc-perftests ---
[INFO] Assemblies have been skipped per configuration of the skipAssembly parameter.
[INFO] ------------------------------------------------------------------------
[INFO] Reactor Summary:
[INFO] 
[INFO] Apache Qpid Broker-J Parent 7.1.0-SNAPSHOT ......... SUCCESS [  5.589 s]
[INFO] Apache Qpid Broker-J Code Generation ............... SUCCESS [  4.951 s]
[INFO] Apache Qpid Broker-J Test Utilities ................ SUCCESS [  1.461 s]
[INFO] Apache Qpid Broker-J Core .......................... FAILURE [01:29 min]
[INFO] Apache Qpid Broker-J LogBack Logging Plug-in ....... SKIPPED
[INFO] Apache Qpid Broker-J Access Control Plug-in ........ SKIPPED
[INFO] Apache Qpid Broker-J AMQP 0-10 Protocol Plug-in .... SKIPPED
[INFO] Apache Qpid Broker-J AMQP 0-8 Protocol Plug-in ..... SKIPPED
[INFO] Apache Qpid Broker-J AMQP 1-0 Protocol Plug-in ..... SKIPPED
[INFO] Apache Qpid Broker-J AMQP 0-8 to 0-10 Message Conversion Plug-in SKIPPED
[INFO] Apache Qpid Broker-J AMQP 0-8 to 1-0 Message Conversion Plug-in SKIPPED
[INFO] Apache Qpid Broker-J AMQP 0-10 to 1-0 Message Conversion Plug-in SKIPPED
[INFO] Apache Qpid Broker-J JDBC Message Store Plug-in .... SKIPPED
[INFO] Apache Qpid Broker-J Derby Message Store Plug-in ... SKIPPED
[INFO] Apache Qpid Broker-J JDBC Message Store Connection Pooling Plug-in SKIPPED
[INFO] Apache Qpid AMQP 1.0 JDBC Link Store Plug-in ....... SKIPPED
[INFO] Apache Qpid Broker-J HTTP Management Plug-in ....... SKIPPED
[INFO] Apache Qpid Broker-J AMQP Management Protocol Plug-in SKIPPED
[INFO] Apache Qpid Broker-J Memory Message Store Plug-in .. SKIPPED
[INFO] Apache Qpid Broker-J WebSocket Plug-in ............. SKIPPED
[INFO] Apache Qpid Broker-J BDB Message Store Plug-in ..... SKIPPED
[INFO] Apache Qpid AMQP 1.0 BDB Link Store Plug-in ........ SKIPPED
[INFO] Apache Qpid Broker-J ............................... SKIPPED
[INFO] Apache Qpid Broker-J Bundles ....................... SKIPPED
[INFO] Apache Qpid Broker-J Tools ......................... SUCCESS [  0.672 s]
[INFO] Apache Qpid Broker-J System Test Parent ............ SUCCESS [  0.291 s]
[INFO] Apache Qpid Broker-J System Test Utils ............. SKIPPED
[INFO] Apache Qpid Broker-J JMS System Tests Core ......... SKIPPED
[INFO] Apache Qpid Broker-J JMS 1.1 System Tests .......... SKIPPED
[INFO] Apache Qpid Broker-J JMS 2.0 System Tests .......... SKIPPED
[INFO] Apache Qpid Broker-J HTTP system tests ............. SKIPPED
[INFO] Apache Qpid Broker-J Protocol Tests Core ........... SUCCESS [  0.731 s]
[INFO] Apache Qpid Protocol Tests for AMQP 0-8,0-9,0-9-1 .. SKIPPED
[INFO] Apache Qpid Protocol Tests for AMQP 0-10 ........... SKIPPED
[INFO] Apache Qpid Protocol Tests for AMQP 1.0 ............ SKIPPED
[INFO] Apache Qpid Broker-J System Tests Spawn Broker Admin SKIPPED
[INFO] Apache Qpid Broker-J End to End Conversion Tests ... SKIPPED
[INFO] Apache Qpid Broker-J Performance Tests ............. SUCCESS [ 23.394 s]
[INFO] Apache Qpid Broker-J Performance Test System Tests . SKIPPED
[INFO] Apache Qpid Broker-J Performance Tests Visualisation JFC SKIPPED
[INFO] Apache Qpid Broker-J BDB Store System Tests ........ SKIPPED
[INFO] Apache Qpid Joram JMS Tests ........................ SUCCESS [  0.811 s]
[INFO] Apache Qpid Broker-J JMS TCK Configuration ......... SUCCESS [  0.358 s]
[INFO] Apache Qpid Broker-J Docbook ....................... SUCCESS [  0.106 s]
[INFO] Apache Qpid Broker-J Docbook ....................... SUCCESS [  0.857 s]
[INFO] Apache Qpid Broker-J Performance Test Docbook 7.1.0-SNAPSHOT SUCCESS [  0.252 s]
[INFO] ------------------------------------------------------------------------
[INFO] BUILD FAILURE
[INFO] ------------------------------------------------------------------------
[INFO] Total time: 02:11 min
[INFO] Finished at: 2018-12-19T11:42:49Z
[INFO] ------------------------------------------------------------------------
[ERROR] Failed to execute goal org.apache.maven.plugins:maven-surefire-plugin:2.22.0:test (default-test) on project qpid-broker-core: There are test failures.
[ERROR] 
[ERROR] Please refer to <https://builds.apache.org/job/Qpid-Broker-J-Test-IBMJDK1.8/2762/artifact/broker-core/target/surefire-reports/java-mms.1-0> for the individual test results.
[ERROR] Please refer to dump files (if any exist) [date]-jvmRun[N].dump, [date].dumpstream and [date]-jvmRun[N].dumpstream.
[ERROR] -> [Help 1]
[ERROR] 
[ERROR] To see the full stack trace of the errors, re-run Maven with the -e switch.
[ERROR] Re-run Maven using the -X switch to enable full debug logging.
[ERROR] 
[ERROR] For more information about the errors and possible solutions, please read the following articles:
[ERROR] [Help 1] http://cwiki.apache.org/confluence/display/MAVEN/MojoFailureException
[ERROR] 
[ERROR] After correcting the problems, you can resume the build with the command
[ERROR]   mvn <goals> -rf :qpid-broker-core
Build step 'Invoke top-level Maven targets' marked build as failure
[locks-and-latches] Releasing all the locks
[locks-and-latches] All the locks released
Archiving artifacts
Recording test results

Build failed in Jenkins: Qpid-Broker-J-Test-IBMJDK1.8 #2761

Posted by Apache Jenkins Server <je...@builds.apache.org>.
See <https://builds.apache.org/job/Qpid-Broker-J-Test-IBMJDK1.8/2761/display/redirect>

------------------------------------------
[...truncated 209.03 KB...]
[INFO] Executing tasks

main:
     [echo] Qpid Test Profile Properties
     [echo] [profile] java-mms.1-0
     [echo] [profile.broker.version] 1.0
     [echo] [profile.virtualhostnode.type] Memory
     [echo] [profile.virtualhostnode.context.blueprint] {"type":"ProvidedStore","globalAddressDomains":"${qpid.globalAddressDomains}"}
     [echo] [profile.test_receive_timeout] 1000
[INFO] Executed tasks
[INFO] 
[INFO] --- maven-enforcer-plugin:3.0.0-M2:enforce (enforce-maven-version) @ qpid-java-doc ---
[INFO] 
[INFO] --- maven-enforcer-plugin:3.0.0-M2:enforce (enforce-minimum-versions) @ qpid-java-doc ---
[INFO] 
[INFO] --- maven-enforcer-plugin:3.0.0-M2:enforce (enforce-versions-standard-properties) @ qpid-java-doc ---
[INFO] 
[INFO] --- maven-enforcer-plugin:3.0.0-M2:enforce (enforce-enableAmqp0x) @ qpid-java-doc ---
[INFO] 
[INFO] --- jacoco-maven-plugin:0.8.2:prepare-agent (default-prepare-agent) @ qpid-java-doc ---
[INFO] argLine set to -javaagent:/home/jenkins/.m2/repository/org/jacoco/org.jacoco.agent/0.8.2/org.jacoco.agent-0.8.2-runtime.jar=destfile=<https://builds.apache.org/job/Qpid-Broker-J-Test-IBMJDK1.8/ws/doc/target/jacoco.exec> -Xmx512m
[INFO] 
[INFO] --- maven-remote-resources-plugin:1.5:process (process-resource-bundles) @ qpid-java-doc ---
[INFO] 
[INFO] --- maven-site-plugin:3.7.1:attach-descriptor (attach-descriptor) @ qpid-java-doc ---
[INFO] No site descriptor found: nothing to attach.
[INFO] 
[INFO] --- maven-assembly-plugin:3.0.0:single (default) @ qpid-java-doc ---
[INFO] Assemblies have been skipped per configuration of the skipAssembly parameter.
[INFO] 
[INFO] ----------------< org.apache.qpid:qpid-java-doc-broker >----------------
[INFO] Building Apache Qpid Broker-J Docbook 7.1.0-SNAPSHOT             [12/46]
[INFO] --------------------------------[ jar ]---------------------------------
[INFO] 
[INFO] --- maven-clean-plugin:3.1.0:clean (default-clean) @ qpid-java-doc-broker ---
[INFO] 
[INFO] --- buildnumber-maven-plugin:1.4:create (default) @ qpid-java-doc-broker ---
[INFO] Executing: /bin/sh -c cd '<https://builds.apache.org/job/Qpid-Broker-J-Test-IBMJDK1.8/ws/doc/java-broker'> && 'git' 'rev-parse' '--verify' 'HEAD'
[INFO] Working directory: <https://builds.apache.org/job/Qpid-Broker-J-Test-IBMJDK1.8/ws/doc/java-broker>
[INFO] Storing buildNumber: f4807cbd0297203c322deb54ce02b2c54e19cf44 at timestamp: 1545158253437
[WARNING] Cannot get the branch information from the git repository: 
Detecting the current branch failed: fatal: ref HEAD is not a symbolic ref

[INFO] Executing: /bin/sh -c cd '<https://builds.apache.org/job/Qpid-Broker-J-Test-IBMJDK1.8/ws/doc/java-broker'> && 'git' 'rev-parse' '--verify' 'HEAD'
[INFO] Working directory: <https://builds.apache.org/job/Qpid-Broker-J-Test-IBMJDK1.8/ws/doc/java-broker>
[INFO] Storing buildScmBranch: UNKNOWN
[INFO] 
[INFO] --- maven-antrun-plugin:1.8:run (output-test-properties) @ qpid-java-doc-broker ---
[INFO] Executing tasks

main:
     [echo] Qpid Test Profile Properties
     [echo] [profile] java-mms.1-0
     [echo] [profile.broker.version] 1.0
     [echo] [profile.virtualhostnode.type] Memory
     [echo] [profile.virtualhostnode.context.blueprint] {"type":"ProvidedStore","globalAddressDomains":"${qpid.globalAddressDomains}"}
     [echo] [profile.test_receive_timeout] 1000
[INFO] Executed tasks
[INFO] 
[INFO] --- maven-enforcer-plugin:3.0.0-M2:enforce (enforce-maven-version) @ qpid-java-doc-broker ---
[INFO] 
[INFO] --- maven-enforcer-plugin:3.0.0-M2:enforce (enforce-minimum-versions) @ qpid-java-doc-broker ---
[INFO] 
[INFO] --- maven-enforcer-plugin:3.0.0-M2:enforce (enforce-versions-standard-properties) @ qpid-java-doc-broker ---
[INFO] 
[INFO] --- maven-enforcer-plugin:3.0.0-M2:enforce (enforce-enableAmqp0x) @ qpid-java-doc-broker ---
[INFO] 
[INFO] --- jacoco-maven-plugin:0.8.2:prepare-agent (default-prepare-agent) @ qpid-java-doc-broker ---
[INFO] argLine set to -javaagent:/home/jenkins/.m2/repository/org/jacoco/org.jacoco.agent/0.8.2/org.jacoco.agent-0.8.2-runtime.jar=destfile=<https://builds.apache.org/job/Qpid-Broker-J-Test-IBMJDK1.8/ws/doc/java-broker/target/jacoco.exec> -Xmx512m
[INFO] 
[INFO] --- maven-resources-plugin:3.1.0:copy-resources (filter-docbook-sources) @ qpid-java-doc-broker ---
[INFO] Using 'UTF-8' encoding to copy filtered resources.
[INFO] Copying 76 resources
[INFO] 
[INFO] --- maven-remote-resources-plugin:1.5:process (process-resource-bundles) @ qpid-java-doc-broker ---
[INFO] 
[INFO] --- maven-resources-plugin:3.1.0:resources (default-resources) @ qpid-java-doc-broker ---
[INFO] Using 'UTF-8' encoding to copy filtered resources.
[INFO] Copying 76 resources
[INFO] 
[INFO] --- maven-compiler-plugin:3.7.0:compile (default-compile) @ qpid-java-doc-broker ---
[INFO] No sources to compile
[INFO] 
[INFO] --- maven-resources-plugin:3.1.0:testResources (default-testResources) @ qpid-java-doc-broker ---
[INFO] Using 'UTF-8' encoding to copy filtered resources.
[INFO] Copying 76 resources
[INFO] 
[INFO] --- maven-compiler-plugin:3.7.0:testCompile (default-testCompile) @ qpid-java-doc-broker ---
[INFO] No sources to compile
[INFO] 
[INFO] --- maven-surefire-plugin:2.22.0:test (default-test) @ qpid-java-doc-broker ---
[INFO] No tests to run.
[INFO] 
[INFO] --- maven-jar-plugin:3.1.0:jar (default-jar) @ qpid-java-doc-broker ---
[WARNING] JAR will be empty - no content was marked for inclusion!
[INFO] Building jar: <https://builds.apache.org/job/Qpid-Broker-J-Test-IBMJDK1.8/ws/doc/java-broker/target/qpid-java-doc-broker-7.1.0-SNAPSHOT.jar>
[INFO] 
[INFO] --- maven-site-plugin:3.7.1:attach-descriptor (attach-descriptor) @ qpid-java-doc-broker ---
[INFO] Skipping because packaging 'jar' is not pom.
[INFO] 
[INFO] --- maven-assembly-plugin:3.0.0:single (default) @ qpid-java-doc-broker ---
[INFO] Assemblies have been skipped per configuration of the skipAssembly parameter.
[INFO] 
[INFO] --------------< org.apache.qpid:qpid-java-doc-perftests >---------------
[INFO] Building Apache Qpid Broker-J Performance Test Docbook 7.1.0-SNAPSHOT [13/46]
[INFO] --------------------------------[ jar ]---------------------------------
[INFO] 
[INFO] --- maven-clean-plugin:3.1.0:clean (default-clean) @ qpid-java-doc-perftests ---
[INFO] 
[INFO] --- buildnumber-maven-plugin:1.4:create (default) @ qpid-java-doc-perftests ---
[INFO] Executing: /bin/sh -c cd '<https://builds.apache.org/job/Qpid-Broker-J-Test-IBMJDK1.8/ws/doc/java-perftests'> && 'git' 'rev-parse' '--verify' 'HEAD'
[INFO] Working directory: <https://builds.apache.org/job/Qpid-Broker-J-Test-IBMJDK1.8/ws/doc/java-perftests>
[INFO] Storing buildNumber: f4807cbd0297203c322deb54ce02b2c54e19cf44 at timestamp: 1545158254060
[WARNING] Cannot get the branch information from the git repository: 
Detecting the current branch failed: fatal: ref HEAD is not a symbolic ref

[INFO] Executing: /bin/sh -c cd '<https://builds.apache.org/job/Qpid-Broker-J-Test-IBMJDK1.8/ws/doc/java-perftests'> && 'git' 'rev-parse' '--verify' 'HEAD'
[INFO] Working directory: <https://builds.apache.org/job/Qpid-Broker-J-Test-IBMJDK1.8/ws/doc/java-perftests>
[INFO] Storing buildScmBranch: UNKNOWN
[INFO] 
[INFO] --- maven-antrun-plugin:1.8:run (output-test-properties) @ qpid-java-doc-perftests ---
[INFO] Executing tasks

main:
     [echo] Qpid Test Profile Properties
     [echo] [profile] java-mms.1-0
     [echo] [profile.broker.version] 1.0
     [echo] [profile.virtualhostnode.type] Memory
     [echo] [profile.virtualhostnode.context.blueprint] {"type":"ProvidedStore","globalAddressDomains":"${qpid.globalAddressDomains}"}
     [echo] [profile.test_receive_timeout] 1000
[INFO] Executed tasks
[INFO] 
[INFO] --- maven-enforcer-plugin:3.0.0-M2:enforce (enforce-maven-version) @ qpid-java-doc-perftests ---
[INFO] 
[INFO] --- maven-enforcer-plugin:3.0.0-M2:enforce (enforce-minimum-versions) @ qpid-java-doc-perftests ---
[INFO] 
[INFO] --- maven-enforcer-plugin:3.0.0-M2:enforce (enforce-versions-standard-properties) @ qpid-java-doc-perftests ---
[INFO] 
[INFO] --- maven-enforcer-plugin:3.0.0-M2:enforce (enforce-enableAmqp0x) @ qpid-java-doc-perftests ---
[INFO] 
[INFO] --- jacoco-maven-plugin:0.8.2:prepare-agent (default-prepare-agent) @ qpid-java-doc-perftests ---
[INFO] argLine set to -javaagent:/home/jenkins/.m2/repository/org/jacoco/org.jacoco.agent/0.8.2/org.jacoco.agent-0.8.2-runtime.jar=destfile=<https://builds.apache.org/job/Qpid-Broker-J-Test-IBMJDK1.8/ws/doc/java-perftests/target/jacoco.exec> -Xmx512m
[INFO] 
[INFO] --- maven-resources-plugin:3.1.0:copy-resources (filter-docbook-sources) @ qpid-java-doc-perftests ---
[INFO] Using 'UTF-8' encoding to copy filtered resources.
[INFO] Copying 1 resource
[INFO] 
[INFO] --- maven-remote-resources-plugin:1.5:process (process-resource-bundles) @ qpid-java-doc-perftests ---
[INFO] 
[INFO] --- maven-resources-plugin:3.1.0:resources (default-resources) @ qpid-java-doc-perftests ---
[INFO] Using 'UTF-8' encoding to copy filtered resources.
[INFO] Copying 1 resource
[INFO] 
[INFO] --- maven-compiler-plugin:3.7.0:compile (default-compile) @ qpid-java-doc-perftests ---
[INFO] No sources to compile
[INFO] 
[INFO] --- maven-resources-plugin:3.1.0:testResources (default-testResources) @ qpid-java-doc-perftests ---
[INFO] Using 'UTF-8' encoding to copy filtered resources.
[INFO] Copying 1 resource
[INFO] 
[INFO] --- maven-compiler-plugin:3.7.0:testCompile (default-testCompile) @ qpid-java-doc-perftests ---
[INFO] No sources to compile
[INFO] 
[INFO] --- maven-surefire-plugin:2.22.0:test (default-test) @ qpid-java-doc-perftests ---
[INFO] No tests to run.
[INFO] 
[INFO] --- maven-jar-plugin:3.1.0:jar (default-jar) @ qpid-java-doc-perftests ---
[WARNING] JAR will be empty - no content was marked for inclusion!
[INFO] Building jar: <https://builds.apache.org/job/Qpid-Broker-J-Test-IBMJDK1.8/ws/doc/java-perftests/target/qpid-java-doc-perftests-7.1.0-SNAPSHOT.jar>
[INFO] 
[INFO] --- maven-site-plugin:3.7.1:attach-descriptor (attach-descriptor) @ qpid-java-doc-perftests ---
[INFO] Skipping because packaging 'jar' is not pom.
[INFO] 
[INFO] --- maven-assembly-plugin:3.0.0:single (default) @ qpid-java-doc-perftests ---
[INFO] Assemblies have been skipped per configuration of the skipAssembly parameter.
[INFO] ------------------------------------------------------------------------
[INFO] Reactor Summary:
[INFO] 
[INFO] Apache Qpid Broker-J Parent 7.1.0-SNAPSHOT ......... SUCCESS [  6.896 s]
[INFO] Apache Qpid Broker-J Code Generation ............... SUCCESS [  4.634 s]
[INFO] Apache Qpid Broker-J Test Utilities ................ SUCCESS [  1.353 s]
[INFO] Apache Qpid Broker-J Core .......................... FAILURE [01:28 min]
[INFO] Apache Qpid Broker-J LogBack Logging Plug-in ....... SKIPPED
[INFO] Apache Qpid Broker-J Access Control Plug-in ........ SKIPPED
[INFO] Apache Qpid Broker-J AMQP 0-10 Protocol Plug-in .... SKIPPED
[INFO] Apache Qpid Broker-J AMQP 0-8 Protocol Plug-in ..... SKIPPED
[INFO] Apache Qpid Broker-J AMQP 1-0 Protocol Plug-in ..... SKIPPED
[INFO] Apache Qpid Broker-J AMQP 0-8 to 0-10 Message Conversion Plug-in SKIPPED
[INFO] Apache Qpid Broker-J AMQP 0-8 to 1-0 Message Conversion Plug-in SKIPPED
[INFO] Apache Qpid Broker-J AMQP 0-10 to 1-0 Message Conversion Plug-in SKIPPED
[INFO] Apache Qpid Broker-J JDBC Message Store Plug-in .... SKIPPED
[INFO] Apache Qpid Broker-J Derby Message Store Plug-in ... SKIPPED
[INFO] Apache Qpid Broker-J JDBC Message Store Connection Pooling Plug-in SKIPPED
[INFO] Apache Qpid AMQP 1.0 JDBC Link Store Plug-in ....... SKIPPED
[INFO] Apache Qpid Broker-J HTTP Management Plug-in ....... SKIPPED
[INFO] Apache Qpid Broker-J AMQP Management Protocol Plug-in SKIPPED
[INFO] Apache Qpid Broker-J Memory Message Store Plug-in .. SKIPPED
[INFO] Apache Qpid Broker-J WebSocket Plug-in ............. SKIPPED
[INFO] Apache Qpid Broker-J BDB Message Store Plug-in ..... SKIPPED
[INFO] Apache Qpid AMQP 1.0 BDB Link Store Plug-in ........ SKIPPED
[INFO] Apache Qpid Broker-J ............................... SKIPPED
[INFO] Apache Qpid Broker-J Bundles ....................... SKIPPED
[INFO] Apache Qpid Broker-J Tools ......................... SUCCESS [  0.536 s]
[INFO] Apache Qpid Broker-J System Test Parent ............ SUCCESS [  0.190 s]
[INFO] Apache Qpid Broker-J System Test Utils ............. SKIPPED
[INFO] Apache Qpid Broker-J JMS System Tests Core ......... SKIPPED
[INFO] Apache Qpid Broker-J JMS 1.1 System Tests .......... SKIPPED
[INFO] Apache Qpid Broker-J JMS 2.0 System Tests .......... SKIPPED
[INFO] Apache Qpid Broker-J HTTP system tests ............. SKIPPED
[INFO] Apache Qpid Broker-J Protocol Tests Core ........... SUCCESS [  0.902 s]
[INFO] Apache Qpid Protocol Tests for AMQP 0-8,0-9,0-9-1 .. SKIPPED
[INFO] Apache Qpid Protocol Tests for AMQP 0-10 ........... SKIPPED
[INFO] Apache Qpid Protocol Tests for AMQP 1.0 ............ SKIPPED
[INFO] Apache Qpid Broker-J System Tests Spawn Broker Admin SKIPPED
[INFO] Apache Qpid Broker-J End to End Conversion Tests ... SKIPPED
[INFO] Apache Qpid Broker-J Performance Tests ............. SUCCESS [ 29.783 s]
[INFO] Apache Qpid Broker-J Performance Test System Tests . SKIPPED
[INFO] Apache Qpid Broker-J Performance Tests Visualisation JFC SKIPPED
[INFO] Apache Qpid Broker-J BDB Store System Tests ........ SKIPPED
[INFO] Apache Qpid Joram JMS Tests ........................ SUCCESS [  0.618 s]
[INFO] Apache Qpid Broker-J JMS TCK Configuration ......... SUCCESS [  0.338 s]
[INFO] Apache Qpid Broker-J Docbook ....................... SUCCESS [  0.094 s]
[INFO] Apache Qpid Broker-J Docbook ....................... SUCCESS [  0.621 s]
[INFO] Apache Qpid Broker-J Performance Test Docbook 7.1.0-SNAPSHOT SUCCESS [  0.142 s]
[INFO] ------------------------------------------------------------------------
[INFO] BUILD FAILURE
[INFO] ------------------------------------------------------------------------
[INFO] Total time: 02:16 min
[INFO] Finished at: 2018-12-18T18:37:34Z
[INFO] ------------------------------------------------------------------------
[ERROR] Failed to execute goal org.apache.maven.plugins:maven-surefire-plugin:2.22.0:test (default-test) on project qpid-broker-core: There are test failures.
[ERROR] 
[ERROR] Please refer to <https://builds.apache.org/job/Qpid-Broker-J-Test-IBMJDK1.8/2761/artifact/broker-core/target/surefire-reports/java-mms.1-0> for the individual test results.
[ERROR] Please refer to dump files (if any exist) [date]-jvmRun[N].dump, [date].dumpstream and [date]-jvmRun[N].dumpstream.
[ERROR] -> [Help 1]
[ERROR] 
[ERROR] To see the full stack trace of the errors, re-run Maven with the -e switch.
[ERROR] Re-run Maven using the -X switch to enable full debug logging.
[ERROR] 
[ERROR] For more information about the errors and possible solutions, please read the following articles:
[ERROR] [Help 1] http://cwiki.apache.org/confluence/display/MAVEN/MojoFailureException
[ERROR] 
[ERROR] After correcting the problems, you can resume the build with the command
[ERROR]   mvn <goals> -rf :qpid-broker-core
Build step 'Invoke top-level Maven targets' marked build as failure
[locks-and-latches] Releasing all the locks
[locks-and-latches] All the locks released
Archiving artifacts
Recording test results