You are viewing a plain text version of this content. The canonical link for it is here.
Posted to builds@beam.apache.org by Apache Jenkins Server <je...@builds.apache.org> on 2022/08/05 18:27:55 UTC

Build failed in Jenkins: beam_PostCommit_Java_Tpcds_Flink #198

See <https://ci-beam.apache.org/job/beam_PostCommit_Java_Tpcds_Flink/198/display/redirect?page=changes>

Changes:

[yathu] Moving misplaced CHANGES from template to 2.41.0

[noreply] [BEAM-14117] Delete vendored bytebuddy gradle build (#22594)

[noreply] Add Import transform to Go FhirIO (#22460)

[noreply] Allow unsafe triggers for python nexmark benchmarks (#22596)


------------------------------------------
[...truncated 2.21 KB...]
+ echo '*** RUN TPC-DS USING FLINK RUNNER ***'
*** RUN TPC-DS USING FLINK RUNNER ***
[Gradle] - Launching build.
[src] $ <https://ci-beam.apache.org/job/beam_PostCommit_Java_Tpcds_Flink/ws/src/gradlew> --continue --max-****s=8 -Dorg.gradle.jvmargs=-Xms2g -Dorg.gradle.jvmargs=-Xmx6g -Dorg.gradle.vfs.watch=false -Pdocker-pull-licenses -Ptpcds.runner=:runners:flink:1.13 "-Ptpcds.args=--bigQueryTable=tpcds --bigQueryDataset=tpcds --project=apache-beam-testing --resourceNameMode=QUERY_RUNNER_AND_MODE --exportSummaryToBigQuery=true --tempLocation=gs://temp-storage-for-perf-tests/tpcds --influxDatabase=beam_test_metrics --influxHost=http://10.128.0.96:8086 --baseInfluxMeasurement=tpcds --exportSummaryToInfluxDB=true --influxRetentionPolicy=forever --runner=FlinkRunner --parallelism=4 --dataSize=1GB --sourceType=PARQUET --dataDirectory=gs://beam-tpcds/datasets/parquet/partitioned --resultsDirectory=gs://beam-tpcds/results/flink/ --tpcParallel=1 --queries=3" :sdks:java:testing:tpcds:run
Starting a Gradle Daemon (subsequent builds will be faster)
Configuration on demand is an incubating feature.
> Task :buildSrc:compileJava NO-SOURCE
> Task :buildSrc:compileGroovy FROM-CACHE
> Task :buildSrc:pluginDescriptors
> Task :buildSrc:processResources
> Task :buildSrc:classes
> Task :buildSrc:jar
> Task :buildSrc:assemble
> Task :buildSrc:spotlessGroovy FROM-CACHE
> Task :buildSrc:spotlessGroovyCheck UP-TO-DATE
> Task :buildSrc:spotlessGroovyGradle FROM-CACHE
> Task :buildSrc:spotlessGroovyGradleCheck UP-TO-DATE
> Task :buildSrc:spotlessCheck UP-TO-DATE
> Task :buildSrc:pluginUnderTestMetadata
> Task :buildSrc:compileTestJava NO-SOURCE
> Task :buildSrc:compileTestGroovy NO-SOURCE
> Task :buildSrc:processTestResources NO-SOURCE
> Task :buildSrc:testClasses UP-TO-DATE
> Task :buildSrc:test NO-SOURCE
> Task :buildSrc:validatePlugins FROM-CACHE
> Task :buildSrc:check UP-TO-DATE
> Task :buildSrc:build
> Task :model:job-management:createCheckerFrameworkManifest
> Task :runners:direct-java:createCheckerFrameworkManifest
> Task :sdks:java:fn-execution:createCheckerFrameworkManifest
> Task :runners:core-java:createCheckerFrameworkManifest
> Task :model:pipeline:createCheckerFrameworkManifest
> Task :sdks:java:core:createCheckerFrameworkManifest
> Task :model:fn-execution:createCheckerFrameworkManifest
> Task :runners:core-construction-java:createCheckerFrameworkManifest
> Task :sdks:java:fn-execution:processResources NO-SOURCE
> Task :runners:core-construction-java:processResources NO-SOURCE
> Task :runners:core-java:processResources NO-SOURCE
> Task :sdks:java:core:generateAvroProtocol NO-SOURCE
> Task :sdks:java:core:generateAvroJava NO-SOURCE
> Task :model:job-management:extractProto
> Task :runners:java-fn-execution:createCheckerFrameworkManifest
> Task :sdks:java:harness:createCheckerFrameworkManifest
> Task :model:fn-execution:extractProto
> Task :sdks:java:harness:processResources NO-SOURCE
> Task :runners:direct-java:processResources NO-SOURCE
> Task :runners:local-java:createCheckerFrameworkManifest
> Task :sdks:java:extensions:google-cloud-platform-core:createCheckerFrameworkManifest
> Task :runners:java-fn-execution:processResources NO-SOURCE
> Task :runners:local-java:processResources NO-SOURCE
> Task :sdks:java:extensions:google-cloud-platform-core:processResources NO-SOURCE
> Task :runners:google-cloud-dataflow-java:createCheckerFrameworkManifest
> Task :sdks:java:expansion-service:createCheckerFrameworkManifest
> Task :model:job-management:processResources
> Task :model:fn-execution:processResources
> Task :sdks:java:expansion-service:processResources NO-SOURCE
> Task :sdks:java:core:generateGrammarSource FROM-CACHE
> Task :sdks:java:extensions:arrow:createCheckerFrameworkManifest
> Task :sdks:java:extensions:arrow:processResources NO-SOURCE
> Task :sdks:java:io:google-cloud-platform:createCheckerFrameworkManifest
> Task :sdks:java:extensions:protobuf:createCheckerFrameworkManifest
> Task :sdks:java:io:kafka:createCheckerFrameworkManifest
> Task :runners:java-job-service:createCheckerFrameworkManifest
> Task :sdks:java:extensions:protobuf:extractProto
> Task :sdks:java:io:google-cloud-platform:processResources NO-SOURCE
> Task :sdks:java:io:kafka:processResources NO-SOURCE
> Task :runners:java-job-service:processResources NO-SOURCE
> Task :sdks:java:extensions:protobuf:processResources NO-SOURCE
> Task :runners:flink:1.13:copySourceOverrides
> Task :runners:flink:1.13:createCheckerFrameworkManifest
> Task :sdks:java:extensions:join-library:createCheckerFrameworkManifest
> Task :sdks:java:build-tools:createCheckerFrameworkManifest
> Task :sdks:java:io:mongodb:createCheckerFrameworkManifest
> Task :runners:flink:1.13:copyResourcesOverrides NO-SOURCE
> Task :sdks:java:extensions:join-library:processResources NO-SOURCE
> Task :sdks:java:io:mongodb:processResources NO-SOURCE
> Task :runners:flink:1.13:processResources
> Task :sdks:java:core:processResources
> Task :runners:google-cloud-dataflow-java:processResources
> Task :sdks:java:io:hadoop-common:createCheckerFrameworkManifest
> Task :sdks:java:io:parquet:createCheckerFrameworkManifest
> Task :sdks:java:io:parquet:processResources NO-SOURCE
> Task :sdks:java:io:hadoop-common:processResources NO-SOURCE
> Task :sdks:java:extensions:sql:zetasql:createCheckerFrameworkManifest
> Task :sdks:java:testing:tpcds:createCheckerFrameworkManifest
> Task :sdks:java:extensions:sql:udf:createCheckerFrameworkManifest
> Task :sdks:java:extensions:sql:zetasql:processResources NO-SOURCE
> Task :sdks:java:extensions:sql:udf:compileJava FROM-CACHE
> Task :sdks:java:build-tools:compileJava FROM-CACHE
> Task :sdks:java:extensions:sql:udf:processResources NO-SOURCE
> Task :sdks:java:extensions:sql:udf:classes UP-TO-DATE
> Task :sdks:java:build-tools:processResources
> Task :sdks:java:build-tools:classes
> Task :sdks:java:extensions:sql:udf:jar
> Task :sdks:java:build-tools:jar
> Task :sdks:java:testing:tpcds:processResources
> Task :model:pipeline:extractIncludeProto
> Task :model:pipeline:extractProto
> Task :model:pipeline:generateProto FROM-CACHE
> Task :sdks:java:extensions:sql:copyFmppTemplatesFromCalciteCore
> Task :sdks:java:extensions:sql:copyFmppTemplatesFromSrc
> Task :model:pipeline:compileJava FROM-CACHE
> Task :model:pipeline:processResources
> Task :model:pipeline:classes
> Task :model:pipeline:jar
> Task :model:pipeline:shadowJar FROM-CACHE
> Task :sdks:java:extensions:sql:generateFmppSources
> Task :model:job-management:extractIncludeProto
> Task :model:fn-execution:extractIncludeProto
> Task :model:job-management:generateProto FROM-CACHE
> Task :model:fn-execution:generateProto FROM-CACHE
> Task :model:job-management:compileJava FROM-CACHE
> Task :model:job-management:classes
> Task :model:fn-execution:compileJava FROM-CACHE
> Task :model:fn-execution:classes
> Task :model:job-management:shadowJar FROM-CACHE
> Task :model:fn-execution:shadowJar FROM-CACHE

> Task :sdks:java:extensions:sql:compileJavacc
Java Compiler Compiler Version 4.0 (Parser Generator)
(type "javacc" with no arguments for help)
Reading from file <https://ci-beam.apache.org/job/beam_PostCommit_Java_Tpcds_Flink/ws/src/sdks/java/extensions/sql/build/generated/fmpp/javacc/Parser.jj> . . .
Note: UNICODE_INPUT option is specified. Please make sure you create the parser/lexer using a Reader with the correct character encoding.
Warning: Lookahead adequacy checking not being performed since option LOOKAHEAD is more than 1.  Set option FORCE_LA_CHECK to true to force checking.
File "TokenMgrError.java" does not exist.  Will create one.
File "ParseException.java" does not exist.  Will create one.
File "Token.java" does not exist.  Will create one.
File "SimpleCharStream.java" does not exist.  Will create one.
Parser generated with 0 errors and 1 warnings.

> Task :sdks:java:extensions:sql:createCheckerFrameworkManifest
> Task :sdks:java:extensions:sql:processResources
> Task :sdks:java:core:compileJava FROM-CACHE
> Task :sdks:java:core:classes
> Task :sdks:java:core:shadowJar FROM-CACHE
> Task :sdks:java:extensions:join-library:compileJava FROM-CACHE
> Task :sdks:java:extensions:join-library:classes UP-TO-DATE
> Task :sdks:java:extensions:join-library:jar
> Task :runners:local-java:compileJava FROM-CACHE
> Task :runners:local-java:classes UP-TO-DATE
> Task :sdks:java:io:mongodb:compileJava FROM-CACHE
> Task :sdks:java:io:mongodb:classes UP-TO-DATE
> Task :runners:local-java:jar
> Task :sdks:java:io:mongodb:jar
> Task :sdks:java:extensions:arrow:compileJava FROM-CACHE
> Task :sdks:java:extensions:arrow:classes UP-TO-DATE
> Task :sdks:java:extensions:arrow:jar
> Task :sdks:java:io:hadoop-common:compileJava FROM-CACHE
> Task :sdks:java:io:hadoop-common:classes UP-TO-DATE
> Task :sdks:java:io:hadoop-common:jar
> Task :sdks:java:extensions:protobuf:extractIncludeProto
> Task :sdks:java:extensions:protobuf:generateProto NO-SOURCE
> Task :sdks:java:io:parquet:compileJava FROM-CACHE
> Task :sdks:java:io:parquet:classes UP-TO-DATE
> Task :sdks:java:fn-execution:compileJava FROM-CACHE
> Task :sdks:java:fn-execution:classes UP-TO-DATE
> Task :sdks:java:extensions:protobuf:compileJava FROM-CACHE
> Task :sdks:java:extensions:protobuf:classes UP-TO-DATE
> Task :sdks:java:io:parquet:jar
> Task :sdks:java:fn-execution:jar
> Task :sdks:java:extensions:protobuf:jar
> Task :runners:core-construction-java:compileJava FROM-CACHE
> Task :runners:core-construction-java:classes UP-TO-DATE
> Task :runners:core-construction-java:jar
> Task :runners:core-java:compileJava FROM-CACHE
> Task :runners:core-java:classes UP-TO-DATE
> Task :runners:core-java:jar
> Task :sdks:java:extensions:google-cloud-platform-core:compileJava FROM-CACHE
> Task :sdks:java:extensions:google-cloud-platform-core:classes UP-TO-DATE
> Task :sdks:java:extensions:google-cloud-platform-core:jar
> Task :sdks:java:harness:compileJava FROM-CACHE
> Task :sdks:java:harness:classes UP-TO-DATE
> Task :sdks:java:harness:jar
> Task :runners:java-fn-execution:compileJava FROM-CACHE
> Task :runners:java-fn-execution:classes UP-TO-DATE
> Task :runners:java-fn-execution:jar
> Task :sdks:java:expansion-service:compileJava FROM-CACHE
> Task :sdks:java:expansion-service:classes UP-TO-DATE
> Task :sdks:java:expansion-service:jar
> Task :runners:direct-java:compileJava FROM-CACHE
> Task :runners:direct-java:classes UP-TO-DATE
> Task :runners:java-job-service:compileJava FROM-CACHE
> Task :runners:java-job-service:classes UP-TO-DATE
> Task :runners:java-job-service:jar
> Task :sdks:java:io:kafka:compileJava FROM-CACHE
> Task :sdks:java:io:kafka:classes UP-TO-DATE
> Task :sdks:java:io:kafka:jar
> Task :runners:flink:1.13:compileJava FROM-CACHE
> Task :runners:flink:1.13:classes
> Task :runners:flink:1.13:jar
> Task :runners:direct-java:shadowJar FROM-CACHE
> Task :sdks:java:io:google-cloud-platform:compileJava FROM-CACHE
> Task :sdks:java:io:google-cloud-platform:classes UP-TO-DATE
> Task :sdks:java:io:google-cloud-platform:jar
> Task :runners:google-cloud-dataflow-java:compileJava FROM-CACHE
> Task :runners:google-cloud-dataflow-java:classes
> Task :runners:google-cloud-dataflow-java:jar
> Task :sdks:java:extensions:sql:compileJava FROM-CACHE
> Task :sdks:java:extensions:sql:classes
> Task :sdks:java:extensions:sql:jar
> Task :sdks:java:extensions:sql:zetasql:compileJava FROM-CACHE
> Task :sdks:java:extensions:sql:zetasql:classes UP-TO-DATE
> Task :sdks:java:extensions:sql:zetasql:jar
> Task :sdks:java:testing:tpcds:compileJava FROM-CACHE
> Task :sdks:java:testing:tpcds:classes
> Task :sdks:java:testing:tpcds:jar

> Task :sdks:java:testing:tpcds:run
SLF4J: Class path contains multiple SLF4J bindings.
SLF4J: Found binding in [jar:file:/home/jenkins/.gradle/caches/modules-2/files-2.1/org.slf4j/slf4j-log4j12/1.7.30/c21f55139d8141d2231214fb1feaf50a1edca95e/slf4j-log4j12-1.7.30.jar!/org/slf4j/impl/StaticLoggerBinder.class]
SLF4J: Found binding in [jar:file:/home/jenkins/.gradle/caches/modules-2/files-2.1/org.slf4j/slf4j-jdk14/1.7.30/d35953dd2fe54ebe39fdf18cfd82fe6eb35b25ed/slf4j-jdk14-1.7.30.jar!/org/slf4j/impl/StaticLoggerBinder.class]
SLF4J: See http://www.slf4j.org/codes.html#multiple_bindings for an explanation.
SLF4J: Actual binding is of type [org.slf4j.impl.Log4jLoggerFactory]
Exception in thread "main" java.lang.IllegalArgumentException: Class interface org.apache.beam.sdk.tpcds.TpcdsOptions missing a property named 'bigQueryTable'.
	at org.apache.beam.sdk.options.PipelineOptionsFactory.parseObjects(PipelineOptionsFactory.java:1885)
	at org.apache.beam.sdk.options.PipelineOptionsFactory.access$400(PipelineOptionsFactory.java:146)
	at org.apache.beam.sdk.options.PipelineOptionsFactory$Builder.as(PipelineOptionsFactory.java:329)
	at org.apache.beam.sdk.tpcds.SqlTransformRunner.runUsingSqlTransform(SqlTransformRunner.java:256)
	at org.apache.beam.sdk.tpcds.BeamTpcds.main(BeamTpcds.java:31)

> Task :sdks:java:testing:tpcds:run FAILED

FAILURE: Build failed with an exception.

* What went wrong:
Execution failed for task ':sdks:java:testing:tpcds:run'.
> Process 'command '/usr/lib/jvm/java-8-openjdk-amd64/bin/java'' finished with non-zero exit value 1

* Try:
> Run with --stacktrace option to get the stack trace.
> Run with --info or --debug option to get more log output.
> Run with --scan to get full insights.

* Get more help at https://help.gradle.org

Deprecated Gradle features were used in this build, making it incompatible with Gradle 8.0.

You can use '--warning-mode all' to show the individual deprecation warnings and determine if they come from your own scripts or plugins.

See https://docs.gradle.org/7.4/userguide/command_line_interface.html#sec:command_line_warnings

BUILD FAILED in 27s
125 actionable tasks: 81 executed, 42 from cache, 2 up-to-date

Publishing build scan...
https://gradle.com/s/htce3jo422q2u

Build step 'Invoke Gradle script' changed build result to FAILURE
Build step 'Invoke Gradle script' marked build as failure

---------------------------------------------------------------------
To unsubscribe, e-mail: builds-unsubscribe@beam.apache.org
For additional commands, e-mail: builds-help@beam.apache.org


Jenkins build is back to normal : beam_PostCommit_Java_Tpcds_Flink #199

Posted by Apache Jenkins Server <je...@builds.apache.org>.
See <https://ci-beam.apache.org/job/beam_PostCommit_Java_Tpcds_Flink/199/display/redirect?page=changes>


---------------------------------------------------------------------
To unsubscribe, e-mail: builds-unsubscribe@beam.apache.org
For additional commands, e-mail: builds-help@beam.apache.org