You are viewing a plain text version of this content. The canonical link for it is here.
Posted to dev@sling.apache.org by Apache Jenkins Server <je...@builds.apache.org> on 2014/07/30 17:43:55 UTC

Jenkins build became unstable: sling-trunk-1.7 #719

See <https://builds.apache.org/job/sling-trunk-1.7/719/changes>


Jenkins build is back to stable : sling-trunk-1.7 #724

Posted by Apache Jenkins Server <je...@builds.apache.org>.
See <https://builds.apache.org/job/sling-trunk-1.7/724/changes>


Jenkins build is still unstable: sling-trunk-1.7 #723

Posted by Apache Jenkins Server <je...@builds.apache.org>.
See <https://builds.apache.org/job/sling-trunk-1.7/changes>


Jenkins build is unstable: sling-trunk-1.7 #722

Posted by Apache Jenkins Server <je...@builds.apache.org>.
See <https://builds.apache.org/job/sling-trunk-1.7/722/changes>


Build failed in Jenkins: sling-trunk-1.7 #721

Posted by Apache Jenkins Server <je...@builds.apache.org>.
See <https://builds.apache.org/job/sling-trunk-1.7/721/changes>

Changes:

[bdelacretaz] SLING-3744 - test async health check with cron expression

[bdelacretaz] SLING-3624 - test the annotated health check sample

[bdelacretaz] SLING-3624 - move SlingHealthCheck annotation to a new annotations jar

------------------------------------------
[...truncated 14282 lines...]
[INFO] Sling Taglib Archetype ............................ SUCCESS [9.314s]
[INFO] Apache Sling API .................................. SUCCESS [24.114s]
[INFO] Apache Sling Resource Resolver .................... SUCCESS [24.263s]
[INFO] Apache Sling System Bundle Extension: Java Transaction API  SUCCESS [9.191s]
[INFO] Apache Sling System Bundle Extension: XML APIs .... SUCCESS [11.779s]
[INFO] Apache Sling System Bundle Extension: Activation API  SUCCESS [8.943s]
[INFO] Apache Sling System Bundle Extension: WS APIs ..... SUCCESS [6.640s]
[INFO] Apache Sling Dynamic Class Loader Support ......... SUCCESS [21.052s]
[INFO] Apache Sling Commons Java Compiler ................ SUCCESS [12.251s]
[INFO] Apache Sling JSON Library ......................... SUCCESS [15.019s]
[INFO] Apache Sling SLF4J Implementation (Logback) ....... SUCCESS [50.359s]
[INFO] Apache Sling OSGi LogService Implementation ....... SUCCESS [11.638s]
[INFO] Apache Sling MIME type mapping support ............ SUCCESS [12.318s]
[INFO] Apache Sling Commons OSGi support ................. SUCCESS [14.843s]
[INFO] Apache Sling Scheduler Support .................... SUCCESS [11.723s]
[INFO] Apache Sling Testing Utilities .................... SUCCESS [20.778s]
[INFO] Apache Sling Thread Dumper ........................ SUCCESS [14.971s]
[INFO] Apache Sling Thread Support ....................... SUCCESS [11.510s]
[INFO] Apache Sling Authentication Service ............... SUCCESS [14.894s]
[INFO] Apache Sling OpenID Authentication ................ SUCCESS [21.031s]
[INFO] Apache Sling Form Based Authentication Handler .... SUCCESS [20.214s]
[INFO] Apache Sling Authentication Selector .............. SUCCESS [12.301s]
[INFO] Apache Sling Engine Implementation ................ SUCCESS [29.991s]
[INFO] Apache Sling Repository API Bundle ................ SUCCESS [8.494s]
[INFO] Apache Sling JCR Base Bundle ...................... SUCCESS [11.764s]
[INFO] Apache Sling JCR ClassLoader ...................... SUCCESS [8.716s]
[INFO] Apache Sling Initial Content Loader ............... SUCCESS [12.595s]
[INFO] Apache Sling Jackrabbit Embedded Repository ....... SUCCESS [12.558s]
[INFO] Apache Sling Jackrabbit UserManager Support ....... SUCCESS [9.111s]
[INFO] Apache Sling Jackrabbit JSR-283 Access Control Manager Support  SUCCESS [9.249s]
[INFO] Apache Sling Wrapper Bundle for the JCR API ....... SUCCESS [3.646s]
[INFO] Apache Sling JCR Resource Resolver ................ SUCCESS [48.472s]
[INFO] Apache Sling JCR Repository Registration .......... SUCCESS [8.989s]
[INFO] Apache Sling Simple WebDAV Access to repositories . SUCCESS [6.710s]
[INFO] Apache Sling DavEx Access to repositories ......... SUCCESS [11.799s]
[INFO] Apache Sling JCR WebConsole Bundle ................ SUCCESS [8.646s]
[INFO] Apache Sling Oak Repository Server ................ SUCCESS [8.864s]
[INFO] Apache Sling SlingRepository Integration Tests .... SUCCESS [29.666s]
[INFO] Apache Sling Servlet Resolver ..................... SUCCESS [14.069s]
[INFO] Apache Sling Default GET Servlets ................. SUCCESS [12.237s]
[INFO] Apache Sling Default POST Servlets ................ SUCCESS [12.311s]
[INFO] Apache Sling Compat Servlets ...................... SUCCESS [6.128s]
[INFO] Apache Sling Scripting Implementation API ......... SUCCESS [6.787s]
[INFO] Apache Sling Scripting Core implementation ........ SUCCESS [20.281s]
[INFO] Apache Sling Scripting JavaScript Support ......... SUCCESS [18.114s]
[INFO] Apache Sling Scripting JSP Support ................ SUCCESS [18.235s]
[INFO] Apache Sling JSP Tag Library ...................... SUCCESS [14.424s]
[INFO] Apache Sling JSP Standard Tag Library ............. SUCCESS [8.465s]
[INFO] Apache Sling Adapter Manager Implementation ....... SUCCESS [9.477s]
[INFO] Apache Sling Bundle Resource Provider ............. SUCCESS [6.257s]
[INFO] Apache Sling Discovery API ........................ SUCCESS [6.177s]
[INFO] Apache Sling Resource-Based Discovery Service ..... FAILURE [1:41.002s]
[INFO] Apache Sling Discovery Support Bundle ............. SKIPPED
[INFO] Apache Sling Discovery Standalone Implementation .. SKIPPED
[INFO] Apache Sling Event Support ........................ SKIPPED
[INFO] Apache Sling Feature Flags ........................ SKIPPED
[INFO] Apache Sling Filesystem Resource Provider ......... SKIPPED
[INFO] Apache Sling javax.activation bundle .............. SKIPPED
[INFO] Apache Sling Service User Mapper .................. SKIPPED
[INFO] Apache Sling Settings ............................. SKIPPED
[INFO] Apache Sling Web Console Branding ................. SKIPPED
[INFO] Apache Sling Web Console Security Provider ........ SKIPPED
[INFO] Apache Sling Groovy Extensions .................... SKIPPED
[INFO] Apache Sling Explorer ............................. SKIPPED
[INFO] Apache Sling Health Check Core .................... SKIPPED
[INFO] Apache Sling Health Check Annotations ............. SKIPPED
[INFO] Apache Sling Health Check Samples ................. SKIPPED
[INFO] Apache Sling Health Check Support Components ...... SKIPPED
[INFO] Apache Sling Health Check Webconsole Plugin ....... SKIPPED
[INFO] Apache Sling Health Check JUnit Bridge ............ SKIPPED
[INFO] Apache Sling Health Check Integration Tests ....... SKIPPED
[INFO] Apache Sling Health Check Reactor POM ............. SKIPPED
[INFO] Apache Sling Resource Access Security ............. SKIPPED
[INFO] Apache Sling Launchpad Content .................... SKIPPED
[INFO] Apache Sling Launchpad Application Builder ........ SKIPPED
[INFO] Apache Sling Resource Access Security Integration Tests  SKIPPED
[INFO] Sling Models API .................................. SKIPPED
[INFO] Sling Models Implementation ....................... SKIPPED
[INFO] Apache Sling Models Integration Tests ............. SKIPPED
[INFO] Apache Sling Test Tools ........................... SKIPPED
[INFO] Apache Sling JUnit Core ........................... SKIPPED
[INFO] Apache Sling JUnit Scriptable Tests Provider ...... SKIPPED
[INFO] Apache Sling JUnit Health Checks .................. SKIPPED
[INFO] Apache Sling JUnit Remote Tests Runners ........... SKIPPED
[INFO] Apache Sling JUnit Performance .................... SKIPPED
[INFO] Apache Sling Testing Resource Resolver Mock ....... SKIPPED
[INFO] Apache Sling Pax Exam Utilities ................... SKIPPED
[INFO] Apache Sling Installer ............................ SKIPPED
[INFO] Apache Sling Installer WebConsole Plugin .......... SKIPPED
[INFO] Apache Sling File Installer ....................... SKIPPED
[INFO] Apache Sling JCR Installer ........................ SKIPPED
[INFO] Apache Sling Installer Configuration Admin Support  SKIPPED
[INFO] Apache Sling Deployment Package Installer ......... SKIPPED
[INFO] Apache Sling Installer Integration Tests .......... SKIPPED
[INFO] Apache Sling Launchpad API ........................ SKIPPED
[INFO] Apache Sling Launchpad Base ....................... SKIPPED
[INFO] Apache Sling Launchpad Installer .................. SKIPPED
[INFO] Apache Sling Sample Server-Side Tests ............. SKIPPED
[INFO] Apache Sling Failing Server-Side Tests ............ SKIPPED
[INFO] Apache Sling Sample Integration Tests ............. SKIPPED
[INFO] Apache Sling Launchpad Testing Services ........... SKIPPED
[INFO] Apache Sling Launchpad Testing Services WAR ....... SKIPPED
[INFO] Apache Sling Launchpad Testing Fragment Bundle .... SKIPPED
[INFO] Apache Sling Launchpad Test Bundles ............... SKIPPED
[INFO] Apache Sling Integration Tests .................... SKIPPED
[INFO] Apache Sling Launchpad Testing .................... SKIPPED
[INFO] Apache Sling (Builder) ............................ SKIPPED
[INFO] ------------------------------------------------------------------------
[INFO] BUILD FAILURE
[INFO] ------------------------------------------------------------------------
[INFO] Total time: 20:24.951s
[INFO] Finished at: Thu Jul 31 01:18:36 UTC 2014
[INFO] Final Memory: 128M/284M
[INFO] ------------------------------------------------------------------------
[JENKINS] Archiving disabled
[JENKINS] Archiving disabled
[JENKINS] Archiving disabled
[JENKINS] Archiving disabled
[JENKINS] Archiving disabled
[JENKINS] Archiving disabled
[JENKINS] Archiving disabled
[JENKINS] Archiving disabled
[JENKINS] Archiving disabled
[JENKINS] Archiving disabled
[JENKINS] Archiving disabled
[JENKINS] Archiving disabled
[JENKINS] Archiving disabled
[JENKINS] Archiving disabled
[JENKINS] Archiving disabled
[JENKINS] Archiving disabled
[JENKINS] Archiving disabled
[JENKINS] Archiving disabled
[JENKINS] Archiving disabled
[JENKINS] Archiving disabled
[JENKINS] Archiving disabled
[JENKINS] Archiving disabled
[JENKINS] Archiving disabled
[JENKINS] Archiving disabled
[JENKINS] Archiving disabled
[JENKINS] Archiving disabled
[JENKINS] Archiving disabled
[JENKINS] Archiving disabled
[JENKINS] Archiving disabled
[JENKINS] Archiving disabled
[JENKINS] Archiving disabled
[JENKINS] Archiving disabled
[JENKINS] Archiving disabled
[JENKINS] Archiving disabled
[JENKINS] Archiving disabled
[JENKINS] Archiving disabled
[JENKINS] Archiving disabled
[JENKINS] Archiving disabled
[JENKINS] Archiving disabled
[JENKINS] Archiving disabled
[JENKINS] Archiving disabled
[JENKINS] Archiving disabled
[JENKINS] Archiving disabled
[JENKINS] Archiving disabled
[JENKINS] Archiving disabled
[JENKINS] Archiving disabled
[JENKINS] Archiving disabled
[JENKINS] Archiving disabled
[JENKINS] Archiving disabled
[JENKINS] Archiving disabled
[JENKINS] Archiving disabled
[JENKINS] Archiving disabled
[JENKINS] Archiving disabled
[JENKINS] Archiving disabled
[JENKINS] Archiving disabled
[JENKINS] Archiving disabled
[JENKINS] Archiving disabled
[JENKINS] Archiving disabled
[JENKINS] Archiving disabled
[JENKINS] Archiving disabled
[JENKINS] Archiving disabled
[JENKINS] Archiving disabled
[JENKINS] Archiving disabled
[JENKINS] Archiving disabled
[JENKINS] Archiving disabled
[JENKINS] Archiving disabled
[JENKINS] Archiving disabled
[JENKINS] Archiving disabled
[JENKINS] Archiving disabled
[JENKINS] Archiving disabled
[JENKINS] Archiving disabled
[JENKINS] Archiving disabled
[JENKINS] Archiving disabled
[JENKINS] Archiving disabled
[JENKINS] Archiving disabled
[JENKINS] Archiving disabled
[JENKINS] Archiving disabled
[JENKINS] Archiving disabled
[JENKINS] Archiving disabled
[JENKINS] Archiving disabled
[JENKINS] Archiving disabled
[JENKINS] Archiving disabled
[JENKINS] Archiving disabled
[JENKINS] Archiving disabled
[JENKINS] Archiving disabled
[JENKINS] Archiving disabled
[JENKINS] Archiving disabled
[JENKINS] Archiving disabled
[JENKINS] Archiving disabled
[JENKINS] Archiving disabled
[JENKINS] Archiving disabled
[JENKINS] Archiving disabled
[JENKINS] Archiving disabled
[JENKINS] Archiving disabled
[JENKINS] Archiving disabled
[JENKINS] Archiving disabled
[JENKINS] Archiving disabled
[JENKINS] Archiving disabled
[JENKINS] Archiving disabled
[JENKINS] Archiving disabled
[JENKINS] Archiving disabled
[JENKINS] Archiving disabled
[JENKINS] Archiving disabled
[JENKINS] Archiving disabled
[JENKINS] Archiving disabled
[JENKINS] Archiving disabled
[JENKINS] Archiving disabled
[JENKINS] Archiving disabled
[JENKINS] Archiving disabled
[JENKINS] Archiving disabled
[JENKINS] Archiving disabled
[JENKINS] Archiving disabled
[JENKINS] Archiving disabled
[JENKINS] Archiving disabled
[JENKINS] Archiving disabled
[JENKINS] Archiving disabled
[JENKINS] Archiving disabled
[JENKINS] Archiving disabled
[JENKINS] Archiving disabled
[JENKINS] Archiving disabled
Waiting for Jenkins to finish collecting data[ERROR] Failed to execute goal org.apache.maven.plugins:maven-surefire-plugin:2.16:test (default-test) on project org.apache.sling.discovery.impl: Execution default-test of goal org.apache.maven.plugins:maven-surefire-plugin:2.16:test failed: The forked VM terminated without saying properly goodbye. VM crash or System.exit called ?
[ERROR] Command was/bin/sh -c cd <https://builds.apache.org/job/sling-trunk-1.7/ws/trunk/bundles/extensions/discovery/impl> && /home/jenkins/tools/java/jdk1.7.0_25-32/jre/bin/java -jar <https://builds.apache.org/job/sling-trunk-1.7/ws/trunk/bundles/extensions/discovery/impl/target/surefire/surefirebooter7442481316510528190.jar> <https://builds.apache.org/job/sling-trunk-1.7/ws/trunk/bundles/extensions/discovery/impl/target/surefire/surefire3412444310516217500tmp> <https://builds.apache.org/job/sling-trunk-1.7/ws/trunk/bundles/extensions/discovery/impl/target/surefire/surefire_231531907870589143066tmp>
[ERROR] -> [Help 1]
[ERROR] 
[ERROR] To see the full stack trace of the errors, re-run Maven with the -e switch.
[ERROR] Re-run Maven using the -X switch to enable full debug logging.
[ERROR] 
[ERROR] For more information about the errors and possible solutions, please read the following articles:
[ERROR] [Help 1] http://cwiki.apache.org/confluence/display/MAVEN/PluginExecutionException
[ERROR] 
[ERROR] After correcting the problems, you can resume the build with the command
[ERROR]   mvn <goals> -rf :org.apache.sling.discovery.impl

Sending e-mails to: dev@sling.apache.org
channel stopped

Build failed in Jenkins: sling-trunk-1.7 #720

Posted by Apache Jenkins Server <je...@builds.apache.org>.
See <https://builds.apache.org/job/sling-trunk-1.7/720/changes>

Changes:

[cziegeler] SLING-3624 : Add SlingHealthCheck annotation

[bdelacretaz] SLING-3624 - SlingHealthCheck annotation, contributed by  Bjoern Weide, thanks!

------------------------------------------
[...truncated 31461 lines...]
[INFO] Sling Bundle Archetype ............................ SUCCESS [11.742s]
[INFO] Sling JCRInstall Bundle Archetype ................. SUCCESS [9.580s]
[INFO] Sling Taglib Archetype ............................ SUCCESS [8.028s]
[INFO] Apache Sling API .................................. SUCCESS [20.497s]
[INFO] Apache Sling Resource Resolver .................... SUCCESS [27.301s]
[INFO] Apache Sling System Bundle Extension: Java Transaction API  SUCCESS [8.865s]
[INFO] Apache Sling System Bundle Extension: XML APIs .... SUCCESS [8.858s]
[INFO] Apache Sling System Bundle Extension: Activation API  SUCCESS [9.286s]
[INFO] Apache Sling System Bundle Extension: WS APIs ..... SUCCESS [8.915s]
[INFO] Apache Sling Dynamic Class Loader Support ......... SUCCESS [18.144s]
[INFO] Apache Sling Commons Java Compiler ................ SUCCESS [17.959s]
[INFO] Apache Sling JSON Library ......................... SUCCESS [20.643s]
[INFO] Apache Sling SLF4J Implementation (Logback) ....... SUCCESS [50.773s]
[INFO] Apache Sling OSGi LogService Implementation ....... SUCCESS [12.037s]
[INFO] Apache Sling MIME type mapping support ............ SUCCESS [15.202s]
[INFO] Apache Sling Commons OSGi support ................. SUCCESS [14.530s]
[INFO] Apache Sling Scheduler Support .................... SUCCESS [9.533s]
[INFO] Apache Sling Testing Utilities .................... SUCCESS [26.733s]
[INFO] Apache Sling Thread Dumper ........................ SUCCESS [8.994s]
[INFO] Apache Sling Thread Support ....................... SUCCESS [9.198s]
[INFO] Apache Sling Authentication Service ............... SUCCESS [14.999s]
[INFO] Apache Sling OpenID Authentication ................ SUCCESS [17.580s]
[INFO] Apache Sling Form Based Authentication Handler .... SUCCESS [17.838s]
[INFO] Apache Sling Authentication Selector .............. SUCCESS [9.240s]
[INFO] Apache Sling Engine Implementation ................ SUCCESS [33.099s]
[INFO] Apache Sling Repository API Bundle ................ SUCCESS [8.450s]
[INFO] Apache Sling JCR Base Bundle ...................... SUCCESS [15.273s]
[INFO] Apache Sling JCR ClassLoader ...................... SUCCESS [8.915s]
[INFO] Apache Sling Initial Content Loader ............... SUCCESS [14.645s]
[INFO] Apache Sling Jackrabbit Embedded Repository ....... SUCCESS [17.542s]
[INFO] Apache Sling Jackrabbit UserManager Support ....... SUCCESS [12.376s]
[INFO] Apache Sling Jackrabbit JSR-283 Access Control Manager Support  SUCCESS [8.887s]
[INFO] Apache Sling Wrapper Bundle for the JCR API ....... SUCCESS [8.865s]
[INFO] Apache Sling JCR Resource Resolver ................ SUCCESS [53.843s]
[INFO] Apache Sling JCR Repository Registration .......... SUCCESS [11.719s]
[INFO] Apache Sling Simple WebDAV Access to repositories . SUCCESS [12.445s]
[INFO] Apache Sling DavEx Access to repositories ......... SUCCESS [12.306s]
[INFO] Apache Sling JCR WebConsole Bundle ................ SUCCESS [9.289s]
[INFO] Apache Sling Oak Repository Server ................ SUCCESS [12.358s]
[INFO] Apache Sling SlingRepository Integration Tests .... SUCCESS [27.099s]
[INFO] Apache Sling Servlet Resolver ..................... SUCCESS [18.030s]
[INFO] Apache Sling Default GET Servlets ................. SUCCESS [17.889s]
[INFO] Apache Sling Default POST Servlets ................ SUCCESS [17.848s]
[INFO] Apache Sling Compat Servlets ...................... SUCCESS [8.817s]
[INFO] Apache Sling Scripting Implementation API ......... SUCCESS [9.059s]
[INFO] Apache Sling Scripting Core implementation ........ SUCCESS [23.641s]
[INFO] Apache Sling Scripting JavaScript Support ......... SUCCESS [26.524s]
[INFO] Apache Sling Scripting JSP Support ................ SUCCESS [20.538s]
[INFO] Apache Sling JSP Tag Library ...................... SUCCESS [12.420s]
[INFO] Apache Sling JSP Standard Tag Library ............. SUCCESS [6.130s]
[INFO] Apache Sling Adapter Manager Implementation ....... SUCCESS [12.210s]
[INFO] Apache Sling Bundle Resource Provider ............. SUCCESS [9.649s]
[INFO] Apache Sling Discovery API ........................ SUCCESS [9.040s]
[INFO] Apache Sling Resource-Based Discovery Service ..... SUCCESS [2:45.117s]
[INFO] Apache Sling Discovery Support Bundle ............. SUCCESS [8.955s]
[INFO] Apache Sling Discovery Standalone Implementation .. SUCCESS [8.825s]
[INFO] Apache Sling Event Support ........................ SUCCESS [6:12.557s]
[INFO] Apache Sling Feature Flags ........................ SUCCESS [6.383s]
[INFO] Apache Sling Filesystem Resource Provider ......... SUCCESS [7.891s]
[INFO] Apache Sling javax.activation bundle .............. SUCCESS [5.693s]
[INFO] Apache Sling Service User Mapper .................. SUCCESS [6.523s]
[INFO] Apache Sling Settings ............................. SUCCESS [8.434s]
[INFO] Apache Sling Web Console Branding ................. SUCCESS [5.340s]
[INFO] Apache Sling Web Console Security Provider ........ SUCCESS [5.636s]
[INFO] Apache Sling Groovy Extensions .................... SUCCESS [8.387s]
[INFO] Apache Sling Explorer ............................. SUCCESS [4.937s]
[INFO] Apache Sling Health Check Core .................... SUCCESS [11.886s]
[INFO] Apache Sling Health Check Samples ................. SUCCESS [6.271s]
[INFO] Apache Sling Health Check Support Components ...... SUCCESS [8.930s]
[INFO] Apache Sling Health Check Webconsole Plugin ....... SUCCESS [5.362s]
[INFO] Apache Sling Health Check JUnit Bridge ............ SUCCESS [8.583s]
[INFO] Apache Sling Health Check Integration Tests ....... FAILURE [3.180s]
[INFO] Apache Sling Health Check Reactor POM ............. SKIPPED
[INFO] Apache Sling Resource Access Security ............. SKIPPED
[INFO] Apache Sling Launchpad Content .................... SKIPPED
[INFO] Apache Sling Launchpad Application Builder ........ SKIPPED
[INFO] Apache Sling Resource Access Security Integration Tests  SKIPPED
[INFO] Sling Models API .................................. SKIPPED
[INFO] Sling Models Implementation ....................... SKIPPED
[INFO] Apache Sling Models Integration Tests ............. SKIPPED
[INFO] Apache Sling Test Tools ........................... SKIPPED
[INFO] Apache Sling JUnit Core ........................... SKIPPED
[INFO] Apache Sling JUnit Scriptable Tests Provider ...... SKIPPED
[INFO] Apache Sling JUnit Health Checks .................. SKIPPED
[INFO] Apache Sling JUnit Remote Tests Runners ........... SKIPPED
[INFO] Apache Sling JUnit Performance .................... SKIPPED
[INFO] Apache Sling Testing Resource Resolver Mock ....... SKIPPED
[INFO] Apache Sling Pax Exam Utilities ................... SKIPPED
[INFO] Apache Sling Installer ............................ SKIPPED
[INFO] Apache Sling Installer WebConsole Plugin .......... SKIPPED
[INFO] Apache Sling File Installer ....................... SKIPPED
[INFO] Apache Sling JCR Installer ........................ SKIPPED
[INFO] Apache Sling Installer Configuration Admin Support  SKIPPED
[INFO] Apache Sling Deployment Package Installer ......... SKIPPED
[INFO] Apache Sling Installer Integration Tests .......... SKIPPED
[INFO] Apache Sling Launchpad API ........................ SKIPPED
[INFO] Apache Sling Launchpad Base ....................... SKIPPED
[INFO] Apache Sling Launchpad Installer .................. SKIPPED
[INFO] Apache Sling Sample Server-Side Tests ............. SKIPPED
[INFO] Apache Sling Failing Server-Side Tests ............ SKIPPED
[INFO] Apache Sling Sample Integration Tests ............. SKIPPED
[INFO] Apache Sling Launchpad Testing Services ........... SKIPPED
[INFO] Apache Sling Launchpad Testing Services WAR ....... SKIPPED
[INFO] Apache Sling Launchpad Testing Fragment Bundle .... SKIPPED
[INFO] Apache Sling Launchpad Test Bundles ............... SKIPPED
[INFO] Apache Sling Integration Tests .................... SKIPPED
[INFO] Apache Sling Launchpad Testing .................... SKIPPED
[INFO] Apache Sling (Builder) ............................ SKIPPED
[INFO] ------------------------------------------------------------------------
[INFO] BUILD FAILURE
[INFO] ------------------------------------------------------------------------
[INFO] Total time: 31:07.606s
[INFO] Finished at: Wed Jul 30 17:56:34 UTC 2014
[INFO] Final Memory: 127M/232M
[INFO] ------------------------------------------------------------------------
[JENKINS] Archiving disabled
[JENKINS] Archiving disabled
[JENKINS] Archiving disabled
[JENKINS] Archiving disabled
[JENKINS] Archiving disabled
[JENKINS] Archiving disabled
[JENKINS] Archiving disabled
[JENKINS] Archiving disabled
[JENKINS] Archiving disabled
[JENKINS] Archiving disabled
[JENKINS] Archiving disabled
[JENKINS] Archiving disabled
[JENKINS] Archiving disabled
[JENKINS] Archiving disabled
[JENKINS] Archiving disabled
[JENKINS] Archiving disabled
[JENKINS] Archiving disabled
[JENKINS] Archiving disabled
[JENKINS] Archiving disabled
[JENKINS] Archiving disabled
[JENKINS] Archiving disabled
[JENKINS] Archiving disabled
[JENKINS] Archiving disabled
[JENKINS] Archiving disabled
[JENKINS] Archiving disabled
[JENKINS] Archiving disabled
[JENKINS] Archiving disabled
[JENKINS] Archiving disabled
[JENKINS] Archiving disabled
[JENKINS] Archiving disabled
[JENKINS] Archiving disabled
[JENKINS] Archiving disabled
[JENKINS] Archiving disabled
[JENKINS] Archiving disabled
[JENKINS] Archiving disabled
[JENKINS] Archiving disabled
[JENKINS] Archiving disabled
[JENKINS] Archiving disabled
[JENKINS] Archiving disabled
[JENKINS] Archiving disabled
[JENKINS] Archiving disabled
[JENKINS] Archiving disabled
[JENKINS] Archiving disabled
[JENKINS] Archiving disabled
[JENKINS] Archiving disabled
[JENKINS] Archiving disabled
[JENKINS] Archiving disabled
[JENKINS] Archiving disabled
[JENKINS] Archiving disabled
[JENKINS] Archiving disabled
[JENKINS] Archiving disabled
[JENKINS] Archiving disabled
[JENKINS] Archiving disabled
[JENKINS] Archiving disabled
[JENKINS] Archiving disabled
[JENKINS] Archiving disabled
[JENKINS] Archiving disabled
[JENKINS] Archiving disabled
[JENKINS] Archiving disabled
[JENKINS] Archiving disabled
[JENKINS] Archiving disabled
[JENKINS] Archiving disabled
[JENKINS] Archiving disabled
[JENKINS] Archiving disabled
[JENKINS] Archiving disabled
[JENKINS] Archiving disabled
[JENKINS] Archiving disabled
[JENKINS] Archiving disabled
[JENKINS] Archiving disabled
[JENKINS] Archiving disabled
[JENKINS] Archiving disabled
[JENKINS] Archiving disabled
[JENKINS] Archiving disabled
[JENKINS] Archiving disabled
[JENKINS] Archiving disabled
[JENKINS] Archiving disabled
[JENKINS] Archiving disabled
[JENKINS] Archiving disabled
[JENKINS] Archiving disabled
[JENKINS] Archiving disabled
[JENKINS] Archiving disabled
[JENKINS] Archiving disabled
[JENKINS] Archiving disabled
[JENKINS] Archiving disabled
[JENKINS] Archiving disabled
[JENKINS] Archiving disabled
[JENKINS] Archiving disabled
[JENKINS] Archiving disabled
[JENKINS] Archiving disabled
[JENKINS] Archiving disabled
[JENKINS] Archiving disabled
[JENKINS] Archiving disabled
[JENKINS] Archiving disabled
[JENKINS] Archiving disabled
[JENKINS] Archiving disabled
[JENKINS] Archiving disabled
[JENKINS] Archiving disabled
[JENKINS] Archiving disabled
[JENKINS] Archiving disabled
[JENKINS] Archiving disabled
[JENKINS] Archiving disabled
[JENKINS] Archiving disabled
[JENKINS] Archiving disabled
[JENKINS] Archiving disabled
[JENKINS] Archiving disabled
[JENKINS] Archiving disabled
[JENKINS] Archiving disabled
[JENKINS] Archiving disabled
[JENKINS] Archiving disabled
[JENKINS] Archiving disabled
[JENKINS] Archiving disabled
[JENKINS] Archiving disabled
[JENKINS] Archiving disabled
[JENKINS] Archiving disabled
[JENKINS] Archiving disabled
[JENKINS] Archiving disabled
[JENKINS] Archiving disabled
[JENKINS] Archiving disabled
[JENKINS] Archiving disabled
Waiting for Jenkins to finish collecting data[ERROR] Failed to execute goal org.apache.maven.plugins:maven-compiler-plugin:3.1:testCompile (default-testCompile) on project org.apache.sling.hc.it: Compilation failure
[ERROR] <https://builds.apache.org/job/sling-trunk-1.7/ws/trunk/bundles/extensions/healthcheck/it/src/test/java/org/apache/sling/hc/it/core/HealthCheckFilterTest.java>:[64,42] type org.osgi.framework.ServiceRegistration does not take parameters
[ERROR] -> [Help 1]
[ERROR] 
[ERROR] To see the full stack trace of the errors, re-run Maven with the -e switch.
[ERROR] Re-run Maven using the -X switch to enable full debug logging.
[ERROR] 
[ERROR] For more information about the errors and possible solutions, please read the following articles:
[ERROR] [Help 1] http://cwiki.apache.org/confluence/display/MAVEN/MojoFailureException
[ERROR] 
[ERROR] After correcting the problems, you can resume the build with the command
[ERROR]   mvn <goals> -rf :org.apache.sling.hc.it

Sending e-mails to: dev@sling.apache.org
channel stopped