You are viewing a plain text version of this content. The canonical link for it is here.
Posted to scm@geronimo.apache.org by db...@apache.org on 2004/08/16 11:40:00 UTC
[status] build: SUCCESSFUL, test: FAILED | SunOS 5.8, 2004-08-16
NIGHTLY BUILD/TEST
Date: Mon Aug 16 01:30:01 PDT 2004
Kernel: SunOS 5.8
Host: nagoya
Java: 1.4.2_04-b05, mixed mode
Maven: 1.0
CHECKOUT: incubator-geronimo
BUILDING: incubator-geronimo
[junit] [ERROR] TEST org.apache.geronimo.network.protocol.SocketProtocolStressTest FAILED
BUILD SUCCESSFUL
Total time: 24 minutes 11 seconds
Finished at: Mon Aug 16 01:55:50 PDT 2004