You are viewing a plain text version of this content. The canonical link for it is here.
Posted to commits@flex.apache.org by fl...@gmail.com on 2014/07/29 19:48:42 UTC

Build failed in Jenkins: MD5Checker #2

See <http://apacheflexbuild.cloudapp.net:8080/job/MD5Checker/2/changes>

Changes:

[Alex Harui] fix build on win

------------------------------------------
Started by user Alex Harui
Building remotely on flex-sdk slave in workspace <http://apacheflexbuild.cloudapp.net:8080/job/MD5Checker/ws/>
Fetching changes from the remote Git repository
Fetching upstream changes from https://git-wip-us.apache.org/repos/asf/flex-utilities.git
Checking out Revision f031f5d6e559ec1021ba6bf329d573ad69c915b7 (origin/develop)
[MD5Checker] $ cmd.exe /C '"c:\Jenkins\tools\hudson.tasks.Ant_AntInstallation\c_apache-ant-1.9.3\bin\ant.bat -file build.xml -Dplayerglobal.version=11.7 main && exit %%ERRORLEVEL%%"'
Buildfile: <http://apacheflexbuild.cloudapp.net:8080/job/MD5Checker/ws/MD5Checker/build.xml>

load-task:

build:
    [mxmlc] Loading configuration file C:\Jenkins\workspace\flex-sdk\frameworks\air-config.xml
    [mxmlc] C:\Jenkins\workspace\MD5Checker\MD5Checker\src\MD5Checker.swf (799963 bytes)

main:
     [exec] error while loading initial content
     [exec] Result: 9

BUILD FAILED
<http://apacheflexbuild.cloudapp.net:8080/job/MD5Checker/ws/MD5Checker/build.xml>:101: <http://apacheflexbuild.cloudapp.net:8080/job/MD5Checker/ws/MD5Checker/MD5CheckerLog.txt> doesn't exist

Total time: 1 minute 11 seconds
Build step 'Invoke Ant' marked build as failure

Jenkins build is back to normal : MD5Checker #5

Posted by fl...@gmail.com.
See <http://apacheflexbuild.cloudapp.net:8080/job/MD5Checker/5/changes>


Build failed in Jenkins: MD5Checker #4

Posted by fl...@gmail.com.
See <http://apacheflexbuild.cloudapp.net:8080/job/MD5Checker/4/changes>

Changes:

[Alex Harui] try setting user client so GitHub returns etag on Windows (does on mac)

------------------------------------------
Started by user Alex Harui
Building remotely on flex-sdk slave in workspace <http://apacheflexbuild.cloudapp.net:8080/job/MD5Checker/ws/>
Fetching changes from the remote Git repository
Fetching upstream changes from https://git-wip-us.apache.org/repos/asf/flex-utilities.git
Checking out Revision b2c1e8d9dd1e9dadd0f0822da38d261acb88c54d (origin/develop)
[MD5Checker] $ cmd.exe /C '"c:\Jenkins\tools\hudson.tasks.Ant_AntInstallation\c_apache-ant-1.9.3\bin\ant.bat -file build.xml -Dplayerglobal.version=11.7 main && exit %%ERRORLEVEL%%"'
Buildfile: <http://apacheflexbuild.cloudapp.net:8080/job/MD5Checker/ws/MD5Checker/build.xml>

load-task:

build:
    [mxmlc] Loading configuration file C:\Jenkins\workspace\flex-sdk\frameworks\air-config.xml
    [mxmlc] C:\Jenkins\workspace\MD5Checker\MD5Checker\src\MD5Checker.swf (799987 bytes)

main:
     [exec] Result: -1
     [echo] Old Node:
     [echo] <google-closure-library server="https://github.com" folder="google/closure-library/archive" file="master.zip" md5="a1b32c69892a8ebf229a271702af2411" cacheID="&quot;946a7d39d4ffe08676c755b21d901e71d9904a3b&quot;"/>
     [echo] New Node:
     [echo] <google-closure-library server="https://github.com" folder="google/closure-library/archive" file="master.zip" md5="a1b32c69892a8ebf229a271702af2411" cacheID="null"/>

BUILD FAILED
<http://apacheflexbuild.cloudapp.net:8080/job/MD5Checker/ws/MD5Checker/build.xml>:103: MD5's changed!

Total time: 42 seconds
Build step 'Invoke Ant' marked build as failure

Build failed in Jenkins: MD5Checker #3

Posted by fl...@gmail.com.
See <http://apacheflexbuild.cloudapp.net:8080/job/MD5Checker/3/changes>

Changes:

[Alex Harui] runs on my windows, but not in CI box.  Try -app.xml version

------------------------------------------
Started by user Alex Harui
Building remotely on flex-sdk slave in workspace <http://apacheflexbuild.cloudapp.net:8080/job/MD5Checker/ws/>
Fetching changes from the remote Git repository
Fetching upstream changes from https://git-wip-us.apache.org/repos/asf/flex-utilities.git
Checking out Revision 61521c5654f43626b9e3fb14a2c8d788ad1cc9df (origin/develop)
[MD5Checker] $ cmd.exe /C '"c:\Jenkins\tools\hudson.tasks.Ant_AntInstallation\c_apache-ant-1.9.3\bin\ant.bat -file build.xml -Dplayerglobal.version=11.7 main && exit %%ERRORLEVEL%%"'
Buildfile: <http://apacheflexbuild.cloudapp.net:8080/job/MD5Checker/ws/MD5Checker/build.xml>

load-task:

build:
    [mxmlc] Loading configuration file C:\Jenkins\workspace\flex-sdk\frameworks\air-config.xml
    [mxmlc] C:\Jenkins\workspace\MD5Checker\MD5Checker\src\MD5Checker.swf (799962 bytes)

main:
     [exec] Result: -1
     [echo] Old Node:
     [echo] <google-closure-library server="https://github.com" folder="google/closure-library/archive" file="master.zip" md5="a1b32c69892a8ebf229a271702af2411" cacheID="&quot;946a7d39d4ffe08676c755b21d901e71d9904a3b&quot;"/>
     [echo] New Node:
     [echo] <google-closure-library server="https://github.com" folder="google/closure-library/archive" file="master.zip" md5="a1b32c69892a8ebf229a271702af2411" cacheID="null"/>

BUILD FAILED
<http://apacheflexbuild.cloudapp.net:8080/job/MD5Checker/ws/MD5Checker/build.xml>:103: MD5's changed!

Total time: 43 seconds
Build step 'Invoke Ant' marked build as failure