You are viewing a plain text version of this content. The canonical link for it is here.
Posted to builds@solr.apache.org by Apache Jenkins Server <je...@builds.apache.org> on 2021/04/11 19:08:38 UTC

[JENKINS] Solr » Solr-Check-main - Build # 391 - Still Unstable!

Build: https://ci-builds.apache.org/job/Solr/job/Solr-Check-main/391/

1 tests failed.
FAILED:  org.apache.solr.cloud.SaslZkACLProviderTest.testSaslZkACLProvider

Error Message:
org.apache.zookeeper.KeeperException$AuthFailedException: KeeperErrorCode = AuthFailed for /solr

Stack Trace:
org.apache.zookeeper.KeeperException$AuthFailedException: KeeperErrorCode = AuthFailed for /solr
	at __randomizedtesting.SeedInfo.seed([730C031C7EAA441C:77F855C4E7EEE712]:0)
	at org.apache.zookeeper.KeeperException.create(KeeperException.java:130)
	at org.apache.zookeeper.KeeperException.create(KeeperException.java:54)
	at org.apache.zookeeper.ZooKeeper.create(ZooKeeper.java:1734)
	at org.apache.solr.common.cloud.SolrZkClient.lambda$makePath$10(SolrZkClient.java:542)
	at org.apache.solr.common.cloud.ZkCmdExecutor.retryOperation(ZkCmdExecutor.java:79)
	at org.apache.solr.common.cloud.SolrZkClient.makePath(SolrZkClient.java:541)
	at org.apache.solr.common.cloud.SolrZkClient.makePath(SolrZkClient.java:433)
	at org.apache.solr.cloud.SaslZkACLProviderTest.setUp(SaslZkACLProviderTest.java:88)
	at jdk.internal.reflect.GeneratedMethodAccessor8.invoke(Unknown Source)
	at java.base/jdk.internal.reflect.DelegatingMethodAccessorImpl.invoke(DelegatingMethodAccessorImpl.java:43)
	at java.base/java.lang.reflect.Method.invoke(Method.java:566)
	at com.carrotsearch.randomizedtesting.RandomizedRunner.invoke(RandomizedRunner.java:1754)
	at com.carrotsearch.randomizedtesting.RandomizedRunner$9.evaluate(RandomizedRunner.java:976)
	at com.carrotsearch.randomizedtesting.RandomizedRunner$10.evaluate(RandomizedRunner.java:992)
	at com.carrotsearch.randomizedtesting.rules.SystemPropertiesRestoreRule$1.evaluate(SystemPropertiesRestoreRule.java:57)
	at org.junit.rules.RunRules.evaluate(RunRules.java:20)
	at org.apache.lucene.util.TestRuleSetupTeardownChained$1.evaluate(TestRuleSetupTeardownChained.java:44)
	at org.apache.lucene.util.AbstractBeforeAfterRule$1.evaluate(AbstractBeforeAfterRule.java:43)
	at org.apache.lucene.util.TestRuleThreadAndTestName$1.evaluate(TestRuleThreadAndTestName.java:45)
	at org.apache.lucene.util.TestRuleIgnoreAfterMaxFailures$1.evaluate(TestRuleIgnoreAfterMaxFailures.java:60)
	at org.apache.lucene.util.TestRuleMarkFailure$1.evaluate(TestRuleMarkFailure.java:44)
	at org.junit.rules.RunRules.evaluate(RunRules.java:20)
	at com.carrotsearch.randomizedtesting.rules.StatementAdapter.evaluate(StatementAdapter.java:36)
	at com.carrotsearch.randomizedtesting.ThreadLeakControl$StatementRunner.run(ThreadLeakControl.java:370)
	at com.carrotsearch.randomizedtesting.ThreadLeakControl.forkTimeoutingTask(ThreadLeakControl.java:819)
	at com.carrotsearch.randomizedtesting.ThreadLeakControl$3.evaluate(ThreadLeakControl.java:470)
	at com.carrotsearch.randomizedtesting.RandomizedRunner.runSingleTest(RandomizedRunner.java:951)
	at com.carrotsearch.randomizedtesting.RandomizedRunner$5.evaluate(RandomizedRunner.java:836)
	at com.carrotsearch.randomizedtesting.RandomizedRunner$6.evaluate(RandomizedRunner.java:887)
	at com.carrotsearch.randomizedtesting.RandomizedRunner$7.evaluate(RandomizedRunner.java:898)
	at com.carrotsearch.randomizedtesting.rules.StatementAdapter.evaluate(StatementAdapter.java:36)
	at org.apache.lucene.util.AbstractBeforeAfterRule$1.evaluate(AbstractBeforeAfterRule.java:43)
	at org.apache.lucene.util.AbstractBeforeAfterRule$1.evaluate(AbstractBeforeAfterRule.java:43)
	at com.carrotsearch.randomizedtesting.rules.SystemPropertiesRestoreRule$1.evaluate(SystemPropertiesRestoreRule.java:57)
	at org.junit.rules.RunRules.evaluate(RunRules.java:20)
	at org.apache.lucene.util.AbstractBeforeAfterRule$1.evaluate(AbstractBeforeAfterRule.java:43)
	at com.carrotsearch.randomizedtesting.rules.StatementAdapter.evaluate(StatementAdapter.java:36)
	at org.apache.lucene.util.TestRuleStoreClassName$1.evaluate(TestRuleStoreClassName.java:38)
	at com.carrotsearch.randomizedtesting.rules.NoShadowingOrOverridesOnMethodsRule$1.evaluate(NoShadowingOrOverridesOnMethodsRule.java:40)
	at com.carrotsearch.randomizedtesting.rules.NoShadowingOrOverridesOnMethodsRule$1.evaluate(NoShadowingOrOverridesOnMethodsRule.java:40)
	at com.carrotsearch.randomizedtesting.rules.StatementAdapter.evaluate(StatementAdapter.java:36)
	at com.carrotsearch.randomizedtesting.rules.StatementAdapter.evaluate(StatementAdapter.java:36)
	at org.apache.lucene.util.TestRuleAssertionsRequired$1.evaluate(TestRuleAssertionsRequired.java:53)
	at org.apache.lucene.util.AbstractBeforeAfterRule$1.evaluate(AbstractBeforeAfterRule.java:43)
	at org.apache.lucene.util.TestRuleMarkFailure$1.evaluate(TestRuleMarkFailure.java:44)
	at org.apache.lucene.util.TestRuleIgnoreAfterMaxFailures$1.evaluate(TestRuleIgnoreAfterMaxFailures.java:60)
	at org.apache.lucene.util.TestRuleIgnoreTestSuites$1.evaluate(TestRuleIgnoreTestSuites.java:47)
	at org.junit.rules.RunRules.evaluate(RunRules.java:20)
	at com.carrotsearch.randomizedtesting.rules.StatementAdapter.evaluate(StatementAdapter.java:36)
	at com.carrotsearch.randomizedtesting.ThreadLeakControl$StatementRunner.run(ThreadLeakControl.java:370)
	at com.carrotsearch.randomizedtesting.ThreadLeakControl.lambda$forkTimeoutingTask$0(ThreadLeakControl.java:826)
	at java.base/java.lang.Thread.run(Thread.java:834)




Build Log:
[...truncated 1258 lines...]
ERROR: The following test(s) have failed:
  - org.apache.solr.cloud.SaslZkACLProviderTest.testSaslZkACLProvider (:solr:core)
    Test output: /home/jenkins/jenkins-slave/workspace/Solr/Solr-Check-main/solr/core/build/test-results/test/outputs/OUTPUT-org.apache.solr.cloud.SaslZkACLProviderTest.txt
    Reproduce with: gradlew :solr:core:test --tests "org.apache.solr.cloud.SaslZkACLProviderTest.testSaslZkACLProvider" -Ptests.jvms=4 -Ptests.haltonfailure=false -Ptests.jvmargs=-XX:TieredStopAtLevel=1 -Ptests.seed=730C031C7EAA441C -Ptests.multiplier=2 -Ptests.badapples=false -Ptests.file.encoding=US-ASCII


Deprecated Gradle features were used in this build, making it incompatible with Gradle 7.0.
Use '--warning-mode all' to show the individual deprecation warnings.
See https://docs.gradle.org/6.6.1/userguide/command_line_interface.html#sec:command_line_warnings

BUILD SUCCESSFUL in 48m 24s
296 actionable tasks: 296 executed
Build step 'Invoke Gradle script' changed build result to SUCCESS
Archiving artifacts
java.lang.InterruptedException: no matches found within 10000
	at hudson.FilePath$ValidateAntFileMask.hasMatch(FilePath.java:3066)
	at hudson.FilePath$ValidateAntFileMask.invoke(FilePath.java:2945)
	at hudson.FilePath$ValidateAntFileMask.invoke(FilePath.java:2926)
	at hudson.FilePath$FileCallableWrapper.call(FilePath.java:3313)
Also:   hudson.remoting.Channel$CallSiteStackTrace: Remote call to lucene1
		at hudson.remoting.Channel.attachCallSiteStackTrace(Channel.java:1800)
		at hudson.remoting.UserRequest$ExceptionResponse.retrieve(UserRequest.java:357)
		at hudson.remoting.Channel.call(Channel.java:1001)
		at hudson.FilePath.act(FilePath.java:1157)
		at hudson.FilePath.act(FilePath.java:1146)
		at hudson.FilePath.validateAntFileMask(FilePath.java:2924)
		at hudson.tasks.ArtifactArchiver.perform(ArtifactArchiver.java:270)
		at hudson.tasks.BuildStepCompatibilityLayer.perform(BuildStepCompatibilityLayer.java:80)
		at hudson.tasks.BuildStepMonitor$1.perform(BuildStepMonitor.java:20)
		at hudson.model.AbstractBuild$AbstractBuildExecution.perform(AbstractBuild.java:804)
		at hudson.model.AbstractBuild$AbstractBuildExecution.performAllBuildSteps(AbstractBuild.java:753)
		at hudson.model.Build$BuildExecution.post2(Build.java:177)
		at hudson.model.AbstractBuild$AbstractBuildExecution.post(AbstractBuild.java:698)
		at hudson.model.Run.execute(Run.java:1932)
		at hudson.model.FreeStyleBuild.run(FreeStyleBuild.java:43)
		at hudson.model.ResourceController.execute(ResourceController.java:97)
		at hudson.model.Executor.run(Executor.java:429)
Caused: hudson.FilePath$TunneledInterruptedException
	at hudson.FilePath$FileCallableWrapper.call(FilePath.java:3315)
	at hudson.remoting.UserRequest.perform(UserRequest.java:211)
	at hudson.remoting.UserRequest.perform(UserRequest.java:54)
	at hudson.remoting.Request$2.run(Request.java:375)
	at hudson.remoting.InterceptingExecutorService$1.call(InterceptingExecutorService.java:73)
	at java.util.concurrent.FutureTask.run(FutureTask.java:266)
	at java.util.concurrent.ThreadPoolExecutor.runWorker(ThreadPoolExecutor.java:1149)
	at java.util.concurrent.ThreadPoolExecutor$Worker.run(ThreadPoolExecutor.java:624)
	at java.lang.Thread.run(Thread.java:748)
Caused: java.lang.InterruptedException: java.lang.InterruptedException: no matches found within 10000
	at hudson.FilePath.act(FilePath.java:1159)
	at hudson.FilePath.act(FilePath.java:1146)
	at hudson.FilePath.validateAntFileMask(FilePath.java:2924)
	at hudson.tasks.ArtifactArchiver.perform(ArtifactArchiver.java:270)
	at hudson.tasks.BuildStepCompatibilityLayer.perform(BuildStepCompatibilityLayer.java:80)
	at hudson.tasks.BuildStepMonitor$1.perform(BuildStepMonitor.java:20)
	at hudson.model.AbstractBuild$AbstractBuildExecution.perform(AbstractBuild.java:804)
	at hudson.model.AbstractBuild$AbstractBuildExecution.performAllBuildSteps(AbstractBuild.java:753)
	at hudson.model.Build$BuildExecution.post2(Build.java:177)
	at hudson.model.AbstractBuild$AbstractBuildExecution.post(AbstractBuild.java:698)
	at hudson.model.Run.execute(Run.java:1932)
	at hudson.model.FreeStyleBuild.run(FreeStyleBuild.java:43)
	at hudson.model.ResourceController.execute(ResourceController.java:97)
	at hudson.model.Executor.run(Executor.java:429)
No artifacts found that match the file pattern "**/*.events,heapdumps/**,**/hs_err_pid*". Configuration error?
Recording test results
[Checks API] No suitable checks publisher found.
Build step 'Publish JUnit test result report' changed build result to UNSTABLE
Email was triggered for: Unstable (Test Failures)
Sending email for trigger: Unstable (Test Failures)

[JENKINS] Solr » Solr-Check-main - Build # 393 - Still Unstable!

Posted by Apache Jenkins Server <je...@builds.apache.org>.
Build: https://ci-builds.apache.org/job/Solr/job/Solr-Check-main/393/

1 tests failed.
FAILED:  org.apache.solr.cloud.SaslZkACLProviderTest.testSaslZkACLProvider

Error Message:
org.apache.zookeeper.KeeperException$AuthFailedException: KeeperErrorCode = AuthFailed for /solr

Stack Trace:
org.apache.zookeeper.KeeperException$AuthFailedException: KeeperErrorCode = AuthFailed for /solr
	at __randomizedtesting.SeedInfo.seed([A425FFDE1322DFA5:A0D1A9068A667CAB]:0)
	at org.apache.zookeeper.KeeperException.create(KeeperException.java:130)
	at org.apache.zookeeper.KeeperException.create(KeeperException.java:54)
	at org.apache.zookeeper.ZooKeeper.create(ZooKeeper.java:1734)
	at org.apache.solr.common.cloud.SolrZkClient.lambda$makePath$10(SolrZkClient.java:542)
	at org.apache.solr.common.cloud.ZkCmdExecutor.retryOperation(ZkCmdExecutor.java:79)
	at org.apache.solr.common.cloud.SolrZkClient.makePath(SolrZkClient.java:541)
	at org.apache.solr.common.cloud.SolrZkClient.makePath(SolrZkClient.java:433)
	at org.apache.solr.cloud.SaslZkACLProviderTest.setUp(SaslZkACLProviderTest.java:88)
	at jdk.internal.reflect.GeneratedMethodAccessor8.invoke(Unknown Source)
	at java.base/jdk.internal.reflect.DelegatingMethodAccessorImpl.invoke(DelegatingMethodAccessorImpl.java:43)
	at java.base/java.lang.reflect.Method.invoke(Method.java:566)
	at com.carrotsearch.randomizedtesting.RandomizedRunner.invoke(RandomizedRunner.java:1754)
	at com.carrotsearch.randomizedtesting.RandomizedRunner$9.evaluate(RandomizedRunner.java:976)
	at com.carrotsearch.randomizedtesting.RandomizedRunner$10.evaluate(RandomizedRunner.java:992)
	at com.carrotsearch.randomizedtesting.rules.SystemPropertiesRestoreRule$1.evaluate(SystemPropertiesRestoreRule.java:57)
	at org.junit.rules.RunRules.evaluate(RunRules.java:20)
	at org.apache.lucene.util.TestRuleSetupTeardownChained$1.evaluate(TestRuleSetupTeardownChained.java:44)
	at org.apache.lucene.util.AbstractBeforeAfterRule$1.evaluate(AbstractBeforeAfterRule.java:43)
	at org.apache.lucene.util.TestRuleThreadAndTestName$1.evaluate(TestRuleThreadAndTestName.java:45)
	at org.apache.lucene.util.TestRuleIgnoreAfterMaxFailures$1.evaluate(TestRuleIgnoreAfterMaxFailures.java:60)
	at org.apache.lucene.util.TestRuleMarkFailure$1.evaluate(TestRuleMarkFailure.java:44)
	at org.junit.rules.RunRules.evaluate(RunRules.java:20)
	at com.carrotsearch.randomizedtesting.rules.StatementAdapter.evaluate(StatementAdapter.java:36)
	at com.carrotsearch.randomizedtesting.ThreadLeakControl$StatementRunner.run(ThreadLeakControl.java:370)
	at com.carrotsearch.randomizedtesting.ThreadLeakControl.forkTimeoutingTask(ThreadLeakControl.java:819)
	at com.carrotsearch.randomizedtesting.ThreadLeakControl$3.evaluate(ThreadLeakControl.java:470)
	at com.carrotsearch.randomizedtesting.RandomizedRunner.runSingleTest(RandomizedRunner.java:951)
	at com.carrotsearch.randomizedtesting.RandomizedRunner$5.evaluate(RandomizedRunner.java:836)
	at com.carrotsearch.randomizedtesting.RandomizedRunner$6.evaluate(RandomizedRunner.java:887)
	at com.carrotsearch.randomizedtesting.RandomizedRunner$7.evaluate(RandomizedRunner.java:898)
	at com.carrotsearch.randomizedtesting.rules.StatementAdapter.evaluate(StatementAdapter.java:36)
	at org.apache.lucene.util.AbstractBeforeAfterRule$1.evaluate(AbstractBeforeAfterRule.java:43)
	at org.apache.lucene.util.AbstractBeforeAfterRule$1.evaluate(AbstractBeforeAfterRule.java:43)
	at com.carrotsearch.randomizedtesting.rules.SystemPropertiesRestoreRule$1.evaluate(SystemPropertiesRestoreRule.java:57)
	at org.junit.rules.RunRules.evaluate(RunRules.java:20)
	at org.apache.lucene.util.AbstractBeforeAfterRule$1.evaluate(AbstractBeforeAfterRule.java:43)
	at com.carrotsearch.randomizedtesting.rules.StatementAdapter.evaluate(StatementAdapter.java:36)
	at org.apache.lucene.util.TestRuleStoreClassName$1.evaluate(TestRuleStoreClassName.java:38)
	at com.carrotsearch.randomizedtesting.rules.NoShadowingOrOverridesOnMethodsRule$1.evaluate(NoShadowingOrOverridesOnMethodsRule.java:40)
	at com.carrotsearch.randomizedtesting.rules.NoShadowingOrOverridesOnMethodsRule$1.evaluate(NoShadowingOrOverridesOnMethodsRule.java:40)
	at com.carrotsearch.randomizedtesting.rules.StatementAdapter.evaluate(StatementAdapter.java:36)
	at com.carrotsearch.randomizedtesting.rules.StatementAdapter.evaluate(StatementAdapter.java:36)
	at org.apache.lucene.util.TestRuleAssertionsRequired$1.evaluate(TestRuleAssertionsRequired.java:53)
	at org.apache.lucene.util.AbstractBeforeAfterRule$1.evaluate(AbstractBeforeAfterRule.java:43)
	at org.apache.lucene.util.TestRuleMarkFailure$1.evaluate(TestRuleMarkFailure.java:44)
	at org.apache.lucene.util.TestRuleIgnoreAfterMaxFailures$1.evaluate(TestRuleIgnoreAfterMaxFailures.java:60)
	at org.apache.lucene.util.TestRuleIgnoreTestSuites$1.evaluate(TestRuleIgnoreTestSuites.java:47)
	at org.junit.rules.RunRules.evaluate(RunRules.java:20)
	at com.carrotsearch.randomizedtesting.rules.StatementAdapter.evaluate(StatementAdapter.java:36)
	at com.carrotsearch.randomizedtesting.ThreadLeakControl$StatementRunner.run(ThreadLeakControl.java:370)
	at com.carrotsearch.randomizedtesting.ThreadLeakControl.lambda$forkTimeoutingTask$0(ThreadLeakControl.java:826)
	at java.base/java.lang.Thread.run(Thread.java:834)




Build Log:
[...truncated 1258 lines...]
ERROR: The following test(s) have failed:
  - org.apache.solr.cloud.SaslZkACLProviderTest.testSaslZkACLProvider (:solr:core)
    Test output: /home/jenkins/jenkins-slave/workspace/Solr/Solr-Check-main/solr/core/build/test-results/test/outputs/OUTPUT-org.apache.solr.cloud.SaslZkACLProviderTest.txt
    Reproduce with: gradlew :solr:core:test --tests "org.apache.solr.cloud.SaslZkACLProviderTest.testSaslZkACLProvider" -Ptests.jvms=4 -Ptests.haltonfailure=false -Ptests.jvmargs=-XX:TieredStopAtLevel=1 -Ptests.seed=A425FFDE1322DFA5 -Ptests.multiplier=2 -Ptests.badapples=false -Ptests.file.encoding=US-ASCII


Deprecated Gradle features were used in this build, making it incompatible with Gradle 7.0.
Use '--warning-mode all' to show the individual deprecation warnings.
See https://docs.gradle.org/6.6.1/userguide/command_line_interface.html#sec:command_line_warnings

BUILD SUCCESSFUL in 48m 33s
296 actionable tasks: 296 executed
Build step 'Invoke Gradle script' changed build result to SUCCESS
Archiving artifacts
java.lang.InterruptedException: no matches found within 10000
	at hudson.FilePath$ValidateAntFileMask.hasMatch(FilePath.java:3066)
	at hudson.FilePath$ValidateAntFileMask.invoke(FilePath.java:2945)
	at hudson.FilePath$ValidateAntFileMask.invoke(FilePath.java:2926)
	at hudson.FilePath$FileCallableWrapper.call(FilePath.java:3313)
Also:   hudson.remoting.Channel$CallSiteStackTrace: Remote call to lucene1
		at hudson.remoting.Channel.attachCallSiteStackTrace(Channel.java:1800)
		at hudson.remoting.UserRequest$ExceptionResponse.retrieve(UserRequest.java:357)
		at hudson.remoting.Channel.call(Channel.java:1001)
		at hudson.FilePath.act(FilePath.java:1157)
		at hudson.FilePath.act(FilePath.java:1146)
		at hudson.FilePath.validateAntFileMask(FilePath.java:2924)
		at hudson.tasks.ArtifactArchiver.perform(ArtifactArchiver.java:270)
		at hudson.tasks.BuildStepCompatibilityLayer.perform(BuildStepCompatibilityLayer.java:80)
		at hudson.tasks.BuildStepMonitor$1.perform(BuildStepMonitor.java:20)
		at hudson.model.AbstractBuild$AbstractBuildExecution.perform(AbstractBuild.java:804)
		at hudson.model.AbstractBuild$AbstractBuildExecution.performAllBuildSteps(AbstractBuild.java:753)
		at hudson.model.Build$BuildExecution.post2(Build.java:177)
		at hudson.model.AbstractBuild$AbstractBuildExecution.post(AbstractBuild.java:698)
		at hudson.model.Run.execute(Run.java:1932)
		at hudson.model.FreeStyleBuild.run(FreeStyleBuild.java:43)
		at hudson.model.ResourceController.execute(ResourceController.java:97)
		at hudson.model.Executor.run(Executor.java:429)
Caused: hudson.FilePath$TunneledInterruptedException
	at hudson.FilePath$FileCallableWrapper.call(FilePath.java:3315)
	at hudson.remoting.UserRequest.perform(UserRequest.java:211)
	at hudson.remoting.UserRequest.perform(UserRequest.java:54)
	at hudson.remoting.Request$2.run(Request.java:375)
	at hudson.remoting.InterceptingExecutorService$1.call(InterceptingExecutorService.java:73)
	at java.util.concurrent.FutureTask.run(FutureTask.java:266)
	at java.util.concurrent.ThreadPoolExecutor.runWorker(ThreadPoolExecutor.java:1149)
	at java.util.concurrent.ThreadPoolExecutor$Worker.run(ThreadPoolExecutor.java:624)
	at java.lang.Thread.run(Thread.java:748)
Caused: java.lang.InterruptedException: java.lang.InterruptedException: no matches found within 10000
	at hudson.FilePath.act(FilePath.java:1159)
	at hudson.FilePath.act(FilePath.java:1146)
	at hudson.FilePath.validateAntFileMask(FilePath.java:2924)
	at hudson.tasks.ArtifactArchiver.perform(ArtifactArchiver.java:270)
	at hudson.tasks.BuildStepCompatibilityLayer.perform(BuildStepCompatibilityLayer.java:80)
	at hudson.tasks.BuildStepMonitor$1.perform(BuildStepMonitor.java:20)
	at hudson.model.AbstractBuild$AbstractBuildExecution.perform(AbstractBuild.java:804)
	at hudson.model.AbstractBuild$AbstractBuildExecution.performAllBuildSteps(AbstractBuild.java:753)
	at hudson.model.Build$BuildExecution.post2(Build.java:177)
	at hudson.model.AbstractBuild$AbstractBuildExecution.post(AbstractBuild.java:698)
	at hudson.model.Run.execute(Run.java:1932)
	at hudson.model.FreeStyleBuild.run(FreeStyleBuild.java:43)
	at hudson.model.ResourceController.execute(ResourceController.java:97)
	at hudson.model.Executor.run(Executor.java:429)
No artifacts found that match the file pattern "**/*.events,heapdumps/**,**/hs_err_pid*". Configuration error?
Recording test results
[Checks API] No suitable checks publisher found.
Build step 'Publish JUnit test result report' changed build result to UNSTABLE
Email was triggered for: Unstable (Test Failures)
Sending email for trigger: Unstable (Test Failures)

[JENKINS] Solr » Solr-Check-main - Build # 392 - Still Unstable!

Posted by Apache Jenkins Server <je...@builds.apache.org>.
Build: https://ci-builds.apache.org/job/Solr/job/Solr-Check-main/392/

3 tests failed.
FAILED:  org.apache.solr.cloud.DocValuesNotIndexedTest.testGroupingDVOnlySortLast

Error Message:
java.lang.AssertionError: Unexpected number of elements in the group for 'intGSL' size: '6' GroupValue: '920240002' rsp: {responseHeader={zkConnected=true, status=0, QTime=12, params={q=*:*, group.sort=id asc, _stateVer_=dv_coll:13, group.limit=100, rows=100, wt=javabin, version=2, group.field=intGSL, group=true}}, grouped={intGSL={matches=47, groups=[{groupValue=920240002, doclist={numFound=6,numFoundExact=true,start=0,maxScore=1.0,docs=[SolrDocument{id=0, intGSL=920240002, longGSL=1101060548527438581, doubleGSL=458.2172789803326, floatGSL=4940.2017, dateGSL=Sat Jan 07 00:06:57 CET 89766733, stringGSL=base_string_635901__00006408, boolGSL=true, sortableGSL=base_string_534329__00007739, _version_=1696776418135900160, _root_=0}, SolrDocument{id=1, intGSL=920240002, longGSL=1101060548527438581, doubleGSL=458.2172789803326, floatGSL=4940.2017, dateGSL=Sat Jan 07 00:06:57 CET 89766733, stringGSL=base_string_635901__00006408, boolGSL=false, sortableGSL=base_string_534329__00007739, _version_=1696776418134851584, _root_=1}, SolrDocument{id=2, intGSL=920240002, longGSL=1101060548527438581, doubleGSL=458.2172789803326, floatGSL=4940.2017, dateGSL=Sat Jan 07 00:06:57 CET 89766733, stringGSL=base_string_635901__00006408, boolGSL=true, sortableGSL=base_string_534329__00007739, _version_=1696776418136948736, _root_=2}, SolrDocument{id=3, intGSL=920240002, longGSL=1101060548527438581, doubleGSL=458.2172789803326, floatGSL=4940.2017, dateGSL=Sat Jan 07 00:06:57 CET 89766733, stringGSL=base_string_635901__00006408, boolGSL=false, sortableGSL=base_string_534329__00007739, _version_=1696776418137997312, _root_=3}, SolrDocument{id=4, intGSL=920240002, longGSL=1101060548527438581, doubleGSL=458.2172789803326, floatGSL=4940.2017, dateGSL=Sat Jan 07 00:06:57 CET 89766733, stringGSL=base_string_635901__00006408, boolGSL=true, sortableGSL=base_string_534329__00007739, _version_=1696776418136948736, _root_=4}, SolrDocument{id=5, intGSL=920240002, longGSL=1101060548527438581, doubleGSL=458.2172789803326, floatGSL=4940.2017, dateGSL=Sat Jan 07 00:06:57 CET 89766733, stringGSL=base_string_635901__00006408, boolGSL=false, sortableGSL=base_string_534329__00007739, _version_=1696776418141143040, _root_=5}]}}, {groupValue=920247632, doclist={numFound=5,numFoundExact=true,start=0,maxScore=1.0,docs=[SolrDocument{id=10, intGSL=920247632, longGSL=1101060548527446860, doubleGSL=4142.217278980333, floatGSL=10017.202, dateGSL=Sat Jan 07 00:07:05 CET 89766733, stringGSL=base_string_635901__00010159, boolGSL=true, sortableGSL=base_string_534329__00010172, _version_=1696776418135900161, _root_=10}, SolrDocument{id=11, intGSL=920247632, longGSL=1101060548527446860, doubleGSL=4142.217278980333, floatGSL=10017.202, dateGSL=Sat Jan 07 00:07:05 CET 89766733, stringGSL=base_string_635901__00010159, boolGSL=false, sortableGSL=base_string_534329__00010172, _version_=1696776418136948736, _root_=11}, SolrDocument{id=12, intGSL=920247632, longGSL=1101060548527446860, doubleGSL=4142.217278980333, floatGSL=10017.202, dateGSL=Sat Jan 07 00:07:05 CET 89766733, stringGSL=base_string_635901__00010159, boolGSL=true, sortableGSL=base_string_534329__00010172, _version_=1696776418136948738, _root_=12}, SolrDocument{id=13, intGSL=920247632, longGSL=1101060548527446860, doubleGSL=4142.217278980333, floatGSL=10017.202, dateGSL=Sat Jan 07 00:07:05 CET 89766733, stringGSL=base_string_635901__00010159, boolGSL=false, sortableGSL=base_string_534329__00010172, _version_=1696776418136948737, _root_=13}, SolrDocument{id=8, intGSL=920247632, longGSL=1101060548527446860, doubleGSL=4142.217278980333, floatGSL=10017.202, dateGSL=Sat Jan 07 00:07:05 CET 89766733, stringGSL=base_string_635901__00010159, boolGSL=true, sortableGSL=base_string_534329__00010172, _version_=1696776418135900160, _root_=8}]}}, {groupValue=920247667, doclist={numFound=6,numFoundExact=true,start=0,maxScore=1.0,docs=[SolrDocument{id=14, intGSL=920247667, longGSL=1101060548527454366, doubleGSL=7307.217278980333, floatGSL=11704.202, dateGSL=Sat Jan 07 00:07:14 CET 89766733, stringGSL=base_string_635901__00017768, boolGSL=true, sortableGSL=base_string_534329__00020089, _version_=1696776418136948738, _root_=14}, SolrDocument{id=15, intGSL=920247667, longGSL=1101060548527454366, doubleGSL=7307.217278980333, floatGSL=11704.202, dateGSL=Sat Jan 07 00:07:14 CET 89766733, stringGSL=base_string_635901__00017768, boolGSL=false, sortableGSL=base_string_534329__00020089, _version_=1696776418137997312, _root_=15}, SolrDocument{id=16, intGSL=920247667, longGSL=1101060548527454366, doubleGSL=7307.217278980333, floatGSL=11704.202, dateGSL=Sat Jan 07 00:07:14 CET 89766733, stringGSL=base_string_635901__00017768, boolGSL=true, sortableGSL=base_string_534329__00020089, _version_=1696776418137997313, _root_=16}, SolrDocument{id=17, intGSL=920247667, longGSL=1101060548527454366, doubleGSL=7307.217278980333, floatGSL=11704.202, dateGSL=Sat Jan 07 00:07:14 CET 89766733, stringGSL=base_string_635901__00017768, boolGSL=false, sortableGSL=base_string_534329__00020089, _version_=1696776418141143041, _root_=17}, SolrDocument{id=19, intGSL=920247667, longGSL=1101060548527454366, doubleGSL=7307.217278980333, floatGSL=11704.202, dateGSL=Sat Jan 07 00:07:14 CET 89766733, stringGSL=base_string_635901__00017768, boolGSL=false, sortableGSL=base_string_534329__00020089, _version_=1696776418141143042, _root_=19}, SolrDocument{id=20, intGSL=920247667, longGSL=1101060548527454366, doubleGSL=7307.217278980333, floatGSL=11704.202, dateGSL=Sat Jan 07 00:07:14 CET 89766733, stringGSL=base_string_635901__00017768, boolGSL=true, sortableGSL=base_string_534329__00020089, _version_=1696776418137997314, _root_=20}]}}, {groupValue=null, doclist={numFound=6,numFoundExact=true,start=0,maxScore=1.0,docs=[SolrDocument{id=10000, _version_=1696776418140094464, _root_=10000}, SolrDocument{id=10005, _version_=1696776418136948737, _root_=10005}, SolrDocument{id=10015, _version_=1696776418136948739, _root_=10015}, SolrDocument{id=10020, _version_=1696776418136948740, _root_=10020}, SolrDocument{id=10030, _version_=1696776418141143047, _root_=10030}, SolrDocument{id=10040, _version_=1696776418142191616, _root_=10040}]}}, {groupValue=920248048, doclist={numFound=6,numFoundExact=true,start=0,maxScore=1.0,docs=[SolrDocument{id=21, intGSL=920248048, longGSL=1101060548527456890, doubleGSL=11472.217278980332, floatGSL=18036.201, dateGSL=Sat Jan 07 00:07:18 CET 89766733, stringGSL=base_string_635901__00026086, boolGSL=false, sortableGSL=base_string_534329__00025189, _version_=1696776418141143043, _root_=21}, SolrDocument{id=22, intGSL=920248048, longGSL=1101060548527456890, doubleGSL=11472.217278980332, floatGSL=18036.201, dateGSL=Sat Jan 07 00:07:18 CET 89766733, stringGSL=base_string_635901__00026086, boolGSL=true, sortableGSL=base_string_534329__00025189, _version_=1696776418137997315, _root_=22}, SolrDocument{id=23, intGSL=920248048, longGSL=1101060548527456890, doubleGSL=11472.217278980332, floatGSL=18036.201, dateGSL=Sat Jan 07 00:07:18 CET 89766733, stringGSL=base_string_635901__00026086, boolGSL=false, sortableGSL=base_string_534329__00025189, _version_=1696776418141143044, _root_=23}, SolrDocument{id=24, intGSL=920248048, longGSL=1101060548527456890, doubleGSL=11472.217278980332, floatGSL=18036.201, dateGSL=Sat Jan 07 00:07:18 CET 89766733, stringGSL=base_string_635901__00026086, boolGSL=true, sortableGSL=base_string_534329__00025189, _version_=1696776418136948741, _root_=24}, SolrDocument{id=25, intGSL=920248048, longGSL=1101060548527456890, doubleGSL=11472.217278980332, floatGSL=18036.201, dateGSL=Sat Jan 07 00:07:18 CET 89766733, stringGSL=base_string_635901__00026086, boolGSL=false, sortableGSL=base_string_534329__00025189, _version_=1696776418141143045, _root_=25}, SolrDocument{id=27, intGSL=920248048, longGSL=1101060548527456890, doubleGSL=11472.217278980332, floatGSL=18036.201, dateGSL=Sat Jan 07 00:07:18 CET 89766733, stringGSL=base_string_635901__00026086, boolGSL=false, sortableGSL=base_string_534329__00025189, _version_=1696776418136948742, _root_=27}]}}, {groupValue=920253519, doclist={numFound=5,numFoundExact=true,start=0,maxScore=1.0,docs=[SolrDocument{id=28, intGSL=920253519, longGSL=1101060548527462578, doubleGSL=14801.217278980332, floatGSL=26478.201, dateGSL=Sat Jan 07 00:07:18 CET 89766733, stringGSL=base_string_635901__00031937, boolGSL=true, sortableGSL=base_string_534329__00034725, _version_=1696776418136948743, _root_=28}, SolrDocument{id=29, intGSL=920253519, longGSL=1101060548527462578, doubleGSL=14801.217278980332, floatGSL=26478.201, dateGSL=Sat Jan 07 00:07:18 CET 89766733, stringGSL=base_string_635901__00031937, boolGSL=false, sortableGSL=base_string_534329__00034725, _version_=1696776418141143046, _root_=29}, SolrDocument{id=32, intGSL=920253519, longGSL=1101060548527462578, doubleGSL=14801.217278980332, floatGSL=26478.201, dateGSL=Sat Jan 07 00:07:18 CET 89766733, stringGSL=base_string_635901__00031937, boolGSL=true, sortableGSL=base_string_534329__00034725, _version_=1696776418136948744, _root_=32}, SolrDocument{id=33, intGSL=920253519, longGSL=1101060548527462578, doubleGSL=14801.217278980332, floatGSL=26478.201, dateGSL=Sat Jan 07 00:07:18 CET 89766733, stringGSL=base_string_635901__00031937, boolGSL=false, sortableGSL=base_string_534329__00034725, _version_=1696776418141143048, _root_=33}, SolrDocument{id=34, intGSL=920253519, longGSL=1101060548527462578, doubleGSL=14801.217278980332, floatGSL=26478.201, dateGSL=Sat Jan 07 00:07:18 CET 89766733, stringGSL=base_string_635901__00031937, boolGSL=true, sortableGSL=base_string_534329__00034725, _version_=1696776418137997316, _root_=34}]}}, {groupValue=920260385, doclist={numFound=6,numFoundExact=true,start=0,maxScore=1.0,docs=[SolrDocument{id=35, intGSL=920260385, longGSL=1101060548527466153, doubleGSL=24348.217278980334, floatGSL=28304.201, dateGSL=Sat Jan 07 00:07:22 CET 89766733, stringGSL=base_string_635901__00037601, boolGSL=false, sortableGSL=base_string_534329__00039317, _version_=1696776418137997317, _root_=35}, SolrDocument{id=36, intGSL=920260385, longGSL=1101060548527466153, doubleGSL=24348.217278980334, floatGSL=28304.201, dateGSL=Sat Jan 07 00:07:22 CET 89766733, stringGSL=base_string_635901__00037601, boolGSL=true, sortableGSL=base_string_534329__00039317, _version_=1696776418137997318, _root_=36}, SolrDocument{id=37, intGSL=920260385, longGSL=1101060548527466153, doubleGSL=24348.217278980334, floatGSL=28304.201, dateGSL=Sat Jan 07 00:07:22 CET 89766733, stringGSL=base_string_635901__00037601, boolGSL=false, sortableGSL=base_string_534329__00039317, _version_=1696776418141143049, _root_=37}, SolrDocument{id=38, intGSL=920260385, longGSL=1101060548527466153, doubleGSL=24348.217278980334, floatGSL=28304.201, dateGSL=Sat Jan 07 00:07:22 CET 89766733, stringGSL=base_string_635901__00037601, boolGSL=true, sortableGSL=base_string_534329__00039317, _version_=1696776418136948745, _root_=38}, SolrDocument{id=40, intGSL=920260385, longGSL=1101060548527466153, doubleGSL=24348.217278980334, floatGSL=28304.201, dateGSL=Sat Jan 07 00:07:22 CET 89766733, stringGSL=base_string_635901__00037601, boolGSL=true, sortableGSL=base_string_534329__00039317, _version_=1696776418136948746, _root_=40}, SolrDocument{id=41, intGSL=920260385, longGSL=1101060548527466153, doubleGSL=24348.217278980334, floatGSL=28304.201, dateGSL=Sat Jan 07 00:07:22 CET 89766733, stringGSL=base_string_635901__00037601, boolGSL=false, sortableGSL=base_string_534329__00039317, _version_=1696776418137997319, _root_=41}]}}, {groupValue=920265971, doclist={numFound=7,numFoundExact=true,start=0,maxScore=1.0,docs=[SolrDocument{id=42, intGSL=920265971, longGSL=1101060548527472322, doubleGSL=31499.217278980334, floatGSL=30437.201, dateGSL=Sat Jan 07 00:07:24 CET 89766733, stringGSL=base_string_635901__00043003, boolGSL=true, sortableGSL=base_string_534329__00044993, _version_=1696776418136948747, _root_=42}, SolrDocument{id=43, intGSL=920265971, longGSL=1101060548527472322, doubleGSL=31499.217278980334, floatGSL=30437.201, dateGSL=Sat Jan 07 00:07:24 CET 89766733, stringGSL=base_string_635901__00043003, boolGSL=false, sortableGSL=base_string_534329__00044993, _version_=1696776418137997320, _root_=43}, SolrDocument{id=44, intGSL=920265971, longGSL=1101060548527472322, doubleGSL=31499.217278980334, floatGSL=30437.201, dateGSL=Sat Jan 07 00:07:24 CET 89766733, stringGSL=base_string_635901__00043003, boolGSL=true, sortableGSL=base_string_534329__00044993, _version_=1696776418139045888, _root_=44}, SolrDocument{id=45, intGSL=920265971, longGSL=1101060548527472322, doubleGSL=31499.217278980334, floatGSL=30437.201, dateGSL=Sat Jan 07 00:07:24 CET 89766733, stringGSL=base_string_635901__00043003, boolGSL=false, sortableGSL=base_string_534329__00044993, _version_=1696776418142191617, _root_=45}, SolrDocument{id=46, intGSL=920265971, longGSL=1101060548527472322, doubleGSL=31499.217278980334, floatGSL=30437.201, dateGSL=Sat Jan 07 00:07:24 CET 89766733, stringGSL=base_string_635901__00043003, boolGSL=true, sortableGSL=base_string_534329__00044993, _version_=1696776418139045889, _root_=46}, SolrDocument{id=47, intGSL=920265971, longGSL=1101060548527472322, doubleGSL=31499.217278980334, floatGSL=30437.201, dateGSL=Sat Jan 07 00:07:24 CET 89766733, stringGSL=base_string_635901__00043003, boolGSL=false, sortableGSL=base_string_534329__00044993, _version_=1696776418139045890, _root_=47}, SolrDocument{id=48, intGSL=920265971, longGSL=1101060548527472322, doubleGSL=31499.217278980334, floatGSL=30437.201, dateGSL=Sat Jan 07 00:07:24 CET 89766733, stringGSL=base_string_635901__00043003, boolGSL=true, sortableGSL=base_string_534329__00044993, _version_=1696776418136948748, _root_=48}]}}]}}}

Stack Trace:
java.lang.AssertionError: Unexpected number of elements in the group for 'intGSL' size: '6' GroupValue: '920240002' rsp: {responseHeader={zkConnected=true, status=0, QTime=12, params={q=*:*, group.sort=id asc, _stateVer_=dv_coll:13, group.limit=100, rows=100, wt=javabin, version=2, group.field=intGSL, group=true}}, grouped={intGSL={matches=47, groups=[{groupValue=920240002, doclist={numFound=6,numFoundExact=true,start=0,maxScore=1.0,docs=[SolrDocument{id=0, intGSL=920240002, longGSL=1101060548527438581, doubleGSL=458.2172789803326, floatGSL=4940.2017, dateGSL=Sat Jan 07 00:06:57 CET 89766733, stringGSL=base_string_635901__00006408, boolGSL=true, sortableGSL=base_string_534329__00007739, _version_=1696776418135900160, _root_=0}, SolrDocument{id=1, intGSL=920240002, longGSL=1101060548527438581, doubleGSL=458.2172789803326, floatGSL=4940.2017, dateGSL=Sat Jan 07 00:06:57 CET 89766733, stringGSL=base_string_635901__00006408, boolGSL=false, sortableGSL=base_string_534329__00007739, _version_=1696776418134851584, _root_=1}, SolrDocument{id=2, intGSL=920240002, longGSL=1101060548527438581, doubleGSL=458.2172789803326, floatGSL=4940.2017, dateGSL=Sat Jan 07 00:06:57 CET 89766733, stringGSL=base_string_635901__00006408, boolGSL=true, sortableGSL=base_string_534329__00007739, _version_=1696776418136948736, _root_=2}, SolrDocument{id=3, intGSL=920240002, longGSL=1101060548527438581, doubleGSL=458.2172789803326, floatGSL=4940.2017, dateGSL=Sat Jan 07 00:06:57 CET 89766733, stringGSL=base_string_635901__00006408, boolGSL=false, sortableGSL=base_string_534329__00007739, _version_=1696776418137997312, _root_=3}, SolrDocument{id=4, intGSL=920240002, longGSL=1101060548527438581, doubleGSL=458.2172789803326, floatGSL=4940.2017, dateGSL=Sat Jan 07 00:06:57 CET 89766733, stringGSL=base_string_635901__00006408, boolGSL=true, sortableGSL=base_string_534329__00007739, _version_=1696776418136948736, _root_=4}, SolrDocument{id=5, intGSL=920240002, longGSL=1101060548527438581, doubleGSL=458.2172789803326, floatGSL=4940.2017, dateGSL=Sat Jan 07 00:06:57 CET 89766733, stringGSL=base_string_635901__00006408, boolGSL=false, sortableGSL=base_string_534329__00007739, _version_=1696776418141143040, _root_=5}]}}, {groupValue=920247632, doclist={numFound=5,numFoundExact=true,start=0,maxScore=1.0,docs=[SolrDocument{id=10, intGSL=920247632, longGSL=1101060548527446860, doubleGSL=4142.217278980333, floatGSL=10017.202, dateGSL=Sat Jan 07 00:07:05 CET 89766733, stringGSL=base_string_635901__00010159, boolGSL=true, sortableGSL=base_string_534329__00010172, _version_=1696776418135900161, _root_=10}, SolrDocument{id=11, intGSL=920247632, longGSL=1101060548527446860, doubleGSL=4142.217278980333, floatGSL=10017.202, dateGSL=Sat Jan 07 00:07:05 CET 89766733, stringGSL=base_string_635901__00010159, boolGSL=false, sortableGSL=base_string_534329__00010172, _version_=1696776418136948736, _root_=11}, SolrDocument{id=12, intGSL=920247632, longGSL=1101060548527446860, doubleGSL=4142.217278980333, floatGSL=10017.202, dateGSL=Sat Jan 07 00:07:05 CET 89766733, stringGSL=base_string_635901__00010159, boolGSL=true, sortableGSL=base_string_534329__00010172, _version_=1696776418136948738, _root_=12}, SolrDocument{id=13, intGSL=920247632, longGSL=1101060548527446860, doubleGSL=4142.217278980333, floatGSL=10017.202, dateGSL=Sat Jan 07 00:07:05 CET 89766733, stringGSL=base_string_635901__00010159, boolGSL=false, sortableGSL=base_string_534329__00010172, _version_=1696776418136948737, _root_=13}, SolrDocument{id=8, intGSL=920247632, longGSL=1101060548527446860, doubleGSL=4142.217278980333, floatGSL=10017.202, dateGSL=Sat Jan 07 00:07:05 CET 89766733, stringGSL=base_string_635901__00010159, boolGSL=true, sortableGSL=base_string_534329__00010172, _version_=1696776418135900160, _root_=8}]}}, {groupValue=920247667, doclist={numFound=6,numFoundExact=true,start=0,maxScore=1.0,docs=[SolrDocument{id=14, intGSL=920247667, longGSL=1101060548527454366, doubleGSL=7307.217278980333, floatGSL=11704.202, dateGSL=Sat Jan 07 00:07:14 CET 89766733, stringGSL=base_string_635901__00017768, boolGSL=true, sortableGSL=base_string_534329__00020089, _version_=1696776418136948738, _root_=14}, SolrDocument{id=15, intGSL=920247667, longGSL=1101060548527454366, doubleGSL=7307.217278980333, floatGSL=11704.202, dateGSL=Sat Jan 07 00:07:14 CET 89766733, stringGSL=base_string_635901__00017768, boolGSL=false, sortableGSL=base_string_534329__00020089, _version_=1696776418137997312, _root_=15}, SolrDocument{id=16, intGSL=920247667, longGSL=1101060548527454366, doubleGSL=7307.217278980333, floatGSL=11704.202, dateGSL=Sat Jan 07 00:07:14 CET 89766733, stringGSL=base_string_635901__00017768, boolGSL=true, sortableGSL=base_string_534329__00020089, _version_=1696776418137997313, _root_=16}, SolrDocument{id=17, intGSL=920247667, longGSL=1101060548527454366, doubleGSL=7307.217278980333, floatGSL=11704.202, dateGSL=Sat Jan 07 00:07:14 CET 89766733, stringGSL=base_string_635901__00017768, boolGSL=false, sortableGSL=base_string_534329__00020089, _version_=1696776418141143041, _root_=17}, SolrDocument{id=19, intGSL=920247667, longGSL=1101060548527454366, doubleGSL=7307.217278980333, floatGSL=11704.202, dateGSL=Sat Jan 07 00:07:14 CET 89766733, stringGSL=base_string_635901__00017768, boolGSL=false, sortableGSL=base_string_534329__00020089, _version_=1696776418141143042, _root_=19}, SolrDocument{id=20, intGSL=920247667, longGSL=1101060548527454366, doubleGSL=7307.217278980333, floatGSL=11704.202, dateGSL=Sat Jan 07 00:07:14 CET 89766733, stringGSL=base_string_635901__00017768, boolGSL=true, sortableGSL=base_string_534329__00020089, _version_=1696776418137997314, _root_=20}]}}, {groupValue=null, doclist={numFound=6,numFoundExact=true,start=0,maxScore=1.0,docs=[SolrDocument{id=10000, _version_=1696776418140094464, _root_=10000}, SolrDocument{id=10005, _version_=1696776418136948737, _root_=10005}, SolrDocument{id=10015, _version_=1696776418136948739, _root_=10015}, SolrDocument{id=10020, _version_=1696776418136948740, _root_=10020}, SolrDocument{id=10030, _version_=1696776418141143047, _root_=10030}, SolrDocument{id=10040, _version_=1696776418142191616, _root_=10040}]}}, {groupValue=920248048, doclist={numFound=6,numFoundExact=true,start=0,maxScore=1.0,docs=[SolrDocument{id=21, intGSL=920248048, longGSL=1101060548527456890, doubleGSL=11472.217278980332, floatGSL=18036.201, dateGSL=Sat Jan 07 00:07:18 CET 89766733, stringGSL=base_string_635901__00026086, boolGSL=false, sortableGSL=base_string_534329__00025189, _version_=1696776418141143043, _root_=21}, SolrDocument{id=22, intGSL=920248048, longGSL=1101060548527456890, doubleGSL=11472.217278980332, floatGSL=18036.201, dateGSL=Sat Jan 07 00:07:18 CET 89766733, stringGSL=base_string_635901__00026086, boolGSL=true, sortableGSL=base_string_534329__00025189, _version_=1696776418137997315, _root_=22}, SolrDocument{id=23, intGSL=920248048, longGSL=1101060548527456890, doubleGSL=11472.217278980332, floatGSL=18036.201, dateGSL=Sat Jan 07 00:07:18 CET 89766733, stringGSL=base_string_635901__00026086, boolGSL=false, sortableGSL=base_string_534329__00025189, _version_=1696776418141143044, _root_=23}, SolrDocument{id=24, intGSL=920248048, longGSL=1101060548527456890, doubleGSL=11472.217278980332, floatGSL=18036.201, dateGSL=Sat Jan 07 00:07:18 CET 89766733, stringGSL=base_string_635901__00026086, boolGSL=true, sortableGSL=base_string_534329__00025189, _version_=1696776418136948741, _root_=24}, SolrDocument{id=25, intGSL=920248048, longGSL=1101060548527456890, doubleGSL=11472.217278980332, floatGSL=18036.201, dateGSL=Sat Jan 07 00:07:18 CET 89766733, stringGSL=base_string_635901__00026086, boolGSL=false, sortableGSL=base_string_534329__00025189, _version_=1696776418141143045, _root_=25}, SolrDocument{id=27, intGSL=920248048, longGSL=1101060548527456890, doubleGSL=11472.217278980332, floatGSL=18036.201, dateGSL=Sat Jan 07 00:07:18 CET 89766733, stringGSL=base_string_635901__00026086, boolGSL=false, sortableGSL=base_string_534329__00025189, _version_=1696776418136948742, _root_=27}]}}, {groupValue=920253519, doclist={numFound=5,numFoundExact=true,start=0,maxScore=1.0,docs=[SolrDocument{id=28, intGSL=920253519, longGSL=1101060548527462578, doubleGSL=14801.217278980332, floatGSL=26478.201, dateGSL=Sat Jan 07 00:07:18 CET 89766733, stringGSL=base_string_635901__00031937, boolGSL=true, sortableGSL=base_string_534329__00034725, _version_=1696776418136948743, _root_=28}, SolrDocument{id=29, intGSL=920253519, longGSL=1101060548527462578, doubleGSL=14801.217278980332, floatGSL=26478.201, dateGSL=Sat Jan 07 00:07:18 CET 89766733, stringGSL=base_string_635901__00031937, boolGSL=false, sortableGSL=base_string_534329__00034725, _version_=1696776418141143046, _root_=29}, SolrDocument{id=32, intGSL=920253519, longGSL=1101060548527462578, doubleGSL=14801.217278980332, floatGSL=26478.201, dateGSL=Sat Jan 07 00:07:18 CET 89766733, stringGSL=base_string_635901__00031937, boolGSL=true, sortableGSL=base_string_534329__00034725, _version_=1696776418136948744, _root_=32}, SolrDocument{id=33, intGSL=920253519, longGSL=1101060548527462578, doubleGSL=14801.217278980332, floatGSL=26478.201, dateGSL=Sat Jan 07 00:07:18 CET 89766733, stringGSL=base_string_635901__00031937, boolGSL=false, sortableGSL=base_string_534329__00034725, _version_=1696776418141143048, _root_=33}, SolrDocument{id=34, intGSL=920253519, longGSL=1101060548527462578, doubleGSL=14801.217278980332, floatGSL=26478.201, dateGSL=Sat Jan 07 00:07:18 CET 89766733, stringGSL=base_string_635901__00031937, boolGSL=true, sortableGSL=base_string_534329__00034725, _version_=1696776418137997316, _root_=34}]}}, {groupValue=920260385, doclist={numFound=6,numFoundExact=true,start=0,maxScore=1.0,docs=[SolrDocument{id=35, intGSL=920260385, longGSL=1101060548527466153, doubleGSL=24348.217278980334, floatGSL=28304.201, dateGSL=Sat Jan 07 00:07:22 CET 89766733, stringGSL=base_string_635901__00037601, boolGSL=false, sortableGSL=base_string_534329__00039317, _version_=1696776418137997317, _root_=35}, SolrDocument{id=36, intGSL=920260385, longGSL=1101060548527466153, doubleGSL=24348.217278980334, floatGSL=28304.201, dateGSL=Sat Jan 07 00:07:22 CET 89766733, stringGSL=base_string_635901__00037601, boolGSL=true, sortableGSL=base_string_534329__00039317, _version_=1696776418137997318, _root_=36}, SolrDocument{id=37, intGSL=920260385, longGSL=1101060548527466153, doubleGSL=24348.217278980334, floatGSL=28304.201, dateGSL=Sat Jan 07 00:07:22 CET 89766733, stringGSL=base_string_635901__00037601, boolGSL=false, sortableGSL=base_string_534329__00039317, _version_=1696776418141143049, _root_=37}, SolrDocument{id=38, intGSL=920260385, longGSL=1101060548527466153, doubleGSL=24348.217278980334, floatGSL=28304.201, dateGSL=Sat Jan 07 00:07:22 CET 89766733, stringGSL=base_string_635901__00037601, boolGSL=true, sortableGSL=base_string_534329__00039317, _version_=1696776418136948745, _root_=38}, SolrDocument{id=40, intGSL=920260385, longGSL=1101060548527466153, doubleGSL=24348.217278980334, floatGSL=28304.201, dateGSL=Sat Jan 07 00:07:22 CET 89766733, stringGSL=base_string_635901__00037601, boolGSL=true, sortableGSL=base_string_534329__00039317, _version_=1696776418136948746, _root_=40}, SolrDocument{id=41, intGSL=920260385, longGSL=1101060548527466153, doubleGSL=24348.217278980334, floatGSL=28304.201, dateGSL=Sat Jan 07 00:07:22 CET 89766733, stringGSL=base_string_635901__00037601, boolGSL=false, sortableGSL=base_string_534329__00039317, _version_=1696776418137997319, _root_=41}]}}, {groupValue=920265971, doclist={numFound=7,numFoundExact=true,start=0,maxScore=1.0,docs=[SolrDocument{id=42, intGSL=920265971, longGSL=1101060548527472322, doubleGSL=31499.217278980334, floatGSL=30437.201, dateGSL=Sat Jan 07 00:07:24 CET 89766733, stringGSL=base_string_635901__00043003, boolGSL=true, sortableGSL=base_string_534329__00044993, _version_=1696776418136948747, _root_=42}, SolrDocument{id=43, intGSL=920265971, longGSL=1101060548527472322, doubleGSL=31499.217278980334, floatGSL=30437.201, dateGSL=Sat Jan 07 00:07:24 CET 89766733, stringGSL=base_string_635901__00043003, boolGSL=false, sortableGSL=base_string_534329__00044993, _version_=1696776418137997320, _root_=43}, SolrDocument{id=44, intGSL=920265971, longGSL=1101060548527472322, doubleGSL=31499.217278980334, floatGSL=30437.201, dateGSL=Sat Jan 07 00:07:24 CET 89766733, stringGSL=base_string_635901__00043003, boolGSL=true, sortableGSL=base_string_534329__00044993, _version_=1696776418139045888, _root_=44}, SolrDocument{id=45, intGSL=920265971, longGSL=1101060548527472322, doubleGSL=31499.217278980334, floatGSL=30437.201, dateGSL=Sat Jan 07 00:07:24 CET 89766733, stringGSL=base_string_635901__00043003, boolGSL=false, sortableGSL=base_string_534329__00044993, _version_=1696776418142191617, _root_=45}, SolrDocument{id=46, intGSL=920265971, longGSL=1101060548527472322, doubleGSL=31499.217278980334, floatGSL=30437.201, dateGSL=Sat Jan 07 00:07:24 CET 89766733, stringGSL=base_string_635901__00043003, boolGSL=true, sortableGSL=base_string_534329__00044993, _version_=1696776418139045889, _root_=46}, SolrDocument{id=47, intGSL=920265971, longGSL=1101060548527472322, doubleGSL=31499.217278980334, floatGSL=30437.201, dateGSL=Sat Jan 07 00:07:24 CET 89766733, stringGSL=base_string_635901__00043003, boolGSL=false, sortableGSL=base_string_534329__00044993, _version_=1696776418139045890, _root_=47}, SolrDocument{id=48, intGSL=920265971, longGSL=1101060548527472322, doubleGSL=31499.217278980334, floatGSL=30437.201, dateGSL=Sat Jan 07 00:07:24 CET 89766733, stringGSL=base_string_635901__00043003, boolGSL=true, sortableGSL=base_string_534329__00044993, _version_=1696776418136948748, _root_=48}]}}]}}}
	at __randomizedtesting.SeedInfo.seed([9610848E61351D66:23E3C0BD00927838]:0)
	at org.junit.Assert.fail(Assert.java:89)
	at org.apache.solr.cloud.DocValuesNotIndexedTest.doGroupingDvOnly(DocValuesNotIndexedTest.java:403)
	at org.apache.solr.cloud.DocValuesNotIndexedTest.testGroupingDVOnlySortLast(DocValuesNotIndexedTest.java:331)
	at java.base/jdk.internal.reflect.NativeMethodAccessorImpl.invoke0(Native Method)
	at java.base/jdk.internal.reflect.NativeMethodAccessorImpl.invoke(NativeMethodAccessorImpl.java:62)
	at java.base/jdk.internal.reflect.DelegatingMethodAccessorImpl.invoke(DelegatingMethodAccessorImpl.java:43)
	at java.base/java.lang.reflect.Method.invoke(Method.java:566)
	at com.carrotsearch.randomizedtesting.RandomizedRunner.invoke(RandomizedRunner.java:1754)
	at com.carrotsearch.randomizedtesting.RandomizedRunner$8.evaluate(RandomizedRunner.java:942)
	at com.carrotsearch.randomizedtesting.RandomizedRunner$9.evaluate(RandomizedRunner.java:978)
	at com.carrotsearch.randomizedtesting.RandomizedRunner$10.evaluate(RandomizedRunner.java:992)
	at com.carrotsearch.randomizedtesting.rules.SystemPropertiesRestoreRule$1.evaluate(SystemPropertiesRestoreRule.java:57)
	at org.junit.rules.RunRules.evaluate(RunRules.java:20)
	at org.apache.lucene.util.TestRuleSetupTeardownChained$1.evaluate(TestRuleSetupTeardownChained.java:44)
	at org.apache.lucene.util.AbstractBeforeAfterRule$1.evaluate(AbstractBeforeAfterRule.java:43)
	at org.apache.lucene.util.TestRuleThreadAndTestName$1.evaluate(TestRuleThreadAndTestName.java:45)
	at org.apache.lucene.util.TestRuleIgnoreAfterMaxFailures$1.evaluate(TestRuleIgnoreAfterMaxFailures.java:60)
	at org.apache.lucene.util.TestRuleMarkFailure$1.evaluate(TestRuleMarkFailure.java:44)
	at org.junit.rules.RunRules.evaluate(RunRules.java:20)
	at com.carrotsearch.randomizedtesting.rules.StatementAdapter.evaluate(StatementAdapter.java:36)
	at com.carrotsearch.randomizedtesting.ThreadLeakControl$StatementRunner.run(ThreadLeakControl.java:370)
	at com.carrotsearch.randomizedtesting.ThreadLeakControl.forkTimeoutingTask(ThreadLeakControl.java:819)
	at com.carrotsearch.randomizedtesting.ThreadLeakControl$3.evaluate(ThreadLeakControl.java:470)
	at com.carrotsearch.randomizedtesting.RandomizedRunner.runSingleTest(RandomizedRunner.java:951)
	at com.carrotsearch.randomizedtesting.RandomizedRunner$5.evaluate(RandomizedRunner.java:836)
	at com.carrotsearch.randomizedtesting.RandomizedRunner$6.evaluate(RandomizedRunner.java:887)
	at com.carrotsearch.randomizedtesting.RandomizedRunner$7.evaluate(RandomizedRunner.java:898)
	at com.carrotsearch.randomizedtesting.rules.StatementAdapter.evaluate(StatementAdapter.java:36)
	at org.apache.lucene.util.AbstractBeforeAfterRule$1.evaluate(AbstractBeforeAfterRule.java:43)
	at org.apache.lucene.util.AbstractBeforeAfterRule$1.evaluate(AbstractBeforeAfterRule.java:43)
	at com.carrotsearch.randomizedtesting.rules.SystemPropertiesRestoreRule$1.evaluate(SystemPropertiesRestoreRule.java:57)
	at org.junit.rules.RunRules.evaluate(RunRules.java:20)
	at org.apache.lucene.util.AbstractBeforeAfterRule$1.evaluate(AbstractBeforeAfterRule.java:43)
	at com.carrotsearch.randomizedtesting.rules.StatementAdapter.evaluate(StatementAdapter.java:36)
	at org.apache.lucene.util.TestRuleStoreClassName$1.evaluate(TestRuleStoreClassName.java:38)
	at com.carrotsearch.randomizedtesting.rules.NoShadowingOrOverridesOnMethodsRule$1.evaluate(NoShadowingOrOverridesOnMethodsRule.java:40)
	at com.carrotsearch.randomizedtesting.rules.NoShadowingOrOverridesOnMethodsRule$1.evaluate(NoShadowingOrOverridesOnMethodsRule.java:40)
	at com.carrotsearch.randomizedtesting.rules.StatementAdapter.evaluate(StatementAdapter.java:36)
	at com.carrotsearch.randomizedtesting.rules.StatementAdapter.evaluate(StatementAdapter.java:36)
	at org.apache.lucene.util.TestRuleAssertionsRequired$1.evaluate(TestRuleAssertionsRequired.java:53)
	at org.apache.lucene.util.AbstractBeforeAfterRule$1.evaluate(AbstractBeforeAfterRule.java:43)
	at org.apache.lucene.util.TestRuleMarkFailure$1.evaluate(TestRuleMarkFailure.java:44)
	at org.apache.lucene.util.TestRuleIgnoreAfterMaxFailures$1.evaluate(TestRuleIgnoreAfterMaxFailures.java:60)
	at org.apache.lucene.util.TestRuleIgnoreTestSuites$1.evaluate(TestRuleIgnoreTestSuites.java:47)
	at org.junit.rules.RunRules.evaluate(RunRules.java:20)
	at com.carrotsearch.randomizedtesting.rules.StatementAdapter.evaluate(StatementAdapter.java:36)
	at com.carrotsearch.randomizedtesting.ThreadLeakControl$StatementRunner.run(ThreadLeakControl.java:370)
	at com.carrotsearch.randomizedtesting.ThreadLeakControl.lambda$forkTimeoutingTask$0(ThreadLeakControl.java:826)
	at java.base/java.lang.Thread.run(Thread.java:834)


FAILED:  org.apache.solr.cloud.SaslZkACLProviderTest.testSaslZkACLProvider

Error Message:
org.apache.zookeeper.KeeperException$AuthFailedException: KeeperErrorCode = AuthFailed for /solr

Stack Trace:
org.apache.zookeeper.KeeperException$AuthFailedException: KeeperErrorCode = AuthFailed for /solr
	at __randomizedtesting.SeedInfo.seed([9610848E61351D66:92E4D256F871BE68]:0)
	at org.apache.zookeeper.KeeperException.create(KeeperException.java:130)
	at org.apache.zookeeper.KeeperException.create(KeeperException.java:54)
	at org.apache.zookeeper.ZooKeeper.create(ZooKeeper.java:1734)
	at org.apache.solr.common.cloud.SolrZkClient.lambda$makePath$10(SolrZkClient.java:542)
	at org.apache.solr.common.cloud.ZkCmdExecutor.retryOperation(ZkCmdExecutor.java:79)
	at org.apache.solr.common.cloud.SolrZkClient.makePath(SolrZkClient.java:541)
	at org.apache.solr.common.cloud.SolrZkClient.makePath(SolrZkClient.java:433)
	at org.apache.solr.cloud.SaslZkACLProviderTest.setUp(SaslZkACLProviderTest.java:88)
	at jdk.internal.reflect.GeneratedMethodAccessor8.invoke(Unknown Source)
	at java.base/jdk.internal.reflect.DelegatingMethodAccessorImpl.invoke(DelegatingMethodAccessorImpl.java:43)
	at java.base/java.lang.reflect.Method.invoke(Method.java:566)
	at com.carrotsearch.randomizedtesting.RandomizedRunner.invoke(RandomizedRunner.java:1754)
	at com.carrotsearch.randomizedtesting.RandomizedRunner$9.evaluate(RandomizedRunner.java:976)
	at com.carrotsearch.randomizedtesting.RandomizedRunner$10.evaluate(RandomizedRunner.java:992)
	at com.carrotsearch.randomizedtesting.rules.SystemPropertiesRestoreRule$1.evaluate(SystemPropertiesRestoreRule.java:57)
	at org.junit.rules.RunRules.evaluate(RunRules.java:20)
	at org.apache.lucene.util.TestRuleSetupTeardownChained$1.evaluate(TestRuleSetupTeardownChained.java:44)
	at org.apache.lucene.util.AbstractBeforeAfterRule$1.evaluate(AbstractBeforeAfterRule.java:43)
	at org.apache.lucene.util.TestRuleThreadAndTestName$1.evaluate(TestRuleThreadAndTestName.java:45)
	at org.apache.lucene.util.TestRuleIgnoreAfterMaxFailures$1.evaluate(TestRuleIgnoreAfterMaxFailures.java:60)
	at org.apache.lucene.util.TestRuleMarkFailure$1.evaluate(TestRuleMarkFailure.java:44)
	at org.junit.rules.RunRules.evaluate(RunRules.java:20)
	at com.carrotsearch.randomizedtesting.rules.StatementAdapter.evaluate(StatementAdapter.java:36)
	at com.carrotsearch.randomizedtesting.ThreadLeakControl$StatementRunner.run(ThreadLeakControl.java:370)
	at com.carrotsearch.randomizedtesting.ThreadLeakControl.forkTimeoutingTask(ThreadLeakControl.java:819)
	at com.carrotsearch.randomizedtesting.ThreadLeakControl$3.evaluate(ThreadLeakControl.java:470)
	at com.carrotsearch.randomizedtesting.RandomizedRunner.runSingleTest(RandomizedRunner.java:951)
	at com.carrotsearch.randomizedtesting.RandomizedRunner$5.evaluate(RandomizedRunner.java:836)
	at com.carrotsearch.randomizedtesting.RandomizedRunner$6.evaluate(RandomizedRunner.java:887)
	at com.carrotsearch.randomizedtesting.RandomizedRunner$7.evaluate(RandomizedRunner.java:898)
	at com.carrotsearch.randomizedtesting.rules.StatementAdapter.evaluate(StatementAdapter.java:36)
	at org.apache.lucene.util.AbstractBeforeAfterRule$1.evaluate(AbstractBeforeAfterRule.java:43)
	at org.apache.lucene.util.AbstractBeforeAfterRule$1.evaluate(AbstractBeforeAfterRule.java:43)
	at com.carrotsearch.randomizedtesting.rules.SystemPropertiesRestoreRule$1.evaluate(SystemPropertiesRestoreRule.java:57)
	at org.junit.rules.RunRules.evaluate(RunRules.java:20)
	at org.apache.lucene.util.AbstractBeforeAfterRule$1.evaluate(AbstractBeforeAfterRule.java:43)
	at com.carrotsearch.randomizedtesting.rules.StatementAdapter.evaluate(StatementAdapter.java:36)
	at org.apache.lucene.util.TestRuleStoreClassName$1.evaluate(TestRuleStoreClassName.java:38)
	at com.carrotsearch.randomizedtesting.rules.NoShadowingOrOverridesOnMethodsRule$1.evaluate(NoShadowingOrOverridesOnMethodsRule.java:40)
	at com.carrotsearch.randomizedtesting.rules.NoShadowingOrOverridesOnMethodsRule$1.evaluate(NoShadowingOrOverridesOnMethodsRule.java:40)
	at com.carrotsearch.randomizedtesting.rules.StatementAdapter.evaluate(StatementAdapter.java:36)
	at com.carrotsearch.randomizedtesting.rules.StatementAdapter.evaluate(StatementAdapter.java:36)
	at org.apache.lucene.util.TestRuleAssertionsRequired$1.evaluate(TestRuleAssertionsRequired.java:53)
	at org.apache.lucene.util.AbstractBeforeAfterRule$1.evaluate(AbstractBeforeAfterRule.java:43)
	at org.apache.lucene.util.TestRuleMarkFailure$1.evaluate(TestRuleMarkFailure.java:44)
	at org.apache.lucene.util.TestRuleIgnoreAfterMaxFailures$1.evaluate(TestRuleIgnoreAfterMaxFailures.java:60)
	at org.apache.lucene.util.TestRuleIgnoreTestSuites$1.evaluate(TestRuleIgnoreTestSuites.java:47)
	at org.junit.rules.RunRules.evaluate(RunRules.java:20)
	at com.carrotsearch.randomizedtesting.rules.StatementAdapter.evaluate(StatementAdapter.java:36)
	at com.carrotsearch.randomizedtesting.ThreadLeakControl$StatementRunner.run(ThreadLeakControl.java:370)
	at com.carrotsearch.randomizedtesting.ThreadLeakControl.lambda$forkTimeoutingTask$0(ThreadLeakControl.java:826)
	at java.base/java.lang.Thread.run(Thread.java:834)


FAILED:  org.apache.solr.client.solrj.io.stream.StreamDecoratorTest.testParallelPriorityStream

Error Message:
java.lang.AssertionError: expected:<7> but was:<4>

Stack Trace:
java.lang.AssertionError: expected:<7> but was:<4>
	at __randomizedtesting.SeedInfo.seed([9610848E61351D66:A66B355D5E7563C1]:0)
	at org.junit.Assert.fail(Assert.java:89)
	at org.junit.Assert.failNotEquals(Assert.java:835)
	at org.junit.Assert.assertEquals(Assert.java:647)
	at org.junit.Assert.assertEquals(Assert.java:633)
	at org.apache.solr.client.solrj.io.stream.StreamDecoratorTest.testParallelPriorityStream(StreamDecoratorTest.java:2648)
	at java.base/jdk.internal.reflect.NativeMethodAccessorImpl.invoke0(Native Method)
	at java.base/jdk.internal.reflect.NativeMethodAccessorImpl.invoke(NativeMethodAccessorImpl.java:62)
	at java.base/jdk.internal.reflect.DelegatingMethodAccessorImpl.invoke(DelegatingMethodAccessorImpl.java:43)
	at java.base/java.lang.reflect.Method.invoke(Method.java:566)
	at com.carrotsearch.randomizedtesting.RandomizedRunner.invoke(RandomizedRunner.java:1754)
	at com.carrotsearch.randomizedtesting.RandomizedRunner$8.evaluate(RandomizedRunner.java:942)
	at com.carrotsearch.randomizedtesting.RandomizedRunner$9.evaluate(RandomizedRunner.java:978)
	at com.carrotsearch.randomizedtesting.RandomizedRunner$10.evaluate(RandomizedRunner.java:992)
	at com.carrotsearch.randomizedtesting.rules.SystemPropertiesRestoreRule$1.evaluate(SystemPropertiesRestoreRule.java:57)
	at org.junit.rules.RunRules.evaluate(RunRules.java:20)
	at org.apache.lucene.util.TestRuleSetupTeardownChained$1.evaluate(TestRuleSetupTeardownChained.java:44)
	at org.apache.lucene.util.AbstractBeforeAfterRule$1.evaluate(AbstractBeforeAfterRule.java:43)
	at org.apache.lucene.util.TestRuleThreadAndTestName$1.evaluate(TestRuleThreadAndTestName.java:45)
	at org.apache.lucene.util.TestRuleIgnoreAfterMaxFailures$1.evaluate(TestRuleIgnoreAfterMaxFailures.java:60)
	at org.apache.lucene.util.TestRuleMarkFailure$1.evaluate(TestRuleMarkFailure.java:44)
	at org.junit.rules.RunRules.evaluate(RunRules.java:20)
	at com.carrotsearch.randomizedtesting.rules.StatementAdapter.evaluate(StatementAdapter.java:36)
	at com.carrotsearch.randomizedtesting.ThreadLeakControl$StatementRunner.run(ThreadLeakControl.java:370)
	at com.carrotsearch.randomizedtesting.ThreadLeakControl.forkTimeoutingTask(ThreadLeakControl.java:819)
	at com.carrotsearch.randomizedtesting.ThreadLeakControl$3.evaluate(ThreadLeakControl.java:470)
	at com.carrotsearch.randomizedtesting.RandomizedRunner.runSingleTest(RandomizedRunner.java:951)
	at com.carrotsearch.randomizedtesting.RandomizedRunner$5.evaluate(RandomizedRunner.java:836)
	at com.carrotsearch.randomizedtesting.RandomizedRunner$6.evaluate(RandomizedRunner.java:887)
	at com.carrotsearch.randomizedtesting.RandomizedRunner$7.evaluate(RandomizedRunner.java:898)
	at com.carrotsearch.randomizedtesting.rules.StatementAdapter.evaluate(StatementAdapter.java:36)
	at org.apache.lucene.util.AbstractBeforeAfterRule$1.evaluate(AbstractBeforeAfterRule.java:43)
	at org.apache.lucene.util.AbstractBeforeAfterRule$1.evaluate(AbstractBeforeAfterRule.java:43)
	at com.carrotsearch.randomizedtesting.rules.SystemPropertiesRestoreRule$1.evaluate(SystemPropertiesRestoreRule.java:57)
	at org.junit.rules.RunRules.evaluate(RunRules.java:20)
	at org.apache.lucene.util.AbstractBeforeAfterRule$1.evaluate(AbstractBeforeAfterRule.java:43)
	at com.carrotsearch.randomizedtesting.rules.StatementAdapter.evaluate(StatementAdapter.java:36)
	at org.apache.lucene.util.TestRuleStoreClassName$1.evaluate(TestRuleStoreClassName.java:38)
	at com.carrotsearch.randomizedtesting.rules.NoShadowingOrOverridesOnMethodsRule$1.evaluate(NoShadowingOrOverridesOnMethodsRule.java:40)
	at com.carrotsearch.randomizedtesting.rules.NoShadowingOrOverridesOnMethodsRule$1.evaluate(NoShadowingOrOverridesOnMethodsRule.java:40)
	at com.carrotsearch.randomizedtesting.rules.StatementAdapter.evaluate(StatementAdapter.java:36)
	at com.carrotsearch.randomizedtesting.rules.StatementAdapter.evaluate(StatementAdapter.java:36)
	at org.apache.lucene.util.TestRuleAssertionsRequired$1.evaluate(TestRuleAssertionsRequired.java:53)
	at org.apache.lucene.util.AbstractBeforeAfterRule$1.evaluate(AbstractBeforeAfterRule.java:43)
	at org.apache.lucene.util.TestRuleMarkFailure$1.evaluate(TestRuleMarkFailure.java:44)
	at org.apache.lucene.util.TestRuleIgnoreAfterMaxFailures$1.evaluate(TestRuleIgnoreAfterMaxFailures.java:60)
	at org.apache.lucene.util.TestRuleIgnoreTestSuites$1.evaluate(TestRuleIgnoreTestSuites.java:47)
	at org.junit.rules.RunRules.evaluate(RunRules.java:20)
	at com.carrotsearch.randomizedtesting.rules.StatementAdapter.evaluate(StatementAdapter.java:36)
	at com.carrotsearch.randomizedtesting.ThreadLeakControl$StatementRunner.run(ThreadLeakControl.java:370)
	at com.carrotsearch.randomizedtesting.ThreadLeakControl.lambda$forkTimeoutingTask$0(ThreadLeakControl.java:826)
	at java.base/java.lang.Thread.run(Thread.java:834)




Build Log:
[...truncated 9639 lines...]
ERROR: The following test(s) have failed:
  - org.apache.solr.client.solrj.io.stream.StreamDecoratorTest.testParallelPriorityStream (:solr:solrj)
    Test output: /home/jenkins/jenkins-slave/workspace/Solr/Solr-Check-main/solr/solrj/build/test-results/test/outputs/OUTPUT-org.apache.solr.client.solrj.io.stream.StreamDecoratorTest.txt
    Reproduce with: gradlew :solr:solrj:test --tests "org.apache.solr.client.solrj.io.stream.StreamDecoratorTest.testParallelPriorityStream" -Ptests.jvms=4 -Ptests.haltonfailure=false -Ptests.jvmargs=-XX:TieredStopAtLevel=1 -Ptests.seed=9610848E61351D66 -Ptests.multiplier=2 -Ptests.badapples=false -Ptests.file.encoding=US-ASCII

  - org.apache.solr.cloud.SaslZkACLProviderTest.testSaslZkACLProvider (:solr:core)
    Test output: /home/jenkins/jenkins-slave/workspace/Solr/Solr-Check-main/solr/core/build/test-results/test/outputs/OUTPUT-org.apache.solr.cloud.SaslZkACLProviderTest.txt
    Reproduce with: gradlew :solr:core:test --tests "org.apache.solr.cloud.SaslZkACLProviderTest.testSaslZkACLProvider" -Ptests.jvms=4 -Ptests.haltonfailure=false -Ptests.jvmargs=-XX:TieredStopAtLevel=1 -Ptests.seed=9610848E61351D66 -Ptests.multiplier=2 -Ptests.badapples=false -Ptests.file.encoding=US-ASCII

  - org.apache.solr.cloud.DocValuesNotIndexedTest.testGroupingDVOnlySortLast (:solr:core)
    Test output: /home/jenkins/jenkins-slave/workspace/Solr/Solr-Check-main/solr/core/build/test-results/test/outputs/OUTPUT-org.apache.solr.cloud.DocValuesNotIndexedTest.txt
    Reproduce with: gradlew :solr:core:test --tests "org.apache.solr.cloud.DocValuesNotIndexedTest.testGroupingDVOnlySortLast" -Ptests.jvms=4 -Ptests.haltonfailure=false -Ptests.jvmargs=-XX:TieredStopAtLevel=1 -Ptests.seed=9610848E61351D66 -Ptests.multiplier=2 -Ptests.badapples=false -Ptests.file.encoding=US-ASCII


Deprecated Gradle features were used in this build, making it incompatible with Gradle 7.0.
Use '--warning-mode all' to show the individual deprecation warnings.
See https://docs.gradle.org/6.6.1/userguide/command_line_interface.html#sec:command_line_warnings

BUILD SUCCESSFUL in 51m 16s
296 actionable tasks: 296 executed
Build step 'Invoke Gradle script' changed build result to SUCCESS
Archiving artifacts
java.lang.InterruptedException: no matches found within 10000
	at hudson.FilePath$ValidateAntFileMask.hasMatch(FilePath.java:3066)
	at hudson.FilePath$ValidateAntFileMask.invoke(FilePath.java:2945)
	at hudson.FilePath$ValidateAntFileMask.invoke(FilePath.java:2926)
	at hudson.FilePath$FileCallableWrapper.call(FilePath.java:3313)
Also:   hudson.remoting.Channel$CallSiteStackTrace: Remote call to lucene1
		at hudson.remoting.Channel.attachCallSiteStackTrace(Channel.java:1800)
		at hudson.remoting.UserRequest$ExceptionResponse.retrieve(UserRequest.java:357)
		at hudson.remoting.Channel.call(Channel.java:1001)
		at hudson.FilePath.act(FilePath.java:1157)
		at hudson.FilePath.act(FilePath.java:1146)
		at hudson.FilePath.validateAntFileMask(FilePath.java:2924)
		at hudson.tasks.ArtifactArchiver.perform(ArtifactArchiver.java:270)
		at hudson.tasks.BuildStepCompatibilityLayer.perform(BuildStepCompatibilityLayer.java:80)
		at hudson.tasks.BuildStepMonitor$1.perform(BuildStepMonitor.java:20)
		at hudson.model.AbstractBuild$AbstractBuildExecution.perform(AbstractBuild.java:804)
		at hudson.model.AbstractBuild$AbstractBuildExecution.performAllBuildSteps(AbstractBuild.java:753)
		at hudson.model.Build$BuildExecution.post2(Build.java:177)
		at hudson.model.AbstractBuild$AbstractBuildExecution.post(AbstractBuild.java:698)
		at hudson.model.Run.execute(Run.java:1932)
		at hudson.model.FreeStyleBuild.run(FreeStyleBuild.java:43)
		at hudson.model.ResourceController.execute(ResourceController.java:97)
		at hudson.model.Executor.run(Executor.java:429)
Caused: hudson.FilePath$TunneledInterruptedException
	at hudson.FilePath$FileCallableWrapper.call(FilePath.java:3315)
	at hudson.remoting.UserRequest.perform(UserRequest.java:211)
	at hudson.remoting.UserRequest.perform(UserRequest.java:54)
	at hudson.remoting.Request$2.run(Request.java:375)
	at hudson.remoting.InterceptingExecutorService$1.call(InterceptingExecutorService.java:73)
	at java.util.concurrent.FutureTask.run(FutureTask.java:266)
	at java.util.concurrent.ThreadPoolExecutor.runWorker(ThreadPoolExecutor.java:1149)
	at java.util.concurrent.ThreadPoolExecutor$Worker.run(ThreadPoolExecutor.java:624)
	at java.lang.Thread.run(Thread.java:748)
Caused: java.lang.InterruptedException: java.lang.InterruptedException: no matches found within 10000
	at hudson.FilePath.act(FilePath.java:1159)
	at hudson.FilePath.act(FilePath.java:1146)
	at hudson.FilePath.validateAntFileMask(FilePath.java:2924)
	at hudson.tasks.ArtifactArchiver.perform(ArtifactArchiver.java:270)
	at hudson.tasks.BuildStepCompatibilityLayer.perform(BuildStepCompatibilityLayer.java:80)
	at hudson.tasks.BuildStepMonitor$1.perform(BuildStepMonitor.java:20)
	at hudson.model.AbstractBuild$AbstractBuildExecution.perform(AbstractBuild.java:804)
	at hudson.model.AbstractBuild$AbstractBuildExecution.performAllBuildSteps(AbstractBuild.java:753)
	at hudson.model.Build$BuildExecution.post2(Build.java:177)
	at hudson.model.AbstractBuild$AbstractBuildExecution.post(AbstractBuild.java:698)
	at hudson.model.Run.execute(Run.java:1932)
	at hudson.model.FreeStyleBuild.run(FreeStyleBuild.java:43)
	at hudson.model.ResourceController.execute(ResourceController.java:97)
	at hudson.model.Executor.run(Executor.java:429)
No artifacts found that match the file pattern "**/*.events,heapdumps/**,**/hs_err_pid*". Configuration error?
Recording test results
[Checks API] No suitable checks publisher found.
Build step 'Publish JUnit test result report' changed build result to UNSTABLE
Email was triggered for: Unstable (Test Failures)
Sending email for trigger: Unstable (Test Failures)