You are viewing a plain text version of this content. The canonical link for it is here.
Posted to dev@zookeeper.apache.org by Apache Jenkins Server <je...@builds.apache.org> on 2014/12/11 12:36:32 UTC

ZooKeeper_branch35_jdk7 - Build # 138 - Still Failing

See https://builds.apache.org/job/ZooKeeper_branch35_jdk7/138/

###################################################################################
########################## LAST 60 LINES OF THE CONSOLE ###########################
[...truncated 288117 lines...]
    [junit] 2014-12-11 11:34:20,903 [myid:] - INFO  [main:NIOServerCnxnFactory@670] - Configuring NIO connection handler with 10s sessionless connection timeout, 2 selector thread(s), 32 worker threads, and 64 kB direct buffers.
    [junit] 2014-12-11 11:34:20,903 [myid:] - INFO  [main:NIOServerCnxnFactory@683] - binding to port 0.0.0.0/0.0.0.0:11221
    [junit] 2014-12-11 11:34:20,904 [myid:] - INFO  [main:ClientBase@339] - STARTING server instance 127.0.0.1:11221
    [junit] 2014-12-11 11:34:20,904 [myid:] - INFO  [main:ZooKeeperServer@781] - minSessionTimeout set to 6000
    [junit] 2014-12-11 11:34:20,904 [myid:] - INFO  [main:ZooKeeperServer@790] - maxSessionTimeout set to 60000
    [junit] 2014-12-11 11:34:20,904 [myid:] - INFO  [main:ZooKeeperServer@152] - Created server with tickTime 3000 minSessionTimeout 6000 maxSessionTimeout 60000 datadir /home/jenkins/jenkins-slave/workspace/ZooKeeper_branch35_jdk7/branch-3.5/build/test/tmp/test6048036596797842052.junit.dir/version-2 snapdir /home/jenkins/jenkins-slave/workspace/ZooKeeper_branch35_jdk7/branch-3.5/build/test/tmp/test6048036596797842052.junit.dir/version-2
    [junit] 2014-12-11 11:34:20,905 [myid:] - INFO  [main:FileSnap@83] - Reading snapshot /home/jenkins/jenkins-slave/workspace/ZooKeeper_branch35_jdk7/branch-3.5/build/test/tmp/test6048036596797842052.junit.dir/version-2/snapshot.b
    [junit] 2014-12-11 11:34:20,907 [myid:] - INFO  [main:FileTxnSnapLog@298] - Snapshotting: 0xb to /home/jenkins/jenkins-slave/workspace/ZooKeeper_branch35_jdk7/branch-3.5/build/test/tmp/test6048036596797842052.junit.dir/version-2/snapshot.b
    [junit] 2014-12-11 11:34:20,908 [myid:] - INFO  [main:FourLetterWordMain@43] - connecting to 127.0.0.1 11221
    [junit] 2014-12-11 11:34:20,909 [myid:] - INFO  [NIOServerCxnFactory.AcceptThread:0.0.0.0/0.0.0.0:11221:NIOServerCnxnFactory$AcceptThread@296] - Accepted socket connection from /127.0.0.1:34676
    [junit] 2014-12-11 11:34:20,909 [myid:] - INFO  [NIOWorkerThread-1:NIOServerCnxn@835] - Processing stat command from /127.0.0.1:34676
    [junit] 2014-12-11 11:34:20,910 [myid:] - INFO  [NIOWorkerThread-1:NIOServerCnxn$StatCommand@684] - Stat command output
    [junit] 2014-12-11 11:34:20,910 [myid:] - INFO  [NIOWorkerThread-1:NIOServerCnxn@1006] - Closed socket connection for client /127.0.0.1:34676 (no session established for client)
    [junit] 2014-12-11 11:34:20,910 [myid:] - INFO  [main:JMXEnv@224] - ensureParent:[InMemoryDataTree, StandaloneServer_port]
    [junit] 2014-12-11 11:34:20,912 [myid:] - INFO  [main:JMXEnv@241] - expect:InMemoryDataTree
    [junit] 2014-12-11 11:34:20,912 [myid:] - INFO  [main:JMXEnv@245] - found:InMemoryDataTree org.apache.ZooKeeperService:name0=StandaloneServer_port11221,name1=InMemoryDataTree
    [junit] 2014-12-11 11:34:20,913 [myid:] - INFO  [main:JMXEnv@241] - expect:StandaloneServer_port
    [junit] 2014-12-11 11:34:20,913 [myid:] - INFO  [main:JMXEnv@245] - found:StandaloneServer_port org.apache.ZooKeeperService:name0=StandaloneServer_port11221
    [junit] 2014-12-11 11:34:20,913 [myid:] - INFO  [main:JUnit4ZKTestRunner$LoggedInvokeMethod@55] - Memory used 18089
    [junit] 2014-12-11 11:34:20,913 [myid:] - INFO  [main:JUnit4ZKTestRunner$LoggedInvokeMethod@60] - Number of threads 24
    [junit] 2014-12-11 11:34:20,913 [myid:] - INFO  [main:JUnit4ZKTestRunner$LoggedInvokeMethod@65] - FINISHED TEST METHOD testQuota
    [junit] 2014-12-11 11:34:20,914 [myid:] - INFO  [main:ClientBase@520] - tearDown starting
    [junit] 2014-12-11 11:34:20,983 [myid:] - INFO  [main:ZooKeeper@968] - Session: 0x14a3920d5300000 closed
    [junit] 2014-12-11 11:34:20,983 [myid:] - INFO  [main-EventThread:ClientCnxn$EventThread@529] - EventThread shut down
    [junit] 2014-12-11 11:34:20,983 [myid:] - INFO  [main:ClientBase@490] - STOPPING server
    [junit] 2014-12-11 11:34:20,984 [myid:] - INFO  [ConnnectionExpirer:NIOServerCnxnFactory$ConnectionExpirerThread@583] - ConnnectionExpirerThread interrupted
    [junit] 2014-12-11 11:34:20,984 [myid:] - INFO  [NIOServerCxnFactory.AcceptThread:0.0.0.0/0.0.0.0:11221:NIOServerCnxnFactory$AcceptThread@219] - accept thread exitted run method
    [junit] 2014-12-11 11:34:20,984 [myid:] - INFO  [NIOServerCxnFactory.SelectorThread-1:NIOServerCnxnFactory$SelectorThread@420] - selector thread exitted run method
    [junit] 2014-12-11 11:34:20,984 [myid:] - INFO  [NIOServerCxnFactory.SelectorThread-0:NIOServerCnxnFactory$SelectorThread@420] - selector thread exitted run method
    [junit] 2014-12-11 11:34:20,984 [myid:] - INFO  [main:ZooKeeperServer@443] - shutting down
    [junit] 2014-12-11 11:34:20,985 [myid:] - INFO  [main:SessionTrackerImpl@231] - Shutting down
    [junit] 2014-12-11 11:34:20,985 [myid:] - INFO  [main:PrepRequestProcessor@971] - Shutting down
    [junit] 2014-12-11 11:34:20,985 [myid:] - INFO  [main:SyncRequestProcessor@191] - Shutting down
    [junit] 2014-12-11 11:34:20,985 [myid:] - INFO  [ProcessThread(sid:0 cport:11221)::PrepRequestProcessor@155] - PrepRequestProcessor exited loop!
    [junit] 2014-12-11 11:34:20,985 [myid:] - INFO  [SyncThread:0:SyncRequestProcessor@169] - SyncRequestProcessor exited!
    [junit] 2014-12-11 11:34:20,986 [myid:] - INFO  [main:FinalRequestProcessor@476] - shutdown of request processor complete
    [junit] 2014-12-11 11:34:20,986 [myid:] - INFO  [main:MBeanRegistry@119] - Unregister MBean [org.apache.ZooKeeperService:name0=StandaloneServer_port11221,name1=InMemoryDataTree]
    [junit] 2014-12-11 11:34:20,986 [myid:] - INFO  [main:MBeanRegistry@119] - Unregister MBean [org.apache.ZooKeeperService:name0=StandaloneServer_port11221]
    [junit] 2014-12-11 11:34:20,987 [myid:] - INFO  [main:FourLetterWordMain@43] - connecting to 127.0.0.1 11221
    [junit] 2014-12-11 11:34:20,987 [myid:] - INFO  [main:JMXEnv@142] - ensureOnly:[]
    [junit] 2014-12-11 11:34:20,995 [myid:] - INFO  [main:ClientBase@545] - fdcount after test is: 47 at start it was 33
    [junit] 2014-12-11 11:34:20,995 [myid:] - INFO  [main:ClientBase@547] - sleeping for 20 secs
    [junit] 2014-12-11 11:34:20,997 [myid:] - INFO  [main:ZKTestCase$1@65] - SUCCEEDED testQuota
    [junit] 2014-12-11 11:34:20,997 [myid:] - INFO  [main:ZKTestCase$1@60] - FINISHED testQuota
    [junit] Tests run: 1, Failures: 0, Errors: 0, Skipped: 0, Time elapsed: 0.555 sec
    [junit] 2014-12-11 11:34:21,000 [myid:] - INFO  [SessionTracker:SessionTrackerImpl@157] - SessionTrackerImpl exited loop!
    [junit] 2014-12-11 11:34:21,000 [myid:] - INFO  [SessionTracker:SessionTrackerImpl@157] - SessionTrackerImpl exited loop!
    [junit] 2014-12-11 11:34:21,000 [myid:] - INFO  [SessionTracker:SessionTrackerImpl@157] - SessionTrackerImpl exited loop!

BUILD FAILED
/home/jenkins/jenkins-slave/workspace/ZooKeeper_branch35_jdk7/branch-3.5/build.xml:1422: The following error occurred while executing this line:
/home/jenkins/jenkins-slave/workspace/ZooKeeper_branch35_jdk7/branch-3.5/build.xml:1333: Tests failed!

Total time: 36 minutes 48 seconds
Build step 'Invoke Ant' marked build as failure
Archiving artifacts
Recording test results
Email was triggered for: Failure
Sending email for trigger: Failure



###################################################################################
############################## FAILED TESTS (if any) ##############################
1 tests failed.
REGRESSION:  org.apache.zookeeper.test.ClientPortBindTest.testBindByAddress

Error Message:
No such device

Stack Trace:
java.net.SocketException: No such device
	at java.net.NetworkInterface.isLoopback0(Native Method)
	at java.net.NetworkInterface.isLoopback(NetworkInterface.java:390)
	at org.apache.zookeeper.test.ClientPortBindTest.testBindByAddress(ClientPortBindTest.java:61)
	at org.apache.zookeeper.JUnit4ZKTestRunner$LoggedInvokeMethod.evaluate(JUnit4ZKTestRunner.java:52)



ZooKeeper_branch35_jdk7 - Build # 140 - Still Failing

Posted by Apache Jenkins Server <je...@builds.apache.org>.
See https://builds.apache.org/job/ZooKeeper_branch35_jdk7/140/

###################################################################################
########################## LAST 60 LINES OF THE CONSOLE ###########################
[...truncated 329072 lines...]
    [junit] 2014-12-13 11:42:08,796 [myid:] - INFO  [main:JMXEnv@142] - ensureOnly:[]
    [junit] 2014-12-13 11:42:08,797 [myid:] - INFO  [main:ClientBase@443] - STARTING server
    [junit] 2014-12-13 11:42:08,797 [myid:] - INFO  [main:ClientBase@364] - CREATING server instance 127.0.0.1:11221
    [junit] 2014-12-13 11:42:08,798 [myid:] - INFO  [main:NIOServerCnxnFactory@670] - Configuring NIO connection handler with 10s sessionless connection timeout, 2 selector thread(s), 32 worker threads, and 64 kB direct buffers.
    [junit] 2014-12-13 11:42:08,798 [myid:] - INFO  [main:NIOServerCnxnFactory@683] - binding to port 0.0.0.0/0.0.0.0:11221
    [junit] 2014-12-13 11:42:08,799 [myid:] - INFO  [main:ClientBase@339] - STARTING server instance 127.0.0.1:11221
    [junit] 2014-12-13 11:42:08,799 [myid:] - INFO  [main:ZooKeeperServer@781] - minSessionTimeout set to 6000
    [junit] 2014-12-13 11:42:08,799 [myid:] - INFO  [main:ZooKeeperServer@790] - maxSessionTimeout set to 60000
    [junit] 2014-12-13 11:42:08,799 [myid:] - INFO  [main:ZooKeeperServer@152] - Created server with tickTime 3000 minSessionTimeout 6000 maxSessionTimeout 60000 datadir /home/jenkins/jenkins-slave/workspace/ZooKeeper_branch35_jdk7/branch-3.5/build/test/tmp/test7475486851963268005.junit.dir/version-2 snapdir /home/jenkins/jenkins-slave/workspace/ZooKeeper_branch35_jdk7/branch-3.5/build/test/tmp/test7475486851963268005.junit.dir/version-2
    [junit] 2014-12-13 11:42:08,801 [myid:] - INFO  [main:FileSnap@83] - Reading snapshot /home/jenkins/jenkins-slave/workspace/ZooKeeper_branch35_jdk7/branch-3.5/build/test/tmp/test7475486851963268005.junit.dir/version-2/snapshot.b
    [junit] 2014-12-13 11:42:08,804 [myid:] - INFO  [main:FileTxnSnapLog@298] - Snapshotting: 0xb to /home/jenkins/jenkins-slave/workspace/ZooKeeper_branch35_jdk7/branch-3.5/build/test/tmp/test7475486851963268005.junit.dir/version-2/snapshot.b
    [junit] 2014-12-13 11:42:08,806 [myid:] - INFO  [main:FourLetterWordMain@43] - connecting to 127.0.0.1 11221
    [junit] 2014-12-13 11:42:08,807 [myid:] - INFO  [NIOServerCxnFactory.AcceptThread:0.0.0.0/0.0.0.0:11221:NIOServerCnxnFactory$AcceptThread@296] - Accepted socket connection from /127.0.0.1:39596
    [junit] 2014-12-13 11:42:08,808 [myid:] - INFO  [NIOWorkerThread-1:NIOServerCnxn@835] - Processing stat command from /127.0.0.1:39596
    [junit] 2014-12-13 11:42:08,808 [myid:] - INFO  [NIOWorkerThread-1:NIOServerCnxn$StatCommand@684] - Stat command output
    [junit] 2014-12-13 11:42:08,808 [myid:] - INFO  [NIOWorkerThread-1:NIOServerCnxn@1006] - Closed socket connection for client /127.0.0.1:39596 (no session established for client)
    [junit] 2014-12-13 11:42:08,808 [myid:] - INFO  [main:JMXEnv@224] - ensureParent:[InMemoryDataTree, StandaloneServer_port]
    [junit] 2014-12-13 11:42:08,811 [myid:] - INFO  [main:JMXEnv@241] - expect:InMemoryDataTree
    [junit] 2014-12-13 11:42:08,811 [myid:] - INFO  [main:JMXEnv@245] - found:InMemoryDataTree org.apache.ZooKeeperService:name0=StandaloneServer_port11221,name1=InMemoryDataTree
    [junit] 2014-12-13 11:42:08,811 [myid:] - INFO  [main:JMXEnv@241] - expect:StandaloneServer_port
    [junit] 2014-12-13 11:42:08,811 [myid:] - INFO  [main:JMXEnv@245] - found:StandaloneServer_port org.apache.ZooKeeperService:name0=StandaloneServer_port11221
    [junit] 2014-12-13 11:42:08,811 [myid:] - INFO  [main:JUnit4ZKTestRunner$LoggedInvokeMethod@55] - Memory used 18089
    [junit] 2014-12-13 11:42:08,811 [myid:] - INFO  [main:JUnit4ZKTestRunner$LoggedInvokeMethod@60] - Number of threads 24
    [junit] 2014-12-13 11:42:08,812 [myid:] - INFO  [main:JUnit4ZKTestRunner$LoggedInvokeMethod@65] - FINISHED TEST METHOD testQuota
    [junit] 2014-12-13 11:42:08,812 [myid:] - INFO  [main:ClientBase@520] - tearDown starting
    [junit] 2014-12-13 11:42:08,872 [myid:] - INFO  [main:ZooKeeper@968] - Session: 0x14a4374b0dc0000 closed
    [junit] 2014-12-13 11:42:08,872 [myid:] - INFO  [main:ClientBase@490] - STOPPING server
    [junit] 2014-12-13 11:42:08,872 [myid:] - INFO  [main-EventThread:ClientCnxn$EventThread@529] - EventThread shut down
    [junit] 2014-12-13 11:42:08,873 [myid:] - INFO  [NIOServerCxnFactory.AcceptThread:0.0.0.0/0.0.0.0:11221:NIOServerCnxnFactory$AcceptThread@219] - accept thread exitted run method
    [junit] 2014-12-13 11:42:08,873 [myid:] - INFO  [ConnnectionExpirer:NIOServerCnxnFactory$ConnectionExpirerThread@583] - ConnnectionExpirerThread interrupted
    [junit] 2014-12-13 11:42:08,873 [myid:] - INFO  [NIOServerCxnFactory.SelectorThread-1:NIOServerCnxnFactory$SelectorThread@420] - selector thread exitted run method
    [junit] 2014-12-13 11:42:08,873 [myid:] - INFO  [NIOServerCxnFactory.SelectorThread-0:NIOServerCnxnFactory$SelectorThread@420] - selector thread exitted run method
    [junit] 2014-12-13 11:42:08,874 [myid:] - INFO  [main:ZooKeeperServer@443] - shutting down
    [junit] 2014-12-13 11:42:08,874 [myid:] - INFO  [main:SessionTrackerImpl@231] - Shutting down
    [junit] 2014-12-13 11:42:08,874 [myid:] - INFO  [main:PrepRequestProcessor@971] - Shutting down
    [junit] 2014-12-13 11:42:08,874 [myid:] - INFO  [main:SyncRequestProcessor@191] - Shutting down
    [junit] 2014-12-13 11:42:08,874 [myid:] - INFO  [ProcessThread(sid:0 cport:11221)::PrepRequestProcessor@155] - PrepRequestProcessor exited loop!
    [junit] 2014-12-13 11:42:08,875 [myid:] - INFO  [SyncThread:0:SyncRequestProcessor@169] - SyncRequestProcessor exited!
    [junit] 2014-12-13 11:42:08,875 [myid:] - INFO  [main:FinalRequestProcessor@476] - shutdown of request processor complete
    [junit] 2014-12-13 11:42:08,875 [myid:] - INFO  [main:MBeanRegistry@119] - Unregister MBean [org.apache.ZooKeeperService:name0=StandaloneServer_port11221,name1=InMemoryDataTree]
    [junit] 2014-12-13 11:42:08,876 [myid:] - INFO  [main:MBeanRegistry@119] - Unregister MBean [org.apache.ZooKeeperService:name0=StandaloneServer_port11221]
    [junit] 2014-12-13 11:42:08,876 [myid:] - INFO  [main:FourLetterWordMain@43] - connecting to 127.0.0.1 11221
    [junit] 2014-12-13 11:42:08,877 [myid:] - INFO  [main:JMXEnv@142] - ensureOnly:[]
    [junit] 2014-12-13 11:42:08,885 [myid:] - INFO  [main:ClientBase@545] - fdcount after test is: 47 at start it was 33
    [junit] 2014-12-13 11:42:08,885 [myid:] - INFO  [main:ClientBase@547] - sleeping for 20 secs
    [junit] 2014-12-13 11:42:08,886 [myid:] - INFO  [main:ZKTestCase$1@65] - SUCCEEDED testQuota
    [junit] 2014-12-13 11:42:08,886 [myid:] - INFO  [main:ZKTestCase$1@60] - FINISHED testQuota
    [junit] Tests run: 1, Failures: 0, Errors: 0, Skipped: 0, Time elapsed: 0.563 sec

BUILD FAILED
/home/jenkins/jenkins-slave/workspace/ZooKeeper_branch35_jdk7/branch-3.5/build.xml:1422: The following error occurred while executing this line:
/home/jenkins/jenkins-slave/workspace/ZooKeeper_branch35_jdk7/branch-3.5/build.xml:1333: Tests failed!

Total time: 37 minutes 48 seconds
Build step 'Invoke Ant' marked build as failure
Archiving artifacts
Recording test results
Email was triggered for: Failure
Sending email for trigger: Failure



###################################################################################
############################## FAILED TESTS (if any) ##############################
1 tests failed.
REGRESSION:  org.apache.zookeeper.test.ReconfigTest.testPortChange

Error Message:
expected:<test[1]> but was:<test[0]>

Stack Trace:
junit.framework.AssertionFailedError: expected:<test[1]> but was:<test[0]>
	at org.apache.zookeeper.test.ReconfigTest.testNormalOperation(ReconfigTest.java:151)
	at org.apache.zookeeper.test.ReconfigTest.testPortChange(ReconfigTest.java:600)
	at org.apache.zookeeper.JUnit4ZKTestRunner$LoggedInvokeMethod.evaluate(JUnit4ZKTestRunner.java:52)



ZooKeeper_branch35_jdk7 - Build # 139 - Still Failing

Posted by Apache Jenkins Server <je...@builds.apache.org>.
See https://builds.apache.org/job/ZooKeeper_branch35_jdk7/139/

###################################################################################
########################## LAST 60 LINES OF THE CONSOLE ###########################
[...truncated 336860 lines...]
     [exec] mv -f .deps/zktest_mt-TestWatchers.Tpo .deps/zktest_mt-TestWatchers.Po
     [exec] g++ -DHAVE_CONFIG_H -I. -I/jenkins/workspace/ZooKeeper_branch35_jdk7/branch-3.5/src/c  -I/jenkins/workspace/ZooKeeper_branch35_jdk7/branch-3.5/src/c/include -I/jenkins/workspace/ZooKeeper_branch35_jdk7/branch-3.5/src/c/tests -I/jenkins/workspace/ZooKeeper_branch35_jdk7/branch-3.5/src/c/generated  -DUSE_STATIC_LIB -DTHREADED -DZKSERVER_CMD="\"/jenkins/workspace/ZooKeeper_branch35_jdk7/branch-3.5/src/c/tests/zkServer.sh\"" -DZOO_IPV6_ENABLED -g -O2 -MT zktest_mt-TestClient.o -MD -MP -MF .deps/zktest_mt-TestClient.Tpo -c -o zktest_mt-TestClient.o `test -f 'tests/TestClient.cc' || echo '/jenkins/workspace/ZooKeeper_branch35_jdk7/branch-3.5/src/c/'`tests/TestClient.cc
     [exec] mv -f .deps/zktest_mt-TestClient.Tpo .deps/zktest_mt-TestClient.Po
     [exec] g++ -DHAVE_CONFIG_H -I. -I/jenkins/workspace/ZooKeeper_branch35_jdk7/branch-3.5/src/c  -I/jenkins/workspace/ZooKeeper_branch35_jdk7/branch-3.5/src/c/include -I/jenkins/workspace/ZooKeeper_branch35_jdk7/branch-3.5/src/c/tests -I/jenkins/workspace/ZooKeeper_branch35_jdk7/branch-3.5/src/c/generated  -DUSE_STATIC_LIB -DTHREADED -DZKSERVER_CMD="\"/jenkins/workspace/ZooKeeper_branch35_jdk7/branch-3.5/src/c/tests/zkServer.sh\"" -DZOO_IPV6_ENABLED -g -O2 -MT zktest_mt-ZooKeeperQuorumServer.o -MD -MP -MF .deps/zktest_mt-ZooKeeperQuorumServer.Tpo -c -o zktest_mt-ZooKeeperQuorumServer.o `test -f 'tests/ZooKeeperQuorumServer.cc' || echo '/jenkins/workspace/ZooKeeper_branch35_jdk7/branch-3.5/src/c/'`tests/ZooKeeperQuorumServer.cc
     [exec] mv -f .deps/zktest_mt-ZooKeeperQuorumServer.Tpo .deps/zktest_mt-ZooKeeperQuorumServer.Po
     [exec] g++ -DHAVE_CONFIG_H -I. -I/jenkins/workspace/ZooKeeper_branch35_jdk7/branch-3.5/src/c  -I/jenkins/workspace/ZooKeeper_branch35_jdk7/branch-3.5/src/c/include -I/jenkins/workspace/ZooKeeper_branch35_jdk7/branch-3.5/src/c/tests -I/jenkins/workspace/ZooKeeper_branch35_jdk7/branch-3.5/src/c/generated  -DUSE_STATIC_LIB -DTHREADED -DZKSERVER_CMD="\"/jenkins/workspace/ZooKeeper_branch35_jdk7/branch-3.5/src/c/tests/zkServer.sh\"" -DZOO_IPV6_ENABLED -g -O2 -MT zktest_mt-TestReadOnlyClient.o -MD -MP -MF .deps/zktest_mt-TestReadOnlyClient.Tpo -c -o zktest_mt-TestReadOnlyClient.o `test -f 'tests/TestReadOnlyClient.cc' || echo '/jenkins/workspace/ZooKeeper_branch35_jdk7/branch-3.5/src/c/'`tests/TestReadOnlyClient.cc
     [exec] mv -f .deps/zktest_mt-TestReadOnlyClient.Tpo .deps/zktest_mt-TestReadOnlyClient.Po
     [exec] g++ -DHAVE_CONFIG_H -I. -I/jenkins/workspace/ZooKeeper_branch35_jdk7/branch-3.5/src/c  -I/jenkins/workspace/ZooKeeper_branch35_jdk7/branch-3.5/src/c/include -I/jenkins/workspace/ZooKeeper_branch35_jdk7/branch-3.5/src/c/tests -I/jenkins/workspace/ZooKeeper_branch35_jdk7/branch-3.5/src/c/generated  -DUSE_STATIC_LIB -DTHREADED -DZKSERVER_CMD="\"/jenkins/workspace/ZooKeeper_branch35_jdk7/branch-3.5/src/c/tests/zkServer.sh\"" -DZOO_IPV6_ENABLED -g -O2 -MT zktest_mt-PthreadMocks.o -MD -MP -MF .deps/zktest_mt-PthreadMocks.Tpo -c -o zktest_mt-PthreadMocks.o `test -f 'tests/PthreadMocks.cc' || echo '/jenkins/workspace/ZooKeeper_branch35_jdk7/branch-3.5/src/c/'`tests/PthreadMocks.cc
     [exec] mv -f .deps/zktest_mt-PthreadMocks.Tpo .deps/zktest_mt-PthreadMocks.Po
     [exec] /bin/bash ./libtool  --tag=CXX   --mode=link g++ -DUSE_STATIC_LIB -DTHREADED -DZKSERVER_CMD="\"/jenkins/workspace/ZooKeeper_branch35_jdk7/branch-3.5/src/c/tests/zkServer.sh\"" -DZOO_IPV6_ENABLED -g -O2 -static-libtool-libs -Wl,--wrap -Wl,calloc -Wl,--wrap -Wl,free -Wl,--wrap -Wl,flush_send_queue -Wl,--wrap -Wl,get_xid -Wl,--wrap -Wl,deliverWatchers -Wl,--wrap -Wl,activateWatcher -Wl,--wrap -Wl,pthread_mutex_lock -Wl,--wrap -Wl,pthread_mutex_trylock -Wl,--wrap -Wl,pthread_mutex_unlock  -o zktest-mt zktest_mt-TestDriver.o zktest_mt-LibCMocks.o zktest_mt-LibCSymTable.o zktest_mt-MocksBase.o zktest_mt-ZKMocks.o zktest_mt-Util.o zktest_mt-ThreadingUtil.o zktest_mt-TestZookeeperInit.o zktest_mt-TestZookeeperClose.o zktest_mt-TestReconfig.o zktest_mt-TestReconfigServer.o zktest_mt-TestClientRetry.o zktest_mt-TestOperations.o zktest_mt-TestMulti.o zktest_mt-TestWatchers.o zktest_mt-TestClient.o zktest_mt-ZooKeeperQuorumServer.o zktest_mt-TestReadOnlyClient.o zktest_mt-PthreadMocks.o libzkmt.la libhashtable.la -lpthread -L/usr/lib/x86_64-linux-gnu -lcppunit -ldl 
     [exec] libtool: link: g++ -DUSE_STATIC_LIB -DTHREADED -DZKSERVER_CMD=\"/jenkins/workspace/ZooKeeper_branch35_jdk7/branch-3.5/src/c/tests/zkServer.sh\" -DZOO_IPV6_ENABLED -g -O2 -Wl,--wrap -Wl,calloc -Wl,--wrap -Wl,free -Wl,--wrap -Wl,flush_send_queue -Wl,--wrap -Wl,get_xid -Wl,--wrap -Wl,deliverWatchers -Wl,--wrap -Wl,activateWatcher -Wl,--wrap -Wl,pthread_mutex_lock -Wl,--wrap -Wl,pthread_mutex_trylock -Wl,--wrap -Wl,pthread_mutex_unlock -o zktest-mt zktest_mt-TestDriver.o zktest_mt-LibCMocks.o zktest_mt-LibCSymTable.o zktest_mt-MocksBase.o zktest_mt-ZKMocks.o zktest_mt-Util.o zktest_mt-ThreadingUtil.o zktest_mt-TestZookeeperInit.o zktest_mt-TestZookeeperClose.o zktest_mt-TestReconfig.o zktest_mt-TestReconfigServer.o zktest_mt-TestClientRetry.o zktest_mt-TestOperations.o zktest_mt-TestMulti.o zktest_mt-TestWatchers.o zktest_mt-TestClient.o zktest_mt-ZooKeeperQuorumServer.o zktest_mt-TestReadOnlyClient.o zktest_mt-PthreadMocks.o  ./.libs/libzkmt.a -lm ./.libs/libhashtable.a -lpthread -L/usr/lib/x86_64-linux-gnu -lcppunit -ldl
     [exec] make[1]: Leaving directory `/jenkins/workspace/ZooKeeper_branch35_jdk7/branch-3.5/build/test/test-cppunit'
     [exec] make  check-TESTS
     [exec] make[1]: Entering directory `/jenkins/workspace/ZooKeeper_branch35_jdk7/branch-3.5/build/test/test-cppunit'
     [exec] make[2]: Entering directory `/jenkins/workspace/ZooKeeper_branch35_jdk7/branch-3.5/build/test/test-cppunit'
     [exec] PASS: zktest-st
     [exec] FAIL: zktest-mt
     [exec] make[3]: Entering directory `/jenkins/workspace/ZooKeeper_branch35_jdk7/branch-3.5/build/test/test-cppunit'
     [exec] make  all-am
     [exec] make[4]: Entering directory `/jenkins/workspace/ZooKeeper_branch35_jdk7/branch-3.5/build/test/test-cppunit'
     [exec] make[4]: Leaving directory `/jenkins/workspace/ZooKeeper_branch35_jdk7/branch-3.5/build/test/test-cppunit'
     [exec] make[3]: Leaving directory `/jenkins/workspace/ZooKeeper_branch35_jdk7/branch-3.5/build/test/test-cppunit'
     [exec] make[2]: *** [test-suite.log] Error 1
     [exec] make[1]: *** [check-TESTS] Error 2
     [exec] make: *** [check-am] Error 2
     [exec] ============================================================================
     [exec] Testsuite summary for zookeeper C client 3.5.1
     [exec] ============================================================================
     [exec] # TOTAL: 2
     [exec] # PASS:  1
     [exec] # SKIP:  0
     [exec] # XFAIL: 0
     [exec] # FAIL:  1
     [exec] # XPASS: 0
     [exec] # ERROR: 0
     [exec] ============================================================================
     [exec] See ./test-suite.log
     [exec] Please report to user@zookeeper.apache.org
     [exec] ============================================================================
     [exec] make[2]: Leaving directory `/jenkins/workspace/ZooKeeper_branch35_jdk7/branch-3.5/build/test/test-cppunit'
     [exec] make[1]: Leaving directory `/jenkins/workspace/ZooKeeper_branch35_jdk7/branch-3.5/build/test/test-cppunit'

BUILD FAILED
/jenkins/workspace/ZooKeeper_branch35_jdk7/branch-3.5/build.xml:1422: The following error occurred while executing this line:
/jenkins/workspace/ZooKeeper_branch35_jdk7/branch-3.5/build.xml:1382: The following error occurred while executing this line:
/jenkins/workspace/ZooKeeper_branch35_jdk7/branch-3.5/build.xml:1392: exec returned: 2

Total time: 45 minutes 6 seconds
Build step 'Invoke Ant' marked build as failure
Archiving artifacts
Sending artifact delta relative to ZooKeeper_branch35_jdk7 #129
Archived 5 artifacts
Archive block size is 32768
Received 0 blocks and 117217 bytes
Compression is 0.0%
Took 0.36 sec
Recording test results
Email was triggered for: Failure
Sending email for trigger: Failure



###################################################################################
############################## FAILED TESTS (if any) ##############################
All tests passed