You are viewing a plain text version of this content. The canonical link for it is here.
Posted to common-dev@hadoop.apache.org by Apache Jenkins Server <je...@builds.apache.org> on 2016/01/28 20:58:36 UTC
Build failed in Jenkins: Hadoop-Common-trunk #2298
See <https://builds.apache.org/job/Hadoop-Common-trunk/2298/changes>
Changes:
[jlowe] YARN-4643. Container recovery is broken with delegating container
------------------------------------------
[...truncated 5211 lines...]
Running org.apache.hadoop.io.TestMD5Hash
Tests run: 2, Failures: 0, Errors: 0, Skipped: 0, Time elapsed: 0.205 sec - in org.apache.hadoop.io.TestMD5Hash
Running org.apache.hadoop.io.serializer.TestSerializationFactory
Tests run: 5, Failures: 0, Errors: 0, Skipped: 0, Time elapsed: 0.537 sec - in org.apache.hadoop.io.serializer.TestSerializationFactory
Running org.apache.hadoop.io.serializer.avro.TestAvroSerialization
Tests run: 5, Failures: 0, Errors: 0, Skipped: 0, Time elapsed: 0.689 sec - in org.apache.hadoop.io.serializer.avro.TestAvroSerialization
Running org.apache.hadoop.io.serializer.TestWritableSerialization
Tests run: 3, Failures: 0, Errors: 0, Skipped: 0, Time elapsed: 0.39 sec - in org.apache.hadoop.io.serializer.TestWritableSerialization
Running org.apache.hadoop.io.TestSecureIOUtils
Tests run: 4, Failures: 0, Errors: 0, Skipped: 0, Time elapsed: 0.774 sec - in org.apache.hadoop.io.TestSecureIOUtils
Running org.apache.hadoop.io.TestDataByteBuffers
Tests run: 5, Failures: 0, Errors: 0, Skipped: 0, Time elapsed: 0.388 sec - in org.apache.hadoop.io.TestDataByteBuffers
Running org.apache.hadoop.io.compress.TestCodecPool
Tests run: 6, Failures: 0, Errors: 0, Skipped: 0, Time elapsed: 0.443 sec - in org.apache.hadoop.io.compress.TestCodecPool
Running org.apache.hadoop.io.compress.TestCompressorStream
Tests run: 1, Failures: 0, Errors: 0, Skipped: 0, Time elapsed: 0.08 sec - in org.apache.hadoop.io.compress.TestCompressorStream
Running org.apache.hadoop.io.compress.TestCompressorDecompressor
Tests run: 2, Failures: 0, Errors: 0, Skipped: 0, Time elapsed: 0.636 sec - in org.apache.hadoop.io.compress.TestCompressorDecompressor
Running org.apache.hadoop.io.compress.TestCodec
Tests run: 25, Failures: 0, Errors: 0, Skipped: 0, Time elapsed: 134.659 sec - in org.apache.hadoop.io.compress.TestCodec
Running org.apache.hadoop.io.compress.zlib.TestZlibCompressorDecompressor
Tests run: 9, Failures: 0, Errors: 0, Skipped: 0, Time elapsed: 1.119 sec - in org.apache.hadoop.io.compress.zlib.TestZlibCompressorDecompressor
Running org.apache.hadoop.io.compress.TestCompressionStreamReuse
Tests run: 3, Failures: 0, Errors: 0, Skipped: 0, Time elapsed: 4.273 sec - in org.apache.hadoop.io.compress.TestCompressionStreamReuse
Running org.apache.hadoop.io.compress.snappy.TestSnappyCompressorDecompressor
Tests run: 14, Failures: 0, Errors: 0, Skipped: 0, Time elapsed: 0.439 sec - in org.apache.hadoop.io.compress.snappy.TestSnappyCompressorDecompressor
Running org.apache.hadoop.io.compress.TestCodecFactory
Tests run: 1, Failures: 0, Errors: 0, Skipped: 0, Time elapsed: 0.58 sec - in org.apache.hadoop.io.compress.TestCodecFactory
Running org.apache.hadoop.io.compress.lz4.TestLz4CompressorDecompressor
Tests run: 13, Failures: 0, Errors: 0, Skipped: 0, Time elapsed: 0.325 sec - in org.apache.hadoop.io.compress.lz4.TestLz4CompressorDecompressor
Running org.apache.hadoop.io.compress.bzip2.TestBzip2CompressorDecompressor
Tests run: 2, Failures: 0, Errors: 0, Skipped: 2, Time elapsed: 0.439 sec - in org.apache.hadoop.io.compress.bzip2.TestBzip2CompressorDecompressor
Running org.apache.hadoop.io.compress.TestBlockDecompressorStream
Tests run: 2, Failures: 0, Errors: 0, Skipped: 0, Time elapsed: 0.079 sec - in org.apache.hadoop.io.compress.TestBlockDecompressorStream
Running org.apache.hadoop.io.TestWritableUtils
Tests run: 1, Failures: 0, Errors: 0, Skipped: 0, Time elapsed: 0.184 sec - in org.apache.hadoop.io.TestWritableUtils
Running org.apache.hadoop.io.TestMapFile
Tests run: 21, Failures: 0, Errors: 0, Skipped: 0, Time elapsed: 1.686 sec - in org.apache.hadoop.io.TestMapFile
Running org.apache.hadoop.io.TestUTF8
Tests run: 8, Failures: 0, Errors: 0, Skipped: 0, Time elapsed: 0.808 sec - in org.apache.hadoop.io.TestUTF8
Running org.apache.hadoop.io.TestBoundedByteArrayOutputStream
Tests run: 2, Failures: 0, Errors: 0, Skipped: 0, Time elapsed: 0.068 sec - in org.apache.hadoop.io.TestBoundedByteArrayOutputStream
Running org.apache.hadoop.io.erasurecode.TestECSchema
Tests run: 1, Failures: 0, Errors: 0, Skipped: 0, Time elapsed: 0.074 sec - in org.apache.hadoop.io.erasurecode.TestECSchema
Running org.apache.hadoop.io.erasurecode.rawcoder.TestRSRawCoder
Tests run: 16, Failures: 0, Errors: 0, Skipped: 0, Time elapsed: 0.329 sec - in org.apache.hadoop.io.erasurecode.rawcoder.TestRSRawCoder
Running org.apache.hadoop.io.erasurecode.rawcoder.TestXORRawCoder
Tests run: 6, Failures: 0, Errors: 0, Skipped: 0, Time elapsed: 0.151 sec - in org.apache.hadoop.io.erasurecode.rawcoder.TestXORRawCoder
Running org.apache.hadoop.io.erasurecode.rawcoder.TestDummyRawCoder
Tests run: 3, Failures: 0, Errors: 0, Skipped: 0, Time elapsed: 0.095 sec - in org.apache.hadoop.io.erasurecode.rawcoder.TestDummyRawCoder
Running org.apache.hadoop.io.erasurecode.coder.TestRSErasureCoder
Tests run: 10, Failures: 0, Errors: 0, Skipped: 0, Time elapsed: 1.052 sec - in org.apache.hadoop.io.erasurecode.coder.TestRSErasureCoder
Running org.apache.hadoop.io.erasurecode.coder.TestXORCoder
Tests run: 2, Failures: 0, Errors: 0, Skipped: 0, Time elapsed: 0.237 sec - in org.apache.hadoop.io.erasurecode.coder.TestXORCoder
Running org.apache.hadoop.io.erasurecode.coder.TestHHXORErasureCoder
Tests run: 9, Failures: 0, Errors: 0, Skipped: 0, Time elapsed: 1.272 sec - in org.apache.hadoop.io.erasurecode.coder.TestHHXORErasureCoder
Running org.apache.hadoop.io.TestSequenceFileSync
Tests run: 1, Failures: 0, Errors: 0, Skipped: 0, Time elapsed: 1.084 sec - in org.apache.hadoop.io.TestSequenceFileSync
Running org.apache.hadoop.io.TestVersionedWritable
Tests run: 3, Failures: 0, Errors: 0, Skipped: 0, Time elapsed: 0.175 sec - in org.apache.hadoop.io.TestVersionedWritable
Running org.apache.hadoop.io.TestWritable
Tests run: 6, Failures: 0, Errors: 0, Skipped: 0, Time elapsed: 0.341 sec - in org.apache.hadoop.io.TestWritable
Running org.apache.hadoop.io.TestBloomMapFile
Tests run: 7, Failures: 0, Errors: 0, Skipped: 0, Time elapsed: 1.602 sec - in org.apache.hadoop.io.TestBloomMapFile
Running org.apache.hadoop.io.TestSequenceFileAppend
Tests run: 4, Failures: 0, Errors: 0, Skipped: 0, Time elapsed: 0.915 sec - in org.apache.hadoop.io.TestSequenceFileAppend
Running org.apache.hadoop.io.TestEnumSetWritable
Tests run: 6, Failures: 0, Errors: 0, Skipped: 0, Time elapsed: 0.555 sec - in org.apache.hadoop.io.TestEnumSetWritable
Running org.apache.hadoop.io.TestMapWritable
Tests run: 5, Failures: 0, Errors: 0, Skipped: 0, Time elapsed: 0.215 sec - in org.apache.hadoop.io.TestMapWritable
Running org.apache.hadoop.io.TestBooleanWritable
Tests run: 2, Failures: 0, Errors: 0, Skipped: 0, Time elapsed: 0.205 sec - in org.apache.hadoop.io.TestBooleanWritable
Running org.apache.hadoop.io.TestBytesWritable
Tests run: 6, Failures: 0, Errors: 0, Skipped: 0, Time elapsed: 0.19 sec - in org.apache.hadoop.io.TestBytesWritable
Running org.apache.hadoop.io.TestSequenceFile
Tests run: 9, Failures: 0, Errors: 0, Skipped: 0, Time elapsed: 9.728 sec - in org.apache.hadoop.io.TestSequenceFile
Running org.apache.hadoop.io.TestTextNonUTF8
Tests run: 1, Failures: 0, Errors: 0, Skipped: 0, Time elapsed: 0.186 sec - in org.apache.hadoop.io.TestTextNonUTF8
Running org.apache.hadoop.io.TestObjectWritableProtos
Tests run: 3, Failures: 0, Errors: 0, Skipped: 0, Time elapsed: 0.304 sec - in org.apache.hadoop.io.TestObjectWritableProtos
Running org.apache.hadoop.io.TestDefaultStringifier
Tests run: 4, Failures: 0, Errors: 0, Skipped: 0, Time elapsed: 0.42 sec - in org.apache.hadoop.io.TestDefaultStringifier
Running org.apache.hadoop.io.retry.TestRetryProxy
Tests run: 12, Failures: 0, Errors: 0, Skipped: 0, Time elapsed: 1.237 sec - in org.apache.hadoop.io.retry.TestRetryProxy
Running org.apache.hadoop.io.retry.TestDefaultRetryPolicy
Tests run: 3, Failures: 0, Errors: 0, Skipped: 0, Time elapsed: 0.464 sec - in org.apache.hadoop.io.retry.TestDefaultRetryPolicy
Running org.apache.hadoop.io.retry.TestFailoverProxy
Tests run: 9, Failures: 0, Errors: 0, Skipped: 0, Time elapsed: 14.141 sec - in org.apache.hadoop.io.retry.TestFailoverProxy
Running org.apache.hadoop.io.nativeio.TestNativeIO
Tests run: 20, Failures: 0, Errors: 0, Skipped: 0, Time elapsed: 7.155 sec - in org.apache.hadoop.io.nativeio.TestNativeIO
Running org.apache.hadoop.io.nativeio.TestSharedFileDescriptorFactory
Tests run: 3, Failures: 0, Errors: 0, Skipped: 0, Time elapsed: 0.389 sec - in org.apache.hadoop.io.nativeio.TestSharedFileDescriptorFactory
Running org.apache.hadoop.io.TestIOUtils
Tests run: 12, Failures: 0, Errors: 0, Skipped: 0, Time elapsed: 0.405 sec - in org.apache.hadoop.io.TestIOUtils
Running org.apache.hadoop.io.TestSortedMapWritable
Tests run: 4, Failures: 0, Errors: 0, Skipped: 0, Time elapsed: 0.211 sec - in org.apache.hadoop.io.TestSortedMapWritable
Running org.apache.hadoop.io.TestArrayPrimitiveWritable
Tests run: 3, Failures: 0, Errors: 0, Skipped: 0, Time elapsed: 0.2 sec - in org.apache.hadoop.io.TestArrayPrimitiveWritable
Running org.apache.hadoop.io.TestSetFile
Tests run: 2, Failures: 0, Errors: 0, Skipped: 0, Time elapsed: 2.026 sec - in org.apache.hadoop.io.TestSetFile
Running org.apache.hadoop.io.TestWritableName
Tests run: 4, Failures: 0, Errors: 0, Skipped: 0, Time elapsed: 0.181 sec - in org.apache.hadoop.io.TestWritableName
Running org.apache.hadoop.io.TestGenericWritable
Tests run: 5, Failures: 0, Errors: 0, Skipped: 0, Time elapsed: 0.576 sec - in org.apache.hadoop.io.TestGenericWritable
Running org.apache.hadoop.io.TestArrayFile
Tests run: 3, Failures: 0, Errors: 0, Skipped: 0, Time elapsed: 2.965 sec - in org.apache.hadoop.io.TestArrayFile
Running org.apache.hadoop.io.TestText
Tests run: 18, Failures: 0, Errors: 0, Skipped: 0, Time elapsed: 0.731 sec - in org.apache.hadoop.io.TestText
Running org.apache.hadoop.io.file.tfile.TestTFileSplit
Tests run: 1, Failures: 0, Errors: 0, Skipped: 0, Time elapsed: 4.449 sec - in org.apache.hadoop.io.file.tfile.TestTFileSplit
Running org.apache.hadoop.io.file.tfile.TestTFileComparators
Tests run: 3, Failures: 0, Errors: 0, Skipped: 0, Time elapsed: 0.801 sec - in org.apache.hadoop.io.file.tfile.TestTFileComparators
Running org.apache.hadoop.io.file.tfile.TestTFileSeek
Tests run: 1, Failures: 0, Errors: 0, Skipped: 0, Time elapsed: 2.986 sec - in org.apache.hadoop.io.file.tfile.TestTFileSeek
Running org.apache.hadoop.io.file.tfile.TestTFileStreams
Tests run: 19, Failures: 0, Errors: 0, Skipped: 0, Time elapsed: 1.91 sec - in org.apache.hadoop.io.file.tfile.TestTFileStreams
Running org.apache.hadoop.io.file.tfile.TestTFileJClassComparatorByteArrays
Tests run: 25, Failures: 0, Errors: 0, Skipped: 0, Time elapsed: 2.696 sec - in org.apache.hadoop.io.file.tfile.TestTFileJClassComparatorByteArrays
Running org.apache.hadoop.io.file.tfile.TestTFileNoneCodecsByteArrays
Tests run: 25, Failures: 0, Errors: 0, Skipped: 0, Time elapsed: 1.427 sec - in org.apache.hadoop.io.file.tfile.TestTFileNoneCodecsByteArrays
Running org.apache.hadoop.io.file.tfile.TestTFileNoneCodecsJClassComparatorByteArrays
Tests run: 25, Failures: 0, Errors: 0, Skipped: 0, Time elapsed: 1.467 sec - in org.apache.hadoop.io.file.tfile.TestTFileNoneCodecsJClassComparatorByteArrays
Running org.apache.hadoop.io.file.tfile.TestTFileByteArrays
Tests run: 25, Failures: 0, Errors: 0, Skipped: 0, Time elapsed: 2.512 sec - in org.apache.hadoop.io.file.tfile.TestTFileByteArrays
Running org.apache.hadoop.io.file.tfile.TestTFile
Tests run: 3, Failures: 0, Errors: 0, Skipped: 0, Time elapsed: 1.316 sec - in org.apache.hadoop.io.file.tfile.TestTFile
Running org.apache.hadoop.io.file.tfile.TestTFileSeqFileComparison
Tests run: 1, Failures: 0, Errors: 0, Skipped: 0, Time elapsed: 4.002 sec - in org.apache.hadoop.io.file.tfile.TestTFileSeqFileComparison
Running org.apache.hadoop.io.file.tfile.TestTFileNoneCodecsStreams
Tests run: 19, Failures: 0, Errors: 0, Skipped: 0, Time elapsed: 1.844 sec - in org.apache.hadoop.io.file.tfile.TestTFileNoneCodecsStreams
Running org.apache.hadoop.io.file.tfile.TestTFileUnsortedByteArrays
Tests run: 4, Failures: 0, Errors: 0, Skipped: 0, Time elapsed: 0.924 sec - in org.apache.hadoop.io.file.tfile.TestTFileUnsortedByteArrays
Running org.apache.hadoop.io.file.tfile.TestTFileLzoCodecsStreams
Tests run: 19, Failures: 0, Errors: 0, Skipped: 0, Time elapsed: 0.359 sec - in org.apache.hadoop.io.file.tfile.TestTFileLzoCodecsStreams
Running org.apache.hadoop.io.file.tfile.TestTFileLzoCodecsByteArrays
Tests run: 25, Failures: 0, Errors: 0, Skipped: 0, Time elapsed: 0.394 sec - in org.apache.hadoop.io.file.tfile.TestTFileLzoCodecsByteArrays
Running org.apache.hadoop.io.file.tfile.TestTFileComparator2
Tests run: 1, Failures: 0, Errors: 0, Skipped: 0, Time elapsed: 1.664 sec - in org.apache.hadoop.io.file.tfile.TestTFileComparator2
Running org.apache.hadoop.io.file.tfile.TestVLong
Tests run: 9, Failures: 0, Errors: 0, Skipped: 0, Time elapsed: 1.713 sec - in org.apache.hadoop.io.file.tfile.TestVLong
Running org.apache.hadoop.io.TestArrayWritable
Tests run: 4, Failures: 0, Errors: 0, Skipped: 0, Time elapsed: 0.204 sec - in org.apache.hadoop.io.TestArrayWritable
Running org.apache.hadoop.io.TestSequenceFileSerialization
Tests run: 1, Failures: 0, Errors: 0, Skipped: 0, Time elapsed: 0.997 sec - in org.apache.hadoop.io.TestSequenceFileSerialization
Running org.apache.hadoop.conf.TestConfigurationDeprecation
Tests run: 9, Failures: 0, Errors: 0, Skipped: 0, Time elapsed: 11.124 sec - in org.apache.hadoop.conf.TestConfigurationDeprecation
Running org.apache.hadoop.conf.TestReconfiguration
Tests run: 5, Failures: 0, Errors: 0, Skipped: 0, Time elapsed: 2.482 sec - in org.apache.hadoop.conf.TestReconfiguration
Running org.apache.hadoop.conf.TestConfiguration
Tests run: 62, Failures: 0, Errors: 0, Skipped: 0, Time elapsed: 5.343 sec - in org.apache.hadoop.conf.TestConfiguration
Running org.apache.hadoop.conf.TestConfigurationSubclass
Tests run: 3, Failures: 0, Errors: 0, Skipped: 0, Time elapsed: 0.44 sec - in org.apache.hadoop.conf.TestConfigurationSubclass
Running org.apache.hadoop.conf.TestGetInstances
Tests run: 1, Failures: 0, Errors: 0, Skipped: 0, Time elapsed: 0.338 sec - in org.apache.hadoop.conf.TestGetInstances
Running org.apache.hadoop.conf.TestConfServlet
Tests run: 3, Failures: 0, Errors: 0, Skipped: 0, Time elapsed: 0.742 sec - in org.apache.hadoop.conf.TestConfServlet
Running org.apache.hadoop.conf.TestDeprecatedKeys
Tests run: 3, Failures: 0, Errors: 0, Skipped: 0, Time elapsed: 0.774 sec - in org.apache.hadoop.conf.TestDeprecatedKeys
Running org.apache.hadoop.test.TestMultithreadedTestUtil
Tests run: 4, Failures: 0, Errors: 0, Skipped: 0, Time elapsed: 3.22 sec - in org.apache.hadoop.test.TestMultithreadedTestUtil
Running org.apache.hadoop.test.TestTimedOutTestsListener
Tests run: 1, Failures: 0, Errors: 0, Skipped: 0, Time elapsed: 0.22 sec - in org.apache.hadoop.test.TestTimedOutTestsListener
Running org.apache.hadoop.test.TestGenericTestUtils
Tests run: 4, Failures: 0, Errors: 0, Skipped: 0, Time elapsed: 0.213 sec - in org.apache.hadoop.test.TestGenericTestUtils
Running org.apache.hadoop.test.TestJUnitSetup
Tests run: 1, Failures: 0, Errors: 0, Skipped: 0, Time elapsed: 0.171 sec - in org.apache.hadoop.test.TestJUnitSetup
Running org.apache.hadoop.log.TestLog4Json
Tests run: 5, Failures: 0, Errors: 0, Skipped: 0, Time elapsed: 0.457 sec - in org.apache.hadoop.log.TestLog4Json
Running org.apache.hadoop.log.TestLogLevel
Tests run: 1, Failures: 0, Errors: 0, Skipped: 0, Time elapsed: 0.767 sec - in org.apache.hadoop.log.TestLogLevel
Results :
Tests run: 3247, Failures: 0, Errors: 0, Skipped: 86
[INFO]
[INFO] --- maven-antrun-plugin:1.7:run (common-test-bats-driver) @ hadoop-common ---
[INFO] Executing tasks
main:
[exec]
[exec]
[exec] ERROR: bats not installed. Skipping bash tests.
[exec] ERROR: Please install bats as soon as possible.
[exec]
[exec]
[INFO] Executed tasks
[INFO]
[INFO] --- hadoop-maven-plugins:3.0.0-SNAPSHOT:cmake-test (test_bulk_crc32) @ hadoop-common ---
[INFO] -------------------------------------------------------
[INFO] C M A K E B U I L D E R T E S T
[INFO] -------------------------------------------------------
[INFO] test_bulk_crc32: running <https://builds.apache.org/job/Hadoop-Common-trunk/ws/hadoop-common-project/hadoop-common/target/native/test_bulk_crc32>
[INFO] with extra environment variables {}
[INFO] ------------------------------------------------------------------------
[INFO] Reactor Summary:
[INFO]
[INFO] Apache Hadoop Annotations ......................... SUCCESS [ 9.631 s]
[INFO] Apache Hadoop MiniKDC ............................. SUCCESS [ 20.982 s]
[INFO] Apache Hadoop Auth ................................ SUCCESS [03:56 min]
[INFO] Apache Hadoop Auth Examples ....................... SUCCESS [ 3.561 s]
[INFO] Apache Hadoop Common .............................. FAILURE [22:29 min]
[INFO] Apache Hadoop NFS ................................. SKIPPED
[INFO] Apache Hadoop KMS ................................. SKIPPED
[INFO] Apache Hadoop Common Project ...................... SKIPPED
[INFO] ------------------------------------------------------------------------
[INFO] BUILD FAILURE
[INFO] ------------------------------------------------------------------------
[INFO] Total time: 27:02 min
[INFO] Finished at: 2016-01-28T19:58:29+00:00
[INFO] Final Memory: 81M/956M
[INFO] ------------------------------------------------------------------------
[ERROR] Failed to execute goal org.apache.hadoop:hadoop-maven-plugins:3.0.0-SNAPSHOT:cmake-test (test_bulk_crc32) on project hadoop-common: Execution test_bulk_crc32 of goal org.apache.hadoop:hadoop-maven-plugins:3.0.0-SNAPSHOT:cmake-test failed: A required class was missing while executing org.apache.hadoop:hadoop-maven-plugins:3.0.0-SNAPSHOT:cmake-test: org/apache/hadoop/maven/plugin/cmakebuilder/TestMojo$TestThread
[ERROR] -----------------------------------------------------
[ERROR] realm = plugin>org.apache.hadoop:hadoop-maven-plugins:3.0.0-SNAPSHOT
[ERROR] strategy = org.codehaus.plexus.classworlds.strategy.SelfFirstStrategy
[ERROR] urls[0] = file:/home/jenkins/.m2/repository/org/apache/hadoop/hadoop-maven-plugins/3.0.0-SNAPSHOT/hadoop-maven-plugins-3.0.0-SNAPSHOT.jar
[ERROR] urls[1] = file:/home/jenkins/.m2/repository/org/sonatype/sisu/sisu-inject-bean/1.4.2/sisu-inject-bean-1.4.2.jar
[ERROR] urls[2] = file:/home/jenkins/.m2/repository/org/sonatype/sisu/sisu-guice/2.1.7/sisu-guice-2.1.7-noaop.jar
[ERROR] urls[3] = file:/home/jenkins/.m2/repository/org/sonatype/aether/aether-util/1.7/aether-util-1.7.jar
[ERROR] urls[4] = file:/home/jenkins/.m2/repository/org/codehaus/plexus/plexus-interpolation/1.14/plexus-interpolation-1.14.jar
[ERROR] urls[5] = file:/home/jenkins/.m2/repository/org/codehaus/plexus/plexus-utils/2.0.5/plexus-utils-2.0.5.jar
[ERROR] urls[6] = file:/home/jenkins/.m2/repository/org/codehaus/plexus/plexus-component-annotations/1.5.5/plexus-component-annotations-1.5.5.jar
[ERROR] urls[7] = file:/home/jenkins/.m2/repository/org/sonatype/plexus/plexus-sec-dispatcher/1.3/plexus-sec-dispatcher-1.3.jar
[ERROR] urls[8] = file:/home/jenkins/.m2/repository/org/sonatype/plexus/plexus-cipher/1.4/plexus-cipher-1.4.jar
[ERROR] urls[9] = file:/home/jenkins/.m2/repository/org/codehaus/jackson/jackson-core-asl/1.9.13/jackson-core-asl-1.9.13.jar
[ERROR] urls[10] = file:/home/jenkins/.m2/repository/org/codehaus/jackson/jackson-mapper-asl/1.9.13/jackson-mapper-asl-1.9.13.jar
[ERROR] Number of foreign imports: 1
[ERROR] import: Entry[import from realm ClassRealm[project>org.apache.hadoop:hadoop-common-project:3.0.0-SNAPSHOT, parent: ClassRealm[maven.api, parent: null]]]
[ERROR]
[ERROR] -----------------------------------------------------: org.apache.hadoop.maven.plugin.cmakebuilder.TestMojo$TestThread
[ERROR] -> [Help 1]
[ERROR]
[ERROR] To see the full stack trace of the errors, re-run Maven with the -e switch.
[ERROR] Re-run Maven using the -X switch to enable full debug logging.
[ERROR]
[ERROR] For more information about the errors and possible solutions, please read the following articles:
[ERROR] [Help 1] http://cwiki.apache.org/confluence/display/MAVEN/PluginContainerException
[ERROR]
[ERROR] After correcting the problems, you can resume the build with the command
[ERROR] mvn <goals> -rf :hadoop-common
result: 1
################
# mvn -eaf test -Pclover -DcloverLicenseLocation=/home/jenkins/tools/clover/latest/lib/clover.license
################
Build step 'Execute shell' marked build as failure
Archiving artifacts
Recording test results
Jenkins build is back to normal : Hadoop-Common-trunk #2301
Posted by Apache Jenkins Server <je...@builds.apache.org>.
See <https://builds.apache.org/job/Hadoop-Common-trunk/2301/changes>
Build failed in Jenkins: Hadoop-Common-trunk #2300
Posted by Apache Jenkins Server <je...@builds.apache.org>.
See <https://builds.apache.org/job/Hadoop-Common-trunk/2300/changes>
Changes:
[kasha] HADOOP-12702. Add an HDFS metrics sink. (Daniel Templeton via kasha)
------------------------------------------
[...truncated 3919 lines...]
Generating <https://builds.apache.org/job/Hadoop-Common-trunk/ws/hadoop-common-project/hadoop-annotations/target/allclasses-frame.html...>
Generating <https://builds.apache.org/job/Hadoop-Common-trunk/ws/hadoop-common-project/hadoop-annotations/target/allclasses-noframe.html...>
Generating <https://builds.apache.org/job/Hadoop-Common-trunk/ws/hadoop-common-project/hadoop-annotations/target/index.html...>
Generating <https://builds.apache.org/job/Hadoop-Common-trunk/ws/hadoop-common-project/hadoop-annotations/target/overview-summary.html...>
Generating <https://builds.apache.org/job/Hadoop-Common-trunk/ws/hadoop-common-project/hadoop-annotations/target/help-doc.html...>
[INFO] Building jar: <https://builds.apache.org/job/Hadoop-Common-trunk/ws/hadoop-common-project/hadoop-annotations/target/hadoop-annotations-3.0.0-SNAPSHOT-javadoc.jar>
[INFO]
[INFO] ------------------------------------------------------------------------
[INFO] Building Apache Hadoop MiniKDC 3.0.0-SNAPSHOT
[INFO] ------------------------------------------------------------------------
[INFO]
[INFO] --- maven-clean-plugin:2.5:clean (default-clean) @ hadoop-minikdc ---
[INFO] Deleting <https://builds.apache.org/job/Hadoop-Common-trunk/ws/hadoop-common-project/hadoop-minikdc/target>
[INFO]
[INFO] --- findbugs-maven-plugin:3.0.0:findbugs (default-cli) @ hadoop-minikdc ---
[INFO]
[INFO] --- maven-checkstyle-plugin:2.15:checkstyle (default-cli) @ hadoop-minikdc ---
[INFO] There are 9 errors reported by Checkstyle 6.6 with checkstyle/checkstyle.xml ruleset.
[WARNING] Unable to locate Source XRef to link to - DISABLED
[INFO]
[INFO] --- maven-antrun-plugin:1.7:run (create-testdirs) @ hadoop-minikdc ---
[INFO] Executing tasks
main:
[mkdir] Created dir: <https://builds.apache.org/job/Hadoop-Common-trunk/ws/hadoop-common-project/hadoop-minikdc/target/test-dir>
[INFO] Executed tasks
[INFO]
[INFO] --- maven-resources-plugin:2.6:resources (default-resources) @ hadoop-minikdc ---
[INFO] Using 'UTF-8' encoding to copy filtered resources.
[INFO] Copying 3 resources
[INFO]
[INFO] --- maven-compiler-plugin:3.1:compile (default-compile) @ hadoop-minikdc ---
[INFO] Changes detected - recompiling the module!
[INFO] Compiling 2 source files to <https://builds.apache.org/job/Hadoop-Common-trunk/ws/hadoop-common-project/hadoop-minikdc/target/classes>
[INFO]
[INFO] --- maven-resources-plugin:2.6:testResources (default-testResources) @ hadoop-minikdc ---
[INFO] Using 'UTF-8' encoding to copy filtered resources.
[INFO] skip non existing resourceDirectory <https://builds.apache.org/job/Hadoop-Common-trunk/ws/hadoop-common-project/hadoop-minikdc/src/test/resources>
[INFO]
[INFO] --- maven-compiler-plugin:3.1:testCompile (default-testCompile) @ hadoop-minikdc ---
[INFO] Changes detected - recompiling the module!
[INFO] Compiling 2 source files to <https://builds.apache.org/job/Hadoop-Common-trunk/ws/hadoop-common-project/hadoop-minikdc/target/test-classes>
[INFO]
[INFO] --- maven-surefire-plugin:2.17:test (default-test) @ hadoop-minikdc ---
[INFO] Surefire report directory: <https://builds.apache.org/job/Hadoop-Common-trunk/ws/hadoop-common-project/hadoop-minikdc/target/surefire-reports>
-------------------------------------------------------
T E S T S
-------------------------------------------------------
-------------------------------------------------------
T E S T S
-------------------------------------------------------
Running org.apache.hadoop.minikdc.TestChangeOrgNameAndDomain
Tests run: 3, Failures: 0, Errors: 0, Skipped: 0, Time elapsed: 8.811 sec - in org.apache.hadoop.minikdc.TestChangeOrgNameAndDomain
Running org.apache.hadoop.minikdc.TestMiniKdc
Tests run: 3, Failures: 0, Errors: 0, Skipped: 0, Time elapsed: 8.479 sec - in org.apache.hadoop.minikdc.TestMiniKdc
Results :
Tests run: 6, Failures: 0, Errors: 0, Skipped: 0
[INFO]
[INFO] --- maven-jar-plugin:2.5:jar (default-jar) @ hadoop-minikdc ---
[INFO] Building jar: <https://builds.apache.org/job/Hadoop-Common-trunk/ws/hadoop-common-project/hadoop-minikdc/target/hadoop-minikdc-3.0.0-SNAPSHOT.jar>
[INFO]
[INFO] --- maven-source-plugin:2.3:jar-no-fork (hadoop-java-sources) @ hadoop-minikdc ---
[INFO] Building jar: <https://builds.apache.org/job/Hadoop-Common-trunk/ws/hadoop-common-project/hadoop-minikdc/target/hadoop-minikdc-3.0.0-SNAPSHOT-sources.jar>
[INFO]
[INFO] --- maven-source-plugin:2.3:test-jar-no-fork (hadoop-java-sources) @ hadoop-minikdc ---
[INFO] Building jar: <https://builds.apache.org/job/Hadoop-Common-trunk/ws/hadoop-common-project/hadoop-minikdc/target/hadoop-minikdc-3.0.0-SNAPSHOT-test-sources.jar>
[INFO]
[INFO] --- maven-enforcer-plugin:1.3.1:enforce (dist-enforce) @ hadoop-minikdc ---
[INFO]
[INFO] --- maven-site-plugin:3.4:attach-descriptor (attach-descriptor) @ hadoop-minikdc ---
[INFO]
[INFO] --- maven-javadoc-plugin:2.8.1:jar (module-javadocs) @ hadoop-minikdc ---
[INFO]
Loading source files for package org.apache.hadoop.minikdc...
Constructing Javadoc information...
Standard Doclet version 1.7.0_55
Building tree for all the packages and classes...
Generating <https://builds.apache.org/job/Hadoop-Common-trunk/ws/hadoop-common-project/hadoop-minikdc/target/org/apache/hadoop/minikdc/KerberosSecurityTestcase.html...>
Generating <https://builds.apache.org/job/Hadoop-Common-trunk/ws/hadoop-common-project/hadoop-minikdc/target/org/apache/hadoop/minikdc/MiniKdc.html...>
Generating <https://builds.apache.org/job/Hadoop-Common-trunk/ws/hadoop-common-project/hadoop-minikdc/target/org/apache/hadoop/minikdc/package-frame.html...>
Generating <https://builds.apache.org/job/Hadoop-Common-trunk/ws/hadoop-common-project/hadoop-minikdc/target/org/apache/hadoop/minikdc/package-summary.html...>
Generating <https://builds.apache.org/job/Hadoop-Common-trunk/ws/hadoop-common-project/hadoop-minikdc/target/org/apache/hadoop/minikdc/package-tree.html...>
Generating <https://builds.apache.org/job/Hadoop-Common-trunk/ws/hadoop-common-project/hadoop-minikdc/target/constant-values.html...>
Generating <https://builds.apache.org/job/Hadoop-Common-trunk/ws/hadoop-common-project/hadoop-minikdc/target/org/apache/hadoop/minikdc/class-use/KerberosSecurityTestcase.html...>
Generating <https://builds.apache.org/job/Hadoop-Common-trunk/ws/hadoop-common-project/hadoop-minikdc/target/org/apache/hadoop/minikdc/class-use/MiniKdc.html...>
Generating <https://builds.apache.org/job/Hadoop-Common-trunk/ws/hadoop-common-project/hadoop-minikdc/target/org/apache/hadoop/minikdc/package-use.html...>
Building index for all the packages and classes...
Generating <https://builds.apache.org/job/Hadoop-Common-trunk/ws/hadoop-common-project/hadoop-minikdc/target/overview-tree.html...>
Generating <https://builds.apache.org/job/Hadoop-Common-trunk/ws/hadoop-common-project/hadoop-minikdc/target/index-all.html...>
Generating <https://builds.apache.org/job/Hadoop-Common-trunk/ws/hadoop-common-project/hadoop-minikdc/target/deprecated-list.html...>
Building index for all classes...
Generating <https://builds.apache.org/job/Hadoop-Common-trunk/ws/hadoop-common-project/hadoop-minikdc/target/allclasses-frame.html...>
Generating <https://builds.apache.org/job/Hadoop-Common-trunk/ws/hadoop-common-project/hadoop-minikdc/target/allclasses-noframe.html...>
Generating <https://builds.apache.org/job/Hadoop-Common-trunk/ws/hadoop-common-project/hadoop-minikdc/target/index.html...>
Generating <https://builds.apache.org/job/Hadoop-Common-trunk/ws/hadoop-common-project/hadoop-minikdc/target/help-doc.html...>
2 warnings
[WARNING] Javadoc Warnings
[WARNING] /home/jenkins/.m2/repository/org/apache/directory/api/api-ldap-model/1.0.0-M20/api-ldap-model-1.0.0-M20.jar(org/apache/directory/api/ldap/model/name/Dn.class): warning: Cannot find annotation method 'value()' in type 'SuppressWarnings': class file for edu.umd.cs.findbugs.annotations.SuppressWarnings not found
[WARNING] /home/jenkins/.m2/repository/org/apache/directory/api/api-ldap-model/1.0.0-M20/api-ldap-model-1.0.0-M20.jar(org/apache/directory/api/ldap/model/name/Dn.class): warning: Cannot find annotation method 'justification()' in type 'SuppressWarnings'
[INFO] Building jar: <https://builds.apache.org/job/Hadoop-Common-trunk/ws/hadoop-common-project/hadoop-minikdc/target/hadoop-minikdc-3.0.0-SNAPSHOT-javadoc.jar>
[INFO]
[INFO] ------------------------------------------------------------------------
[INFO] Building Apache Hadoop Auth 3.0.0-SNAPSHOT
[INFO] ------------------------------------------------------------------------
[INFO]
[INFO] --- maven-clean-plugin:2.5:clean (default-clean) @ hadoop-auth ---
[INFO] Deleting <https://builds.apache.org/job/Hadoop-Common-trunk/ws/hadoop-common-project/hadoop-auth/target>
[INFO]
[INFO] --- findbugs-maven-plugin:3.0.0:findbugs (default-cli) @ hadoop-auth ---
[INFO]
[INFO] --- maven-checkstyle-plugin:2.15:checkstyle (default-cli) @ hadoop-auth ---
[INFO] There are 255 errors reported by Checkstyle 6.6 with checkstyle/checkstyle.xml ruleset.
[WARNING] Unable to locate Source XRef to link to - DISABLED
[INFO]
[INFO] --- maven-antrun-plugin:1.7:run (create-testdirs) @ hadoop-auth ---
[INFO] Executing tasks
main:
[mkdir] Created dir: <https://builds.apache.org/job/Hadoop-Common-trunk/ws/hadoop-common-project/hadoop-auth/target/test-dir>
[INFO] Executed tasks
[INFO]
[INFO] --- maven-resources-plugin:2.6:resources (default-resources) @ hadoop-auth ---
[INFO] Using 'UTF-8' encoding to copy filtered resources.
[INFO] skip non existing resourceDirectory <https://builds.apache.org/job/Hadoop-Common-trunk/ws/hadoop-common-project/hadoop-auth/src/main/resources>
[INFO]
[INFO] --- maven-compiler-plugin:3.1:compile (default-compile) @ hadoop-auth ---
[INFO] Changes detected - recompiling the module!
[INFO] Compiling 25 source files to <https://builds.apache.org/job/Hadoop-Common-trunk/ws/hadoop-common-project/hadoop-auth/target/classes>
[INFO]
[INFO] --- maven-resources-plugin:2.6:testResources (default-testResources) @ hadoop-auth ---
[INFO] Using 'UTF-8' encoding to copy filtered resources.
[INFO] skip non existing resourceDirectory <https://builds.apache.org/job/Hadoop-Common-trunk/ws/hadoop-common-project/hadoop-auth/src/test/resources>
[INFO]
[INFO] --- maven-compiler-plugin:3.1:testCompile (default-testCompile) @ hadoop-auth ---
[INFO] Changes detected - recompiling the module!
[INFO] Compiling 24 source files to <https://builds.apache.org/job/Hadoop-Common-trunk/ws/hadoop-common-project/hadoop-auth/target/test-classes>
[INFO]
[INFO] --- maven-surefire-plugin:2.17:test (default-test) @ hadoop-auth ---
[INFO] Surefire report directory: <https://builds.apache.org/job/Hadoop-Common-trunk/ws/hadoop-common-project/hadoop-auth/target/surefire-reports>
-------------------------------------------------------
T E S T S
-------------------------------------------------------
-------------------------------------------------------
T E S T S
-------------------------------------------------------
Running org.apache.hadoop.security.authentication.util.TestAuthToken
Tests run: 4, Failures: 0, Errors: 0, Skipped: 0, Time elapsed: 0.212 sec - in org.apache.hadoop.security.authentication.util.TestAuthToken
Running org.apache.hadoop.security.authentication.util.TestStringSignerSecretProvider
Tests run: 1, Failures: 0, Errors: 0, Skipped: 0, Time elapsed: 0.067 sec - in org.apache.hadoop.security.authentication.util.TestStringSignerSecretProvider
Running org.apache.hadoop.security.authentication.util.TestSigner
Tests run: 6, Failures: 0, Errors: 0, Skipped: 0, Time elapsed: 0.1 sec - in org.apache.hadoop.security.authentication.util.TestSigner
Running org.apache.hadoop.security.authentication.util.TestKerberosUtil
Tests run: 5, Failures: 0, Errors: 0, Skipped: 0, Time elapsed: 0.449 sec - in org.apache.hadoop.security.authentication.util.TestKerberosUtil
Running org.apache.hadoop.security.authentication.util.TestRandomSignerSecretProvider
Tests run: 1, Failures: 0, Errors: 0, Skipped: 0, Time elapsed: 51.175 sec - in org.apache.hadoop.security.authentication.util.TestRandomSignerSecretProvider
Running org.apache.hadoop.security.authentication.util.TestCertificateUtil
Tests run: 3, Failures: 0, Errors: 0, Skipped: 0, Time elapsed: 0.101 sec - in org.apache.hadoop.security.authentication.util.TestCertificateUtil
Running org.apache.hadoop.security.authentication.util.TestKerberosName
Tests run: 3, Failures: 0, Errors: 0, Skipped: 0, Time elapsed: 0.231 sec - in org.apache.hadoop.security.authentication.util.TestKerberosName
Running org.apache.hadoop.security.authentication.util.TestRolloverSignerSecretProvider
Tests run: 1, Failures: 0, Errors: 0, Skipped: 0, Time elapsed: 51.164 sec - in org.apache.hadoop.security.authentication.util.TestRolloverSignerSecretProvider
Running org.apache.hadoop.security.authentication.util.TestZKSignerSecretProvider
Tests run: 3, Failures: 1, Errors: 0, Skipped: 0, Time elapsed: 13.876 sec <<< FAILURE! - in org.apache.hadoop.security.authentication.util.TestZKSignerSecretProvider
testMultipleUnsychnronized(org.apache.hadoop.security.authentication.util.TestZKSignerSecretProvider) Time elapsed: 3.048 sec <<< FAILURE!
java.lang.AssertionError: array lengths differed, expected.length=20 actual.length=19
at org.junit.Assert.fail(Assert.java:88)
at org.junit.internal.ComparisonCriteria.assertArraysAreSameLength(ComparisonCriteria.java:71)
at org.junit.internal.ComparisonCriteria.arrayEquals(ComparisonCriteria.java:32)
at org.junit.Assert.internalArrayEquals(Assert.java:473)
at org.junit.Assert.assertArrayEquals(Assert.java:294)
at org.junit.Assert.assertArrayEquals(Assert.java:305)
at org.apache.hadoop.security.authentication.util.TestZKSignerSecretProvider.testMultipleUnsychnronized(TestZKSignerSecretProvider.java:237)
Running org.apache.hadoop.security.authentication.util.TestJaasConfiguration
Tests run: 1, Failures: 0, Errors: 0, Skipped: 0, Time elapsed: 0.064 sec - in org.apache.hadoop.security.authentication.util.TestJaasConfiguration
Running org.apache.hadoop.security.authentication.util.TestFileSignerSecretProvider
Tests run: 1, Failures: 0, Errors: 0, Skipped: 0, Time elapsed: 0.067 sec - in org.apache.hadoop.security.authentication.util.TestFileSignerSecretProvider
Running org.apache.hadoop.security.authentication.client.TestPseudoAuthenticator
Tests run: 7, Failures: 0, Errors: 0, Skipped: 0, Time elapsed: 1.042 sec - in org.apache.hadoop.security.authentication.client.TestPseudoAuthenticator
Running org.apache.hadoop.security.authentication.client.TestAuthenticatedURL
Tests run: 6, Failures: 0, Errors: 0, Skipped: 0, Time elapsed: 0.29 sec - in org.apache.hadoop.security.authentication.client.TestAuthenticatedURL
Running org.apache.hadoop.security.authentication.client.TestKerberosAuthenticator
Tests run: 14, Failures: 0, Errors: 0, Skipped: 0, Time elapsed: 25.822 sec - in org.apache.hadoop.security.authentication.client.TestKerberosAuthenticator
Running org.apache.hadoop.security.authentication.server.TestAuthenticationToken
Tests run: 1, Failures: 0, Errors: 0, Skipped: 0, Time elapsed: 0.064 sec - in org.apache.hadoop.security.authentication.server.TestAuthenticationToken
Running org.apache.hadoop.security.authentication.server.TestJWTRedirectAuthentictionHandler
Tests run: 11, Failures: 0, Errors: 0, Skipped: 0, Time elapsed: 31.891 sec - in org.apache.hadoop.security.authentication.server.TestJWTRedirectAuthentictionHandler
Running org.apache.hadoop.security.authentication.server.TestAuthenticationFilter
Tests run: 26, Failures: 0, Errors: 0, Skipped: 0, Time elapsed: 0.651 sec - in org.apache.hadoop.security.authentication.server.TestAuthenticationFilter
Running org.apache.hadoop.security.authentication.server.TestKerberosAuthenticationHandler
Tests run: 6, Failures: 0, Errors: 0, Skipped: 0, Time elapsed: 13.054 sec - in org.apache.hadoop.security.authentication.server.TestKerberosAuthenticationHandler
Running org.apache.hadoop.security.authentication.server.TestPseudoAuthenticationHandler
Tests run: 6, Failures: 0, Errors: 0, Skipped: 0, Time elapsed: 0.308 sec - in org.apache.hadoop.security.authentication.server.TestPseudoAuthenticationHandler
Running org.apache.hadoop.security.authentication.server.TestAltKerberosAuthenticationHandler
Tests run: 9, Failures: 0, Errors: 0, Skipped: 0, Time elapsed: 17.497 sec - in org.apache.hadoop.security.authentication.server.TestAltKerberosAuthenticationHandler
Results :
Failed tests:
TestZKSignerSecretProvider.testMultipleUnsychnronized:237 array lengths differed, expected.length=20 actual.length=19
Tests run: 115, Failures: 1, Errors: 0, Skipped: 0
[INFO] ------------------------------------------------------------------------
[INFO] Reactor Summary:
[INFO]
[INFO] Apache Hadoop Annotations ......................... SUCCESS [ 8.659 s]
[INFO] Apache Hadoop MiniKDC ............................. SUCCESS [ 21.897 s]
[INFO] Apache Hadoop Auth ................................ FAILURE [03:36 min]
[INFO] Apache Hadoop Auth Examples ....................... SKIPPED
[INFO] Apache Hadoop Common .............................. SKIPPED
[INFO] Apache Hadoop NFS ................................. SKIPPED
[INFO] Apache Hadoop KMS ................................. SKIPPED
[INFO] Apache Hadoop Common Project ...................... SKIPPED
[INFO] ------------------------------------------------------------------------
[INFO] BUILD FAILURE
[INFO] ------------------------------------------------------------------------
[INFO] Total time: 04:08 min
[INFO] Finished at: 2016-01-29T02:25:04+00:00
[INFO] Final Memory: 62M/1312M
[INFO] ------------------------------------------------------------------------
[ERROR] Failed to execute goal org.apache.maven.plugins:maven-surefire-plugin:2.17:test (default-test) on project hadoop-auth: There are test failures.
[ERROR]
[ERROR] Please refer to <https://builds.apache.org/job/Hadoop-Common-trunk/ws/hadoop-common-project/hadoop-auth/target/surefire-reports> for the individual test results.
[ERROR] -> [Help 1]
[ERROR]
[ERROR] To see the full stack trace of the errors, re-run Maven with the -e switch.
[ERROR] Re-run Maven using the -X switch to enable full debug logging.
[ERROR]
[ERROR] For more information about the errors and possible solutions, please read the following articles:
[ERROR] [Help 1] http://cwiki.apache.org/confluence/display/MAVEN/MojoFailureException
[ERROR]
[ERROR] After correcting the problems, you can resume the build with the command
[ERROR] mvn <goals> -rf :hadoop-auth
result: 1
################
# mvn -eaf test -Pclover -DcloverLicenseLocation=/home/jenkins/tools/clover/latest/lib/clover.license
################
Build step 'Execute shell' marked build as failure
Archiving artifacts
Recording test results
Build failed in Jenkins: Hadoop-Common-trunk #2299
Posted by Apache Jenkins Server <je...@builds.apache.org>.
See <https://builds.apache.org/job/Hadoop-Common-trunk/2299/changes>
Changes:
[xgong] YARN-4219. New levelDB cache storage for timeline v1.5. Contributed by
[cnauroth] MAPREDUCE-6563. Streaming documentation contains a stray % character.
[jianhe] YARN-4519. Potential deadlock of CapacityScheduler between decrease
------------------------------------------
[...truncated 8853 lines...]
Generating <https://builds.apache.org/job/Hadoop-Common-trunk/ws/hadoop-common-project/hadoop-nfs/target/org/apache/hadoop/oncrpc/class-use/SimpleTcpClientHandler.html...>
Generating <https://builds.apache.org/job/Hadoop-Common-trunk/ws/hadoop-common-project/hadoop-nfs/target/org/apache/hadoop/oncrpc/class-use/SimpleTcpServer.html...>
Generating <https://builds.apache.org/job/Hadoop-Common-trunk/ws/hadoop-common-project/hadoop-nfs/target/org/apache/hadoop/oncrpc/class-use/RpcUtil.html...>
Generating <https://builds.apache.org/job/Hadoop-Common-trunk/ws/hadoop-common-project/hadoop-nfs/target/org/apache/hadoop/oncrpc/class-use/RpcAcceptedReply.html...>
Generating <https://builds.apache.org/job/Hadoop-Common-trunk/ws/hadoop-common-project/hadoop-nfs/target/org/apache/hadoop/oncrpc/class-use/RpcAcceptedReply.AcceptState.html...>
Generating <https://builds.apache.org/job/Hadoop-Common-trunk/ws/hadoop-common-project/hadoop-nfs/target/org/apache/hadoop/oncrpc/security/class-use/Verifier.html...>
Generating <https://builds.apache.org/job/Hadoop-Common-trunk/ws/hadoop-common-project/hadoop-nfs/target/org/apache/hadoop/oncrpc/security/class-use/RpcAuthInfo.html...>
Generating <https://builds.apache.org/job/Hadoop-Common-trunk/ws/hadoop-common-project/hadoop-nfs/target/org/apache/hadoop/oncrpc/security/class-use/RpcAuthInfo.AuthFlavor.html...>
Generating <https://builds.apache.org/job/Hadoop-Common-trunk/ws/hadoop-common-project/hadoop-nfs/target/org/apache/hadoop/oncrpc/security/class-use/SysSecurityHandler.html...>
Generating <https://builds.apache.org/job/Hadoop-Common-trunk/ws/hadoop-common-project/hadoop-nfs/target/org/apache/hadoop/oncrpc/security/class-use/VerifierNone.html...>
Generating <https://builds.apache.org/job/Hadoop-Common-trunk/ws/hadoop-common-project/hadoop-nfs/target/org/apache/hadoop/oncrpc/security/class-use/SecurityHandler.html...>
Generating <https://builds.apache.org/job/Hadoop-Common-trunk/ws/hadoop-common-project/hadoop-nfs/target/org/apache/hadoop/oncrpc/security/class-use/VerifierGSS.html...>
Generating <https://builds.apache.org/job/Hadoop-Common-trunk/ws/hadoop-common-project/hadoop-nfs/target/org/apache/hadoop/oncrpc/security/class-use/CredentialsSys.html...>
Generating <https://builds.apache.org/job/Hadoop-Common-trunk/ws/hadoop-common-project/hadoop-nfs/target/org/apache/hadoop/oncrpc/security/class-use/CredentialsGSS.html...>
Generating <https://builds.apache.org/job/Hadoop-Common-trunk/ws/hadoop-common-project/hadoop-nfs/target/org/apache/hadoop/oncrpc/security/class-use/CredentialsNone.html...>
Generating <https://builds.apache.org/job/Hadoop-Common-trunk/ws/hadoop-common-project/hadoop-nfs/target/org/apache/hadoop/oncrpc/security/class-use/Credentials.html...>
Generating <https://builds.apache.org/job/Hadoop-Common-trunk/ws/hadoop-common-project/hadoop-nfs/target/org/apache/hadoop/mount/class-use/MountdBase.html...>
Generating <https://builds.apache.org/job/Hadoop-Common-trunk/ws/hadoop-common-project/hadoop-nfs/target/org/apache/hadoop/mount/class-use/MountEntry.html...>
Generating <https://builds.apache.org/job/Hadoop-Common-trunk/ws/hadoop-common-project/hadoop-nfs/target/org/apache/hadoop/mount/class-use/MountResponse.html...>
Generating <https://builds.apache.org/job/Hadoop-Common-trunk/ws/hadoop-common-project/hadoop-nfs/target/org/apache/hadoop/mount/class-use/MountInterface.html...>
Generating <https://builds.apache.org/job/Hadoop-Common-trunk/ws/hadoop-common-project/hadoop-nfs/target/org/apache/hadoop/mount/class-use/MountInterface.MNTPROC.html...>
Generating <https://builds.apache.org/job/Hadoop-Common-trunk/ws/hadoop-common-project/hadoop-nfs/target/org/apache/hadoop/nfs/class-use/AccessPrivilege.html...>
Generating <https://builds.apache.org/job/Hadoop-Common-trunk/ws/hadoop-common-project/hadoop-nfs/target/org/apache/hadoop/nfs/class-use/NfsTime.html...>
Generating <https://builds.apache.org/job/Hadoop-Common-trunk/ws/hadoop-common-project/hadoop-nfs/target/org/apache/hadoop/nfs/class-use/NfsFileType.html...>
Generating <https://builds.apache.org/job/Hadoop-Common-trunk/ws/hadoop-common-project/hadoop-nfs/target/org/apache/hadoop/nfs/class-use/NfsExports.html...>
Generating <https://builds.apache.org/job/Hadoop-Common-trunk/ws/hadoop-common-project/hadoop-nfs/target/org/apache/hadoop/nfs/nfs3/request/class-use/READLINK3Request.html...>
Generating <https://builds.apache.org/job/Hadoop-Common-trunk/ws/hadoop-common-project/hadoop-nfs/target/org/apache/hadoop/nfs/nfs3/request/class-use/ACCESS3Request.html...>
Generating <https://builds.apache.org/job/Hadoop-Common-trunk/ws/hadoop-common-project/hadoop-nfs/target/org/apache/hadoop/nfs/nfs3/request/class-use/WRITE3Request.html...>
Generating <https://builds.apache.org/job/Hadoop-Common-trunk/ws/hadoop-common-project/hadoop-nfs/target/org/apache/hadoop/nfs/nfs3/request/class-use/SETATTR3Request.html...>
Generating <https://builds.apache.org/job/Hadoop-Common-trunk/ws/hadoop-common-project/hadoop-nfs/target/org/apache/hadoop/nfs/nfs3/request/class-use/LOOKUP3Request.html...>
Generating <https://builds.apache.org/job/Hadoop-Common-trunk/ws/hadoop-common-project/hadoop-nfs/target/org/apache/hadoop/nfs/nfs3/request/class-use/SetAttr3.html...>
Generating <https://builds.apache.org/job/Hadoop-Common-trunk/ws/hadoop-common-project/hadoop-nfs/target/org/apache/hadoop/nfs/nfs3/request/class-use/SetAttr3.SetAttrField.html...>
Generating <https://builds.apache.org/job/Hadoop-Common-trunk/ws/hadoop-common-project/hadoop-nfs/target/org/apache/hadoop/nfs/nfs3/request/class-use/LINK3Request.html...>
Generating <https://builds.apache.org/job/Hadoop-Common-trunk/ws/hadoop-common-project/hadoop-nfs/target/org/apache/hadoop/nfs/nfs3/request/class-use/RENAME3Request.html...>
Generating <https://builds.apache.org/job/Hadoop-Common-trunk/ws/hadoop-common-project/hadoop-nfs/target/org/apache/hadoop/nfs/nfs3/request/class-use/MKDIR3Request.html...>
Generating <https://builds.apache.org/job/Hadoop-Common-trunk/ws/hadoop-common-project/hadoop-nfs/target/org/apache/hadoop/nfs/nfs3/request/class-use/READ3Request.html...>
Generating <https://builds.apache.org/job/Hadoop-Common-trunk/ws/hadoop-common-project/hadoop-nfs/target/org/apache/hadoop/nfs/nfs3/request/class-use/RequestWithHandle.html...>
Generating <https://builds.apache.org/job/Hadoop-Common-trunk/ws/hadoop-common-project/hadoop-nfs/target/org/apache/hadoop/nfs/nfs3/request/class-use/FSINFO3Request.html...>
Generating <https://builds.apache.org/job/Hadoop-Common-trunk/ws/hadoop-common-project/hadoop-nfs/target/org/apache/hadoop/nfs/nfs3/request/class-use/PATHCONF3Request.html...>
Generating <https://builds.apache.org/job/Hadoop-Common-trunk/ws/hadoop-common-project/hadoop-nfs/target/org/apache/hadoop/nfs/nfs3/request/class-use/SYMLINK3Request.html...>
Generating <https://builds.apache.org/job/Hadoop-Common-trunk/ws/hadoop-common-project/hadoop-nfs/target/org/apache/hadoop/nfs/nfs3/request/class-use/CREATE3Request.html...>
Generating <https://builds.apache.org/job/Hadoop-Common-trunk/ws/hadoop-common-project/hadoop-nfs/target/org/apache/hadoop/nfs/nfs3/request/class-use/GETATTR3Request.html...>
Generating <https://builds.apache.org/job/Hadoop-Common-trunk/ws/hadoop-common-project/hadoop-nfs/target/org/apache/hadoop/nfs/nfs3/request/class-use/NFS3Request.html...>
Generating <https://builds.apache.org/job/Hadoop-Common-trunk/ws/hadoop-common-project/hadoop-nfs/target/org/apache/hadoop/nfs/nfs3/request/class-use/READDIR3Request.html...>
Generating <https://builds.apache.org/job/Hadoop-Common-trunk/ws/hadoop-common-project/hadoop-nfs/target/org/apache/hadoop/nfs/nfs3/request/class-use/REMOVE3Request.html...>
Generating <https://builds.apache.org/job/Hadoop-Common-trunk/ws/hadoop-common-project/hadoop-nfs/target/org/apache/hadoop/nfs/nfs3/request/class-use/COMMIT3Request.html...>
Generating <https://builds.apache.org/job/Hadoop-Common-trunk/ws/hadoop-common-project/hadoop-nfs/target/org/apache/hadoop/nfs/nfs3/request/class-use/FSSTAT3Request.html...>
Generating <https://builds.apache.org/job/Hadoop-Common-trunk/ws/hadoop-common-project/hadoop-nfs/target/org/apache/hadoop/nfs/nfs3/request/class-use/MKNOD3Request.html...>
Generating <https://builds.apache.org/job/Hadoop-Common-trunk/ws/hadoop-common-project/hadoop-nfs/target/org/apache/hadoop/nfs/nfs3/request/class-use/RMDIR3Request.html...>
Generating <https://builds.apache.org/job/Hadoop-Common-trunk/ws/hadoop-common-project/hadoop-nfs/target/org/apache/hadoop/nfs/nfs3/request/class-use/READDIRPLUS3Request.html...>
Generating <https://builds.apache.org/job/Hadoop-Common-trunk/ws/hadoop-common-project/hadoop-nfs/target/org/apache/hadoop/nfs/nfs3/class-use/Nfs3Constant.html...>
Generating <https://builds.apache.org/job/Hadoop-Common-trunk/ws/hadoop-common-project/hadoop-nfs/target/org/apache/hadoop/nfs/nfs3/class-use/Nfs3Constant.NFSPROC3.html...>
Generating <https://builds.apache.org/job/Hadoop-Common-trunk/ws/hadoop-common-project/hadoop-nfs/target/org/apache/hadoop/nfs/nfs3/class-use/Nfs3Constant.WriteStableHow.html...>
Generating <https://builds.apache.org/job/Hadoop-Common-trunk/ws/hadoop-common-project/hadoop-nfs/target/org/apache/hadoop/nfs/nfs3/class-use/Nfs3FileAttributes.html...>
Generating <https://builds.apache.org/job/Hadoop-Common-trunk/ws/hadoop-common-project/hadoop-nfs/target/org/apache/hadoop/nfs/nfs3/class-use/Nfs3FileAttributes.Specdata3.html...>
Generating <https://builds.apache.org/job/Hadoop-Common-trunk/ws/hadoop-common-project/hadoop-nfs/target/org/apache/hadoop/nfs/nfs3/class-use/Nfs3Status.html...>
Generating <https://builds.apache.org/job/Hadoop-Common-trunk/ws/hadoop-common-project/hadoop-nfs/target/org/apache/hadoop/nfs/nfs3/class-use/FileHandle.html...>
Generating <https://builds.apache.org/job/Hadoop-Common-trunk/ws/hadoop-common-project/hadoop-nfs/target/org/apache/hadoop/nfs/nfs3/class-use/Nfs3Base.html...>
Generating <https://builds.apache.org/job/Hadoop-Common-trunk/ws/hadoop-common-project/hadoop-nfs/target/org/apache/hadoop/nfs/nfs3/class-use/Nfs3Interface.html...>
Generating <https://builds.apache.org/job/Hadoop-Common-trunk/ws/hadoop-common-project/hadoop-nfs/target/org/apache/hadoop/nfs/nfs3/response/class-use/WccAttr.html...>
Generating <https://builds.apache.org/job/Hadoop-Common-trunk/ws/hadoop-common-project/hadoop-nfs/target/org/apache/hadoop/nfs/nfs3/response/class-use/WccData.html...>
Generating <https://builds.apache.org/job/Hadoop-Common-trunk/ws/hadoop-common-project/hadoop-nfs/target/org/apache/hadoop/nfs/nfs3/response/class-use/SETATTR3Response.html...>
Generating <https://builds.apache.org/job/Hadoop-Common-trunk/ws/hadoop-common-project/hadoop-nfs/target/org/apache/hadoop/nfs/nfs3/response/class-use/SYMLINK3Response.html...>
Generating <https://builds.apache.org/job/Hadoop-Common-trunk/ws/hadoop-common-project/hadoop-nfs/target/org/apache/hadoop/nfs/nfs3/response/class-use/MKDIR3Response.html...>
Generating <https://builds.apache.org/job/Hadoop-Common-trunk/ws/hadoop-common-project/hadoop-nfs/target/org/apache/hadoop/nfs/nfs3/response/class-use/COMMIT3Response.html...>
Generating <https://builds.apache.org/job/Hadoop-Common-trunk/ws/hadoop-common-project/hadoop-nfs/target/org/apache/hadoop/nfs/nfs3/response/class-use/READDIR3Response.html...>
Generating <https://builds.apache.org/job/Hadoop-Common-trunk/ws/hadoop-common-project/hadoop-nfs/target/org/apache/hadoop/nfs/nfs3/response/class-use/READDIR3Response.Entry3.html...>
Generating <https://builds.apache.org/job/Hadoop-Common-trunk/ws/hadoop-common-project/hadoop-nfs/target/org/apache/hadoop/nfs/nfs3/response/class-use/READDIR3Response.DirList3.html...>
Generating <https://builds.apache.org/job/Hadoop-Common-trunk/ws/hadoop-common-project/hadoop-nfs/target/org/apache/hadoop/nfs/nfs3/response/class-use/FSINFO3Response.html...>
Generating <https://builds.apache.org/job/Hadoop-Common-trunk/ws/hadoop-common-project/hadoop-nfs/target/org/apache/hadoop/nfs/nfs3/response/class-use/FSSTAT3Response.html...>
Generating <https://builds.apache.org/job/Hadoop-Common-trunk/ws/hadoop-common-project/hadoop-nfs/target/org/apache/hadoop/nfs/nfs3/response/class-use/PATHCONF3Response.html...>
Generating <https://builds.apache.org/job/Hadoop-Common-trunk/ws/hadoop-common-project/hadoop-nfs/target/org/apache/hadoop/nfs/nfs3/response/class-use/WRITE3Response.html...>
Generating <https://builds.apache.org/job/Hadoop-Common-trunk/ws/hadoop-common-project/hadoop-nfs/target/org/apache/hadoop/nfs/nfs3/response/class-use/MKNOD3Response.html...>
Generating <https://builds.apache.org/job/Hadoop-Common-trunk/ws/hadoop-common-project/hadoop-nfs/target/org/apache/hadoop/nfs/nfs3/response/class-use/READDIRPLUS3Response.html...>
Generating <https://builds.apache.org/job/Hadoop-Common-trunk/ws/hadoop-common-project/hadoop-nfs/target/org/apache/hadoop/nfs/nfs3/response/class-use/READDIRPLUS3Response.EntryPlus3.html...>
Generating <https://builds.apache.org/job/Hadoop-Common-trunk/ws/hadoop-common-project/hadoop-nfs/target/org/apache/hadoop/nfs/nfs3/response/class-use/READDIRPLUS3Response.DirListPlus3.html...>
Generating <https://builds.apache.org/job/Hadoop-Common-trunk/ws/hadoop-common-project/hadoop-nfs/target/org/apache/hadoop/nfs/nfs3/response/class-use/ACCESS3Response.html...>
Generating <https://builds.apache.org/job/Hadoop-Common-trunk/ws/hadoop-common-project/hadoop-nfs/target/org/apache/hadoop/nfs/nfs3/response/class-use/LINK3Response.html...>
Generating <https://builds.apache.org/job/Hadoop-Common-trunk/ws/hadoop-common-project/hadoop-nfs/target/org/apache/hadoop/nfs/nfs3/response/class-use/READ3Response.html...>
Generating <https://builds.apache.org/job/Hadoop-Common-trunk/ws/hadoop-common-project/hadoop-nfs/target/org/apache/hadoop/nfs/nfs3/response/class-use/CREATE3Response.html...>
Generating <https://builds.apache.org/job/Hadoop-Common-trunk/ws/hadoop-common-project/hadoop-nfs/target/org/apache/hadoop/nfs/nfs3/response/class-use/READLINK3Response.html...>
Generating <https://builds.apache.org/job/Hadoop-Common-trunk/ws/hadoop-common-project/hadoop-nfs/target/org/apache/hadoop/nfs/nfs3/response/class-use/NFS3Response.html...>
Generating <https://builds.apache.org/job/Hadoop-Common-trunk/ws/hadoop-common-project/hadoop-nfs/target/org/apache/hadoop/nfs/nfs3/response/class-use/RMDIR3Response.html...>
Generating <https://builds.apache.org/job/Hadoop-Common-trunk/ws/hadoop-common-project/hadoop-nfs/target/org/apache/hadoop/nfs/nfs3/response/class-use/GETATTR3Response.html...>
Generating <https://builds.apache.org/job/Hadoop-Common-trunk/ws/hadoop-common-project/hadoop-nfs/target/org/apache/hadoop/nfs/nfs3/response/class-use/RENAME3Response.html...>
Generating <https://builds.apache.org/job/Hadoop-Common-trunk/ws/hadoop-common-project/hadoop-nfs/target/org/apache/hadoop/nfs/nfs3/response/class-use/REMOVE3Response.html...>
Generating <https://builds.apache.org/job/Hadoop-Common-trunk/ws/hadoop-common-project/hadoop-nfs/target/org/apache/hadoop/nfs/nfs3/response/class-use/LOOKUP3Response.html...>
Generating <https://builds.apache.org/job/Hadoop-Common-trunk/ws/hadoop-common-project/hadoop-nfs/target/org/apache/hadoop/mount/package-use.html...>
Generating <https://builds.apache.org/job/Hadoop-Common-trunk/ws/hadoop-common-project/hadoop-nfs/target/org/apache/hadoop/nfs/package-use.html...>
Generating <https://builds.apache.org/job/Hadoop-Common-trunk/ws/hadoop-common-project/hadoop-nfs/target/org/apache/hadoop/nfs/nfs3/package-use.html...>
Generating <https://builds.apache.org/job/Hadoop-Common-trunk/ws/hadoop-common-project/hadoop-nfs/target/org/apache/hadoop/nfs/nfs3/request/package-use.html...>
Generating <https://builds.apache.org/job/Hadoop-Common-trunk/ws/hadoop-common-project/hadoop-nfs/target/org/apache/hadoop/nfs/nfs3/response/package-use.html...>
Generating <https://builds.apache.org/job/Hadoop-Common-trunk/ws/hadoop-common-project/hadoop-nfs/target/org/apache/hadoop/oncrpc/package-use.html...>
Generating <https://builds.apache.org/job/Hadoop-Common-trunk/ws/hadoop-common-project/hadoop-nfs/target/org/apache/hadoop/oncrpc/security/package-use.html...>
Generating <https://builds.apache.org/job/Hadoop-Common-trunk/ws/hadoop-common-project/hadoop-nfs/target/org/apache/hadoop/portmap/package-use.html...>
Building index for all the packages and classes...
Generating <https://builds.apache.org/job/Hadoop-Common-trunk/ws/hadoop-common-project/hadoop-nfs/target/overview-tree.html...>
Generating <https://builds.apache.org/job/Hadoop-Common-trunk/ws/hadoop-common-project/hadoop-nfs/target/index-all.html...>
Generating <https://builds.apache.org/job/Hadoop-Common-trunk/ws/hadoop-common-project/hadoop-nfs/target/deprecated-list.html...>
Building index for all classes...
Generating <https://builds.apache.org/job/Hadoop-Common-trunk/ws/hadoop-common-project/hadoop-nfs/target/allclasses-frame.html...>
Generating <https://builds.apache.org/job/Hadoop-Common-trunk/ws/hadoop-common-project/hadoop-nfs/target/allclasses-noframe.html...>
Generating <https://builds.apache.org/job/Hadoop-Common-trunk/ws/hadoop-common-project/hadoop-nfs/target/index.html...>
Generating <https://builds.apache.org/job/Hadoop-Common-trunk/ws/hadoop-common-project/hadoop-nfs/target/overview-summary.html...>
Generating <https://builds.apache.org/job/Hadoop-Common-trunk/ws/hadoop-common-project/hadoop-nfs/target/help-doc.html...>
[INFO] Building jar: <https://builds.apache.org/job/Hadoop-Common-trunk/ws/hadoop-common-project/hadoop-nfs/target/hadoop-nfs-3.0.0-SNAPSHOT-javadoc.jar>
[INFO]
[INFO] --- maven-assembly-plugin:2.4:single (dist) @ hadoop-nfs ---
[INFO] Reading assembly descriptor: ../../hadoop-assemblies/src/main/resources/assemblies/hadoop-nfs-dist.xml
[WARNING] The following patterns were never triggered in this artifact exclusion filter:
o 'org.apache.hadoop:hadoop-common'
o 'org.apache.hadoop:hadoop-hdfs'
o 'org.hsqldb:hsqldb'
[INFO] Copying files to <https://builds.apache.org/job/Hadoop-Common-trunk/ws/hadoop-common-project/hadoop-nfs/target/hadoop-nfs-3.0.0-SNAPSHOT>
[INFO]
[INFO] ------------------------------------------------------------------------
[INFO] Building Apache Hadoop KMS 3.0.0-SNAPSHOT
[INFO] ------------------------------------------------------------------------
[INFO]
[INFO] --- maven-clean-plugin:2.5:clean (default-clean) @ hadoop-kms ---
[INFO] Deleting <https://builds.apache.org/job/Hadoop-Common-trunk/ws/hadoop-common-project/hadoop-kms/target>
[INFO]
[INFO] --- findbugs-maven-plugin:3.0.0:findbugs (default-cli) @ hadoop-kms ---
[INFO]
[INFO] --- maven-checkstyle-plugin:2.15:checkstyle (default-cli) @ hadoop-kms ---
[INFO] There are 45 errors reported by Checkstyle 6.6 with checkstyle/checkstyle.xml ruleset.
[WARNING] Unable to locate Source XRef to link to - DISABLED
[INFO]
[INFO] --- maven-antrun-plugin:1.7:run (create-testdirs) @ hadoop-kms ---
[INFO] Executing tasks
main:
[mkdir] Created dir: <https://builds.apache.org/job/Hadoop-Common-trunk/ws/hadoop-common-project/hadoop-kms/target/test-dir>
[INFO] Executed tasks
[INFO]
[INFO] --- maven-resources-plugin:2.6:resources (default-resources) @ hadoop-kms ---
[INFO] Using 'UTF-8' encoding to copy filtered resources.
[INFO] skip non existing resourceDirectory <https://builds.apache.org/job/Hadoop-Common-trunk/ws/hadoop-common-project/hadoop-kms/src/main/resources>
[INFO]
[INFO] --- maven-compiler-plugin:3.1:compile (default-compile) @ hadoop-kms ---
[INFO] Changes detected - recompiling the module!
[INFO] Compiling 14 source files to <https://builds.apache.org/job/Hadoop-Common-trunk/ws/hadoop-common-project/hadoop-kms/target/classes>
[INFO]
[INFO] --- maven-antrun-plugin:1.7:run (create-web-xmls) @ hadoop-kms ---
[INFO] Executing tasks
main:
[mkdir] Created dir: <https://builds.apache.org/job/Hadoop-Common-trunk/ws/hadoop-common-project/hadoop-kms/target/test-classes/kms-webapp>
[copy] Copying 1 file to <https://builds.apache.org/job/Hadoop-Common-trunk/ws/hadoop-common-project/hadoop-kms/target/test-classes/kms-webapp>
[INFO] Executed tasks
[INFO]
[INFO] --- maven-resources-plugin:2.6:testResources (default-testResources) @ hadoop-kms ---
[INFO] Using 'UTF-8' encoding to copy filtered resources.
[INFO] Copying 3 resources
[INFO]
[INFO] --- maven-compiler-plugin:3.1:testCompile (default-testCompile) @ hadoop-kms ---
[INFO] Changes detected - recompiling the module!
[INFO] Compiling 6 source files to <https://builds.apache.org/job/Hadoop-Common-trunk/ws/hadoop-common-project/hadoop-kms/target/test-classes>
[INFO]
[INFO] --- maven-surefire-plugin:2.17:test (default-test) @ hadoop-kms ---
[WARNING] The parameter forkMode is deprecated since version 2.14. Use forkCount and reuseForks instead.
[INFO] Surefire report directory: <https://builds.apache.org/job/Hadoop-Common-trunk/ws/hadoop-common-project/hadoop-kms/target/surefire-reports>
-------------------------------------------------------
T E S T S
-------------------------------------------------------
-------------------------------------------------------
T E S T S
-------------------------------------------------------
Running org.apache.hadoop.crypto.key.kms.server.TestKMSACLs
Tests run: 3, Failures: 0, Errors: 0, Skipped: 0, Time elapsed: 0.705 sec - in org.apache.hadoop.crypto.key.kms.server.TestKMSACLs
Running org.apache.hadoop.crypto.key.kms.server.TestKMS
Tests run: 21, Failures: 0, Errors: 1, Skipped: 0, Time elapsed: 65.739 sec <<< FAILURE! - in org.apache.hadoop.crypto.key.kms.server.TestKMS
testKMSProvider(org.apache.hadoop.crypto.key.kms.server.TestKMS) Time elapsed: 1.211 sec <<< ERROR!
java.io.IOException: Key k6 already exists in jceks://file@<https://builds.apache.org/job/Hadoop-Common-trunk/ws/hadoop-common-project/hadoop-kms/target/7205161e-559c-47cd-b26c-45340a5a61a1/kms.keystore>
at sun.reflect.GeneratedConstructorAccessor73.newInstance(Unknown Source)
at sun.reflect.DelegatingConstructorAccessorImpl.newInstance(DelegatingConstructorAccessorImpl.java:45)
at java.lang.reflect.Constructor.newInstance(Constructor.java:526)
at org.apache.hadoop.util.HttpExceptionUtils.validateResponse(HttpExceptionUtils.java:157)
at org.apache.hadoop.crypto.key.kms.KMSClientProvider.call(KMSClientProvider.java:549)
at org.apache.hadoop.crypto.key.kms.KMSClientProvider.call(KMSClientProvider.java:507)
at org.apache.hadoop.crypto.key.kms.KMSClientProvider.createKeyInternal(KMSClientProvider.java:675)
at org.apache.hadoop.crypto.key.kms.KMSClientProvider.createKey(KMSClientProvider.java:683)
at org.apache.hadoop.crypto.key.kms.LoadBalancingKMSClientProvider$11.call(LoadBalancingKMSClientProvider.java:272)
at org.apache.hadoop.crypto.key.kms.LoadBalancingKMSClientProvider$11.call(LoadBalancingKMSClientProvider.java:268)
at org.apache.hadoop.crypto.key.kms.LoadBalancingKMSClientProvider.doOp(LoadBalancingKMSClientProvider.java:94)
at org.apache.hadoop.crypto.key.kms.LoadBalancingKMSClientProvider.createKey(LoadBalancingKMSClientProvider.java:268)
at org.apache.hadoop.crypto.key.KeyProviderExtension.createKey(KeyProviderExtension.java:74)
at org.apache.hadoop.crypto.key.kms.server.TestKMS$2.call(TestKMS.java:629)
at org.apache.hadoop.crypto.key.kms.server.TestKMS$2.call(TestKMS.java:398)
at org.apache.hadoop.crypto.key.kms.server.TestKMS.runServer(TestKMS.java:125)
at org.apache.hadoop.crypto.key.kms.server.TestKMS.runServer(TestKMS.java:107)
at org.apache.hadoop.crypto.key.kms.server.TestKMS.testKMSProvider(TestKMS.java:398)
Running org.apache.hadoop.crypto.key.kms.server.TestKeyAuthorizationKeyProvider
Tests run: 3, Failures: 0, Errors: 0, Skipped: 0, Time elapsed: 1.722 sec - in org.apache.hadoop.crypto.key.kms.server.TestKeyAuthorizationKeyProvider
Running org.apache.hadoop.crypto.key.kms.server.TestKMSAudit
Tests run: 2, Failures: 0, Errors: 0, Skipped: 0, Time elapsed: 6.719 sec - in org.apache.hadoop.crypto.key.kms.server.TestKMSAudit
Running org.apache.hadoop.crypto.key.kms.server.TestKMSWithZK
Tests run: 1, Failures: 0, Errors: 0, Skipped: 0, Time elapsed: 5.826 sec - in org.apache.hadoop.crypto.key.kms.server.TestKMSWithZK
Results :
Tests in error:
TestKMS.testKMSProvider:398->runServer:107->runServer:125 ยป IO Key k6 already ...
Tests run: 30, Failures: 0, Errors: 1, Skipped: 0
[INFO] ------------------------------------------------------------------------
[INFO] Reactor Summary:
[INFO]
[INFO] Apache Hadoop Annotations ......................... SUCCESS [ 8.749 s]
[INFO] Apache Hadoop MiniKDC ............................. SUCCESS [ 23.043 s]
[INFO] Apache Hadoop Auth ................................ SUCCESS [04:01 min]
[INFO] Apache Hadoop Auth Examples ....................... SUCCESS [ 4.172 s]
[INFO] Apache Hadoop Common .............................. SUCCESS [29:00 min]
[INFO] Apache Hadoop NFS ................................. SUCCESS [ 14.948 s]
[INFO] Apache Hadoop KMS ................................. FAILURE [01:23 min]
[INFO] Apache Hadoop Common Project ...................... SKIPPED
[INFO] ------------------------------------------------------------------------
[INFO] BUILD FAILURE
[INFO] ------------------------------------------------------------------------
[INFO] Total time: 35:18 min
[INFO] Finished at: 2016-01-29T00:04:17+00:00
[INFO] Final Memory: 103M/811M
[INFO] ------------------------------------------------------------------------
[ERROR] Failed to execute goal org.apache.maven.plugins:maven-surefire-plugin:2.17:test (default-test) on project hadoop-kms: There are test failures.
[ERROR]
[ERROR] Please refer to <https://builds.apache.org/job/Hadoop-Common-trunk/ws/hadoop-common-project/hadoop-kms/target/surefire-reports> for the individual test results.
[ERROR] -> [Help 1]
[ERROR]
[ERROR] To see the full stack trace of the errors, re-run Maven with the -e switch.
[ERROR] Re-run Maven using the -X switch to enable full debug logging.
[ERROR]
[ERROR] For more information about the errors and possible solutions, please read the following articles:
[ERROR] [Help 1] http://cwiki.apache.org/confluence/display/MAVEN/MojoFailureException
[ERROR]
[ERROR] After correcting the problems, you can resume the build with the command
[ERROR] mvn <goals> -rf :hadoop-kms
result: 1
################
# mvn -eaf test -Pclover -DcloverLicenseLocation=/home/jenkins/tools/clover/latest/lib/clover.license
################
Build step 'Execute shell' marked build as failure
Archiving artifacts
Recording test results