You are viewing a plain text version of this content. The canonical link for it is here.
Posted to builds@beam.apache.org by Apache Jenkins Server <je...@builds.apache.org> on 2022/12/09 08:39:42 UTC
Build failed in Jenkins: beam_PostCommit_Go #10664
See <https://ci-beam.apache.org/job/beam_PostCommit_Go/10664/display/redirect?page=changes>
Changes:
[Kenneth Knowles] Turn rawtype checking back on for core Java SDK
------------------------------------------
[...truncated 5.05 KB...]
> Task :buildSrc:spotlessCheck UP-TO-DATE
> Task :buildSrc:pluginUnderTestMetadata
> Task :buildSrc:compileTestJava NO-SOURCE
> Task :buildSrc:compileTestGroovy NO-SOURCE
> Task :buildSrc:processTestResources NO-SOURCE
> Task :buildSrc:testClasses UP-TO-DATE
> Task :buildSrc:test NO-SOURCE
> Task :buildSrc:validatePlugins FROM-CACHE
> Task :buildSrc:check UP-TO-DATE
> Task :buildSrc:build
> Task :model:fn-execution:createCheckerFrameworkManifest
> Task :model:pipeline:createCheckerFrameworkManifest
> Task :model:pipeline:extractIncludeProto
> Task :model:pipeline:extractProto
> Task :model:pipeline:generateProto FROM-CACHE
> Task :model:pipeline:compileJava FROM-CACHE
> Task :model:pipeline:processResources
> Task :model:pipeline:classes
> Task :model:pipeline:jar
> Task :model:fn-execution:extractIncludeProto
> Task :model:fn-execution:extractProto
> Task :model:fn-execution:generateProto FROM-CACHE
> Task :model:fn-execution:compileJava FROM-CACHE
> Task :model:fn-execution:processResources
> Task :model:fn-execution:classes
> Task :model:pipeline:shadowJar FROM-CACHE
> Task :model:fn-execution:shadowJar FROM-CACHE
> Task :model:job-management:createCheckerFrameworkManifest
> Task :model:job-management:extractIncludeProto
> Task :model:job-management:extractProto
> Task :model:job-management:generateProto FROM-CACHE
> Task :model:job-management:compileJava FROM-CACHE
> Task :model:job-management:processResources
> Task :model:job-management:classes
> Task :model:job-management:shadowJar FROM-CACHE
> Task :runners:core-construction-java:createCheckerFrameworkManifest
> Task :sdks:java:core:createCheckerFrameworkManifest
> Task :sdks:java:core:generateAvroProtocol NO-SOURCE
> Task :sdks:java:core:generateAvroJava NO-SOURCE
> Task :sdks:java:core:generateGrammarSource FROM-CACHE
> Task :sdks:java:core:compileJava FROM-CACHE
> Task :sdks:java:core:processResources
> Task :sdks:java:core:classes
> Task :sdks:java:core:shadowJar FROM-CACHE
> Task :sdks:java:fn-execution:createCheckerFrameworkManifest
> Task :sdks:java:fn-execution:compileJava FROM-CACHE
> Task :sdks:java:fn-execution:processResources NO-SOURCE
> Task :sdks:java:fn-execution:classes UP-TO-DATE
> Task :sdks:java:fn-execution:jar
> Task :runners:core-construction-java:compileJava FROM-CACHE
> Task :runners:core-construction-java:processResources NO-SOURCE
> Task :runners:core-construction-java:classes UP-TO-DATE
> Task :runners:core-construction-java:jar
> Task :runners:core-java:createCheckerFrameworkManifest
> Task :runners:core-java:compileJava FROM-CACHE
> Task :runners:core-java:processResources NO-SOURCE
> Task :runners:core-java:classes UP-TO-DATE
> Task :runners:core-java:jar
> Task :runners:google-cloud-dataflow-java:createCheckerFrameworkManifest
> Task :sdks:java:extensions:google-cloud-platform-core:createCheckerFrameworkManifest
> Task :sdks:java:extensions:google-cloud-platform-core:compileJava FROM-CACHE
> Task :sdks:java:extensions:google-cloud-platform-core:processResources NO-SOURCE
> Task :sdks:java:extensions:google-cloud-platform-core:classes UP-TO-DATE
> Task :sdks:java:extensions:google-cloud-platform-core:jar
> Task :runners:java-fn-execution:createCheckerFrameworkManifest
> Task :sdks:java:harness:createCheckerFrameworkManifest
> Task :sdks:java:harness:compileJava FROM-CACHE
> Task :sdks:java:harness:processResources NO-SOURCE
> Task :sdks:java:harness:classes UP-TO-DATE
> Task :sdks:java:harness:jar
> Task :runners:java-fn-execution:compileJava FROM-CACHE
> Task :runners:java-fn-execution:processResources NO-SOURCE
> Task :runners:java-fn-execution:classes UP-TO-DATE
> Task :runners:java-fn-execution:jar
> Task :sdks:java:expansion-service:createCheckerFrameworkManifest
> Task :sdks:java:expansion-service:compileJava FROM-CACHE
> Task :sdks:java:expansion-service:processResources NO-SOURCE
> Task :sdks:java:expansion-service:classes UP-TO-DATE
> Task :sdks:java:expansion-service:jar
> Task :sdks:java:extensions:arrow:createCheckerFrameworkManifest
> Task :sdks:java:extensions:arrow:compileJava FROM-CACHE
> Task :sdks:java:extensions:arrow:processResources NO-SOURCE
> Task :sdks:java:extensions:arrow:classes UP-TO-DATE
> Task :sdks:java:extensions:arrow:jar
> Task :sdks:java:extensions:protobuf:createCheckerFrameworkManifest
> Task :sdks:java:extensions:protobuf:extractIncludeProto
> Task :sdks:java:extensions:protobuf:extractProto
> Task :sdks:java:extensions:protobuf:generateProto NO-SOURCE
> Task :sdks:java:extensions:protobuf:compileJava FROM-CACHE
> Task :sdks:java:extensions:protobuf:processResources NO-SOURCE
> Task :sdks:java:extensions:protobuf:classes UP-TO-DATE
> Task :sdks:java:extensions:protobuf:jar
> Task :sdks:java:io:google-cloud-platform:createCheckerFrameworkManifest
> Task :sdks:java:io:google-cloud-platform:compileJava FROM-CACHE
> Task :sdks:java:io:google-cloud-platform:processResources NO-SOURCE
> Task :sdks:java:io:google-cloud-platform:classes UP-TO-DATE
> Task :sdks:java:io:google-cloud-platform:jar
> Task :sdks:java:io:kafka:createCheckerFrameworkManifest
> Task :sdks:java:io:kafka:compileJava FROM-CACHE
> Task :sdks:java:io:kafka:processResources NO-SOURCE
> Task :sdks:java:io:kafka:classes UP-TO-DATE
> Task :sdks:java:io:kafka:jar
> Task :runners:google-cloud-dataflow-java:compileJava
Note: Some input files use or override a deprecated API.
Note: Recompile with -Xlint:deprecation for details.
Note: Some input files use unchecked or unsafe operations.
Note: Recompile with -Xlint:unchecked for details.
> Task :runners:google-cloud-dataflow-java:processResources
> Task :runners:google-cloud-dataflow-java:classes
> Task :runners:google-cloud-dataflow-java:jar
> Task :runners:google-cloud-dataflow-java:worker:createCheckerFrameworkManifest
> Task :runners:google-cloud-dataflow-java:worker:windmill:createCheckerFrameworkManifest
> Task :runners:google-cloud-dataflow-java:worker:windmill:extractIncludeProto
> Task :runners:google-cloud-dataflow-java:worker:windmill:extractProto
> Task :runners:google-cloud-dataflow-java:worker:windmill:generateProto FROM-CACHE
> Task :runners:google-cloud-dataflow-java:worker:windmill:compileJava FROM-CACHE
> Task :runners:google-cloud-dataflow-java:worker:windmill:processResources
> Task :runners:google-cloud-dataflow-java:worker:windmill:classes
> Task :runners:google-cloud-dataflow-java:worker:windmill:shadowJar FROM-CACHE
> Task :runners:google-cloud-dataflow-java:worker:compileJava
Note: Some input files use or override a deprecated API.
Note: Recompile with -Xlint:deprecation for details.
Note: Some input files use unchecked or unsafe operations.
Note: Recompile with -Xlint:unchecked for details.
> Task :runners:google-cloud-dataflow-java:worker:processResources
> Task :runners:google-cloud-dataflow-java:worker:classes
> Task :runners:google-cloud-dataflow-java:worker:shadowJar
> Task :sdks:go:test:assemble UP-TO-DATE
> Task :sdks:go:test:test UP-TO-DATE
> Task :sdks:go:test:check UP-TO-DATE
> Task :sdks:go:test:build UP-TO-DATE
> Task :goIntegrationTests
$ CURRENT_DIRECTORY=<https://ci-beam.apache.org/job/beam_PostCommit_Go/ws/src/sdks/go/test>
$ TESTS=./test/integration/... ./test/regression
$ RUNNER=portable
$ TIMEOUT=3h
$ SIMULTANEOUS=3
$ GCS_LOCATION=gs://temp-storage-for-end-to-end-tests
$ GCS_SUBFOLDER=test14836
$ PROJECT=apache-beam-testing
$ DATAFLOW_PROJECT=apache-beam-testing
$ REGION=us-central1
$ trap exit_background_processes SIGINT SIGTERM EXIT
$ key=--runner
$ case --runner in
$ RUNNER=dataflow
$ cd <https://ci-beam.apache.org/job/beam_PostCommit_Go/ws/src>
$ test -d sdks/go/test
$ DATAFLOW_WORKER_JAR=<https://ci-beam.apache.org/job/beam_PostCommit_Go/ws/src/runners/google-cloud-dataflow-java/worker/build/libs/beam-runners-google-cloud-dataflow-java-fn-api-worker-2.45.0-SNAPSHOT.jar>
Using Dataflow worker jar: <https://ci-beam.apache.org/job/beam_PostCommit_Go/ws/src/runners/google-cloud-dataflow-java/worker/build/libs/beam-runners-google-cloud-dataflow-java-fn-api-worker-2.45.0-SNAPSHOT.jar>
$ command -v docker
/usr/bin/docker
$ docker -v
Docker version 18.09.4, build d14af54
$ command -v gcloud
/usr/bin/gcloud
$ gcloud --version
Google Cloud SDK 406.0.0
alpha 2022.10.17
beta 2022.10.17
bq 2.0.79
bundled-python3-unix 3.9.12
core 2022.10.17
gcloud-crc32c 1.0.0
gsutil 5.14
$ TMPDIR=/tmp/tmp.BkCU7BF7lw
$ gcloud_ver=406.0.0
$ TAG=20221209-083726
$ CONTAINER=us.gcr.io/apache-beam-testing/jenkins/beam_go_sdk
Using container us.gcr.io/apache-beam-testing/jenkins/beam_go_sdk
$ ./gradlew :sdks:go:container:docker -Pdocker-repository-root=us.gcr.io/apache-beam-testing/jenkins -Pdocker-tag=20221209-083726
Starting a Gradle Daemon, 1 busy Daemon could not be reused, use --status for details
Configuration on demand is an incubating feature.
> Task :buildSrc:compileJava NO-SOURCE
> Task :buildSrc:compileGroovy UP-TO-DATE
> Task :buildSrc:pluginDescriptors UP-TO-DATE
> Task :buildSrc:processResources UP-TO-DATE
> Task :buildSrc:classes UP-TO-DATE
> Task :buildSrc:jar UP-TO-DATE
> Task :buildSrc:assemble UP-TO-DATE
> Task :buildSrc:spotlessGroovy UP-TO-DATE
> Task :buildSrc:spotlessGroovyCheck UP-TO-DATE
> Task :buildSrc:spotlessGroovyGradle UP-TO-DATE
> Task :buildSrc:spotlessGroovyGradleCheck UP-TO-DATE
> Task :buildSrc:spotlessCheck UP-TO-DATE
> Task :buildSrc:pluginUnderTestMetadata UP-TO-DATE
> Task :buildSrc:compileTestJava NO-SOURCE
> Task :buildSrc:compileTestGroovy NO-SOURCE
> Task :buildSrc:processTestResources NO-SOURCE
> Task :buildSrc:testClasses UP-TO-DATE
> Task :buildSrc:test NO-SOURCE
> Task :buildSrc:validatePlugins UP-TO-DATE
> Task :buildSrc:check UP-TO-DATE
> Task :buildSrc:build UP-TO-DATE
System Go installation: /snap/bin/go is go version go1.16.15 linux/amd64; Preparing to use /home/jenkins/go/bin/go1.19.3
go install golang.org/dl/go1.19.3@latest: no matching versions for query "latest"
FAILURE: Build failed with an exception.
* What went wrong:
Could not determine the dependencies of task ':sdks:go:container:goBuild'.
> Could not create task ':sdks:go:container:goPrepare'.
> Process 'command 'sh'' finished with non-zero exit value 1
* Try:
> Run with --stacktrace option to get the stack trace.
> Run with --info or --debug option to get more log output.
* Get more help at https://help.gradle.org
BUILD FAILED in 2m 7s
10 actionable tasks: 10 up-to-date
Publishing build scan...
https://gradle.com/s/y27hftazz47ak
$ ./gradlew :sdks:go:container:docker -Pdocker-repository-root=us.gcr.io/apache-beam-testing/jenkins -Pdocker-tag=20221209-083726
> Task :goIntegrationTests FAILED
FAILURE: Build failed with an exception.
* What went wrong:
Execution failed for task ':goIntegrationTests'.
> Process 'command 'sh'' finished with non-zero exit value 1
* Try:
> Run with --stacktrace option to get the stack trace.
> Run with --info or --debug option to get more log output.
* Get more help at https://help.gradle.org
Deprecated Gradle features were used in this build, making it incompatible with Gradle 8.0.
You can use '--warning-mode all' to show the individual deprecation warnings and determine if they come from your own scripts or plugins.
See https://docs.gradle.org/7.5.1/userguide/command_line_interface.html#sec:command_line_warnings
BUILD FAILED in 5m 14s
88 actionable tasks: 56 executed, 30 from cache, 2 up-to-date
Publishing build scan...
https://gradle.com/s/6r4mmxfrr3gwc
Build step 'Invoke Gradle script' changed build result to FAILURE
Build step 'Invoke Gradle script' marked build as failure
---------------------------------------------------------------------
To unsubscribe, e-mail: builds-unsubscribe@beam.apache.org
For additional commands, e-mail: builds-help@beam.apache.org
Jenkins build is back to normal : beam_PostCommit_Go #10665
Posted by Apache Jenkins Server <je...@builds.apache.org>.
See <https://ci-beam.apache.org/job/beam_PostCommit_Go/10665/display/redirect?page=changes>
---------------------------------------------------------------------
To unsubscribe, e-mail: builds-unsubscribe@beam.apache.org
For additional commands, e-mail: builds-help@beam.apache.org