You are viewing a plain text version of this content. The canonical link for it is here.
Posted to commits@struts.apache.org by ba...@apache.org on 2008/12/18 03:43:56 UTC

[OSS Bamboo] Struts 2 SVN - Main Build (Java 6) build 658 has FAILED (2 tests failed)

-----------------------------------------------------------
STRUTS-MAINJ6-658 failed.
-----------------------------------------------------------
This build occured because it is a dependant of XWORK-MAIN-293.
2/949 tests failed.

http://opensource.bamboo.atlassian.com/browse/STRUTS-MAINJ6-658/        


--------------
Tests
--------------
Failed Tests (2)
   - PackageBasedActionConfigBuilderTest: Action packages (New)
   - PackageBasedActionConfigBuilderTest: Package locators (New)


--------------
Error Summary
--------------
   [INFO] ------------------------------------------------------------------------
   [ERROR] BUILD FAILURE
   [INFO] ------------------------------------------------------------------------
   [INFO] There are test failures.
   [INFO] ------------------------------------------------------------------------
   [INFO] For more information, run Maven with the -e switch


--
This message is automatically generated by Atlassian Bamboo