You are viewing a plain text version of this content. The canonical link for it is here.
Posted to log4j-dev@logging.apache.org by Apache Jenkins Server <je...@builds.apache.org> on 2016/06/11 01:45:15 UTC
Build failed in Jenkins: Log4j 2.x #2015
See <https://builds.apache.org/job/Log4j%202.x/2015/changes>
Changes:
[rpopma] LOG4J2-1422 fix failing test
[rpopma] LOG4J2-1422 fix failing test
------------------------------------------
[...truncated 1733 lines...]
jdk1.7.0_51/jre/lib/zi/Asia/Riyadh
jdk1.7.0_51/jre/lib/zi/Asia/Kamchatka
jdk1.7.0_51/jre/lib/zi/WET
jdk1.7.0_51/jre/lib/zi/PST8PDT
jdk1.7.0_51/jre/lib/images/
jdk1.7.0_51/jre/lib/images/icons/
jdk1.7.0_51/jre/lib/images/icons/sun-java_HighContrast.png
jdk1.7.0_51/jre/lib/images/icons/sun-java_HighContrastInverse.png
jdk1.7.0_51/jre/lib/images/icons/sun-java_LowContrast.png
jdk1.7.0_51/jre/lib/images/icons/sun-java.png
jdk1.7.0_51/jre/lib/images/cursors/
jdk1.7.0_51/jre/lib/images/cursors/motif_MoveDrop32x32.gif
jdk1.7.0_51/jre/lib/images/cursors/cursors.properties
jdk1.7.0_51/jre/lib/images/cursors/motif_MoveNoDrop32x32.gif
jdk1.7.0_51/jre/lib/images/cursors/motif_CopyNoDrop32x32.gif
jdk1.7.0_51/jre/lib/images/cursors/motif_LinkNoDrop32x32.gif
jdk1.7.0_51/jre/lib/images/cursors/motif_LinkDrop32x32.gif
jdk1.7.0_51/jre/lib/images/cursors/invalid32x32.gif
jdk1.7.0_51/jre/lib/images/cursors/motif_CopyDrop32x32.gif
jdk1.7.0_51/jre/lib/jfr.jar
jdk1.7.0_51/jre/lib/jvm.hprof.txt
jdk1.7.0_51/jre/lib/amd64/
jdk1.7.0_51/jre/lib/amd64/libjsoundalsa.so
jdk1.7.0_51/jre/lib/amd64/libkcms.so
jdk1.7.0_51/jre/lib/amd64/libjfxmedia.so
jdk1.7.0_51/jre/lib/amd64/libjpeg.so
jdk1.7.0_51/jre/lib/amd64/libnio.so
jdk1.7.0_51/jre/lib/amd64/libfontmanager.so
jdk1.7.0_51/jre/lib/amd64/libhprof.so
jdk1.7.0_51/jre/lib/amd64/libjsig.so
jdk1.7.0_51/jre/lib/amd64/libinstrument.so
jdk1.7.0_51/jre/lib/amd64/libnet.so
jdk1.7.0_51/jre/lib/amd64/libattach.so
jdk1.7.0_51/jre/lib/amd64/libsaproc.so
jdk1.7.0_51/jre/lib/amd64/jli/
jdk1.7.0_51/jre/lib/amd64/jli/libjli.so
jdk1.7.0_51/jre/lib/amd64/libjfxwebkit.so
jdk1.7.0_51/jre/lib/amd64/libnpt.so
jdk1.7.0_51/jre/lib/amd64/libjavafx-font.so
jdk1.7.0_51/jre/lib/amd64/libawt.so
jdk1.7.0_51/jre/lib/amd64/libprism-es2.so
jdk1.7.0_51/jre/lib/amd64/libsplashscreen.so
jdk1.7.0_51/jre/lib/amd64/libj2pcsc.so
jdk1.7.0_51/jre/lib/amd64/libmlib_image.so
jdk1.7.0_51/jre/lib/amd64/libj2pkcs11.so
jdk1.7.0_51/jre/lib/amd64/libsctp.so
jdk1.7.0_51/jre/lib/amd64/libdt_socket.so
jdk1.7.0_51/jre/lib/amd64/libjavafx-iio.so
jdk1.7.0_51/jre/lib/amd64/libjavaplugin_jni.so
jdk1.7.0_51/jre/lib/amd64/libgstplugins-lite.so
jdk1.7.0_51/jre/lib/amd64/libsunec.so
jdk1.7.0_51/jre/lib/amd64/libnpjp2.so
jdk1.7.0_51/jre/lib/amd64/libdeploy.so
jdk1.7.0_51/jre/lib/amd64/libjava_crw_demo.so
jdk1.7.0_51/jre/lib/amd64/libunpack.so
jdk1.7.0_51/jre/lib/amd64/libjfr.so
jdk1.7.0_51/jre/lib/amd64/libj2gss.so
jdk1.7.0_51/jre/lib/amd64/libt2k.so
jdk1.7.0_51/jre/lib/amd64/libverify.so
jdk1.7.0_51/jre/lib/amd64/libdcpr.so
jdk1.7.0_51/jre/lib/amd64/libjava.so
jdk1.7.0_51/jre/lib/amd64/libJdbcOdbc.so
jdk1.7.0_51/jre/lib/amd64/fxavcodecplugin-52.so
jdk1.7.0_51/jre/lib/amd64/server/
jdk1.7.0_51/jre/lib/amd64/server/libjsig.so
jdk1.7.0_51/jre/lib/amd64/server/Xusage.txt
jdk1.7.0_51/jre/lib/amd64/server/libjvm.so
jdk1.7.0_51/jre/lib/amd64/fxplugins.so
jdk1.7.0_51/jre/lib/amd64/xawt/
jdk1.7.0_51/jre/lib/amd64/xawt/libmawt.so
jdk1.7.0_51/jre/lib/amd64/fxavcodecplugin-53.so
jdk1.7.0_51/jre/lib/amd64/libjaas_unix.so
jdk1.7.0_51/jre/lib/amd64/libgstreamer-lite.so
jdk1.7.0_51/jre/lib/amd64/libmanagement.so
jdk1.7.0_51/jre/lib/amd64/jvm.cfg
jdk1.7.0_51/jre/lib/amd64/libjsdt.so
jdk1.7.0_51/jre/lib/amd64/libzip.so
jdk1.7.0_51/jre/lib/amd64/libglass.so
jdk1.7.0_51/jre/lib/amd64/headless/
jdk1.7.0_51/jre/lib/amd64/headless/libmawt.so
jdk1.7.0_51/jre/lib/amd64/libjsound.so
jdk1.7.0_51/jre/lib/amd64/libjdwp.so
jdk1.7.0_51/jre/lib/amd64/libjawt.so
jdk1.7.0_51/jre/lib/fontconfig.SuSE.10.bfc
jdk1.7.0_51/jre/lib/classlist
jdk1.7.0_51/jre/lib/management-agent.jar
jdk1.7.0_51/jre/lib/javaws.jar
jdk1.7.0_51/jre/lib/psfontj2d.properties
jdk1.7.0_51/jre/lib/rt.jar
jdk1.7.0_51/jre/lib/calendars.properties
jdk1.7.0_51/jre/lib/security/
jdk1.7.0_51/jre/lib/security/local_policy.jar
jdk1.7.0_51/jre/lib/security/trusted.libraries
jdk1.7.0_51/jre/lib/security/javafx.policy
jdk1.7.0_51/jre/lib/security/cacerts
jdk1.7.0_51/jre/lib/security/java.policy
jdk1.7.0_51/jre/lib/security/US_export_policy.jar
jdk1.7.0_51/jre/lib/security/java.security
jdk1.7.0_51/jre/lib/security/blacklist
jdk1.7.0_51/jre/lib/security/javaws.policy
jdk1.7.0_51/jre/lib/jfxrt.jar
jdk1.7.0_51/jre/lib/fontconfig.Turbo.properties.src
jdk1.7.0_51/jre/lib/jfr/
jdk1.7.0_51/jre/lib/jfr/profile.jfc
jdk1.7.0_51/jre/lib/jfr/default.jfc
jdk1.7.0_51/jre/lib/fontconfig.RedHat.5.properties.src
jdk1.7.0_51/jre/lib/net.properties
jdk1.7.0_51/jre/lib/content-types.properties
jdk1.7.0_51/jre/lib/fontconfig.RedHat.5.bfc
jdk1.7.0_51/jre/lib/alt-rt.jar
jdk1.7.0_51/jre/lib/logging.properties
jdk1.7.0_51/jre/lib/applet/
jdk1.7.0_51/jre/lib/cmm/
jdk1.7.0_51/jre/lib/cmm/LINEAR_RGB.pf
jdk1.7.0_51/jre/lib/cmm/GRAY.pf
jdk1.7.0_51/jre/lib/cmm/sRGB.pf
jdk1.7.0_51/jre/lib/cmm/PYCC.pf
jdk1.7.0_51/jre/lib/cmm/CIEXYZ.pf
jdk1.7.0_51/jre/lib/locale/
jdk1.7.0_51/jre/lib/locale/zh_TW.BIG5/
jdk1.7.0_51/jre/lib/locale/zh_TW.BIG5/LC_MESSAGES/
jdk1.7.0_51/jre/lib/locale/zh_TW.BIG5/LC_MESSAGES/sunw_java_plugin.mo
jdk1.7.0_51/jre/lib/locale/pt_BR/
jdk1.7.0_51/jre/lib/locale/pt_BR/LC_MESSAGES/
jdk1.7.0_51/jre/lib/locale/pt_BR/LC_MESSAGES/sunw_java_plugin.mo
jdk1.7.0_51/jre/lib/locale/de/
jdk1.7.0_51/jre/lib/locale/de/LC_MESSAGES/
jdk1.7.0_51/jre/lib/locale/de/LC_MESSAGES/sunw_java_plugin.mo
jdk1.7.0_51/jre/lib/locale/it/
jdk1.7.0_51/jre/lib/locale/it/LC_MESSAGES/
jdk1.7.0_51/jre/lib/locale/it/LC_MESSAGES/sunw_java_plugin.mo
jdk1.7.0_51/jre/lib/locale/zh_TW/
jdk1.7.0_51/jre/lib/locale/zh_TW/LC_MESSAGES/
jdk1.7.0_51/jre/lib/locale/zh_TW/LC_MESSAGES/sunw_java_plugin.mo
jdk1.7.0_51/jre/lib/locale/zh/
jdk1.7.0_51/jre/lib/locale/zh/LC_MESSAGES/
jdk1.7.0_51/jre/lib/locale/zh/LC_MESSAGES/sunw_java_plugin.mo
jdk1.7.0_51/jre/lib/locale/ja/
jdk1.7.0_51/jre/lib/locale/ja/LC_MESSAGES/
jdk1.7.0_51/jre/lib/locale/ja/LC_MESSAGES/sunw_java_plugin.mo
jdk1.7.0_51/jre/lib/locale/fr/
jdk1.7.0_51/jre/lib/locale/fr/LC_MESSAGES/
jdk1.7.0_51/jre/lib/locale/fr/LC_MESSAGES/sunw_java_plugin.mo
jdk1.7.0_51/jre/lib/locale/ko/
jdk1.7.0_51/jre/lib/locale/ko/LC_MESSAGES/
jdk1.7.0_51/jre/lib/locale/ko/LC_MESSAGES/sunw_java_plugin.mo
jdk1.7.0_51/jre/lib/locale/ko.UTF-8/
jdk1.7.0_51/jre/lib/locale/ko.UTF-8/LC_MESSAGES/
jdk1.7.0_51/jre/lib/locale/ko.UTF-8/LC_MESSAGES/sunw_java_plugin.mo
jdk1.7.0_51/jre/lib/locale/zh.GBK/
jdk1.7.0_51/jre/lib/locale/zh.GBK/LC_MESSAGES/
jdk1.7.0_51/jre/lib/locale/zh.GBK/LC_MESSAGES/sunw_java_plugin.mo
jdk1.7.0_51/jre/lib/locale/sv/
jdk1.7.0_51/jre/lib/locale/sv/LC_MESSAGES/
jdk1.7.0_51/jre/lib/locale/sv/LC_MESSAGES/sunw_java_plugin.mo
jdk1.7.0_51/jre/lib/locale/zh_HK.BIG5HK/
jdk1.7.0_51/jre/lib/locale/zh_HK.BIG5HK/LC_MESSAGES/
jdk1.7.0_51/jre/lib/locale/zh_HK.BIG5HK/LC_MESSAGES/sunw_java_plugin.mo
jdk1.7.0_51/jre/lib/locale/es/
jdk1.7.0_51/jre/lib/locale/es/LC_MESSAGES/
jdk1.7.0_51/jre/lib/locale/es/LC_MESSAGES/sunw_java_plugin.mo
jdk1.7.0_51/jre/lib/fonts/
jdk1.7.0_51/jre/lib/fonts/LucidaBrightDemiBold.ttf
jdk1.7.0_51/jre/lib/fonts/LucidaBrightItalic.ttf
jdk1.7.0_51/jre/lib/fonts/LucidaSansDemiBold.ttf
jdk1.7.0_51/jre/lib/fonts/LucidaTypewriterRegular.ttf
jdk1.7.0_51/jre/lib/fonts/LucidaBrightDemiItalic.ttf
jdk1.7.0_51/jre/lib/fonts/LucidaTypewriterBold.ttf
jdk1.7.0_51/jre/lib/fonts/LucidaSansRegular.ttf
jdk1.7.0_51/jre/lib/fonts/fonts.dir
jdk1.7.0_51/jre/lib/fonts/LucidaBrightRegular.ttf
jdk1.7.0_51/jre/lib/ext/
jdk1.7.0_51/jre/lib/ext/sunjce_provider.jar
jdk1.7.0_51/jre/lib/ext/meta-index
jdk1.7.0_51/jre/lib/ext/zipfs.jar
jdk1.7.0_51/jre/lib/ext/sunpkcs11.jar
jdk1.7.0_51/jre/lib/ext/dnsns.jar
jdk1.7.0_51/jre/lib/ext/localedata.jar
jdk1.7.0_51/jre/lib/ext/sunec.jar
jdk1.7.0_51/jre/lib/fontconfig.Turbo.bfc
jdk1.7.0_51/jre/lib/fontconfig.properties.src
jdk1.7.0_51/jre/lib/jce.jar
jdk1.7.0_51/jre/lib/fontconfig.RedHat.6.bfc
jdk1.7.0_51/jre/lib/currency.data
jdk1.7.0_51/jre/lib/javafx.properties
jdk1.7.0_51/jre/THIRDPARTYLICENSEREADME.txt
jdk1.7.0_51/jre/Welcome.html
jdk1.7.0_51/jre/LICENSE
jdk1.7.0_51/jre/plugin/
jdk1.7.0_51/jre/plugin/desktop/
jdk1.7.0_51/jre/plugin/desktop/sun_java.png
jdk1.7.0_51/jre/plugin/desktop/sun_java.desktop
jdk1.7.0_51/jre/COPYRIGHT
jdk1.7.0_51/jre/THIRDPARTYLICENSEREADME-JAVAFX.txt
jdk1.7.0_51/LICENSE
jdk1.7.0_51/COPYRIGHT
jdk1.7.0_51/THIRDPARTYLICENSEREADME-JAVAFX.txt
Building remotely on ubuntu-4 (docker Ubuntu ubuntu4 ubuntu yahoo-not-h2) in workspace <https://builds.apache.org/job/Log4j%202.x/ws/>
Unpacking https://repo.maven.apache.org/maven2/org/apache/maven/apache-maven/3.2.1/apache-maven-3.2.1-bin.zip to /home/jenkins/jenkins-slave/tools/hudson.tasks.Maven_MavenInstallation/maven-3.2.1 on ubuntu-4
Cloning the remote Git repository
Cloning repository https://git-wip-us.apache.org/repos/asf/logging-log4j2.git
> git init <https://builds.apache.org/job/Log4j%202.x/ws/> # timeout=10
Fetching upstream changes from https://git-wip-us.apache.org/repos/asf/logging-log4j2.git
> git --version # timeout=10
> git -c core.askpass=true fetch --tags --progress https://git-wip-us.apache.org/repos/asf/logging-log4j2.git +refs/heads/*:refs/remotes/origin/*
> git config remote.origin.url https://git-wip-us.apache.org/repos/asf/logging-log4j2.git # timeout=10
> git config --add remote.origin.fetch +refs/heads/*:refs/remotes/origin/* # timeout=10
> git config remote.origin.url https://git-wip-us.apache.org/repos/asf/logging-log4j2.git # timeout=10
Fetching upstream changes from https://git-wip-us.apache.org/repos/asf/logging-log4j2.git
> git -c core.askpass=true fetch --tags --progress https://git-wip-us.apache.org/repos/asf/logging-log4j2.git +refs/heads/*:refs/remotes/origin/*
> git rev-parse refs/remotes/origin/master^{commit} # timeout=10
> git rev-parse refs/remotes/origin/origin/master^{commit} # timeout=10
Checking out Revision 19969af097594c6682ee252f815bc4d1932a2362 (refs/remotes/origin/master)
> git config core.sparsecheckout # timeout=10
> git checkout -f 19969af097594c6682ee252f815bc4d1932a2362
> git rev-list 1406abb105568d3679310f191e238008a5da5fcb # timeout=10
[EnvInject] - Executing scripts and injecting environment variables after the SCM step.
[EnvInject] - Injecting as environment variables the properties content
LANG=en_US.UTF-8
[EnvInject] - Variables injected successfully.
Parsing POMs
Downloaded artifact http://repo.maven.apache.org/maven2/org/apache/apache/9/apache-9.pom
Modules changed, recalculating dependency graph
Established TCP socket on 59430
Copied maven32-agent.jar
Copied maven32-interceptor.jar
maven3-interceptor-commons.jar already up to date
[Log4j 2.x] $ /home/jenkins/jenkins-slave/tools/hudson.model.JDK/jdk-1.7u51/bin/java -Xmx2g -Xms256m -XX:MaxPermSize=512m -cp /home/jenkins/jenkins-slave/maven32-agent.jar:/home/jenkins/jenkins-slave/tools/hudson.tasks.Maven_MavenInstallation/maven-3.2.1/boot/plexus-classworlds-2.5.1.jar:/home/jenkins/jenkins-slave/tools/hudson.tasks.Maven_MavenInstallation/maven-3.2.1/conf/logging jenkins.maven3.agent.Maven32Main /home/jenkins/jenkins-slave/tools/hudson.tasks.Maven_MavenInstallation/maven-3.2.1 /home/jenkins/jenkins-slave/slave.jar /home/jenkins/jenkins-slave/maven32-interceptor.jar /home/jenkins/jenkins-slave/maven3-interceptor-commons.jar 59430
Exception in thread "main" java.lang.ClassNotFoundException: hudson.remoting.Launcher
at org.codehaus.plexus.classworlds.strategy.SelfFirstStrategy.loadClass(SelfFirstStrategy.java:50)
at org.codehaus.plexus.classworlds.realm.ClassRealm.unsynchronizedLoadClass(ClassRealm.java:259)
at org.codehaus.plexus.classworlds.realm.ClassRealm.loadClass(ClassRealm.java:235)
at org.codehaus.plexus.classworlds.realm.ClassRealm.loadClass(ClassRealm.java:227)
at jenkins.maven3.agent.Maven32Main.main(Maven32Main.java:143)
at jenkins.maven3.agent.Maven32Main.main(Maven32Main.java:74)
ERROR: Failed to parse POMs
java.io.EOFException: unexpected stream termination
at hudson.remoting.ChannelBuilder.negotiate(ChannelBuilder.java:365)
at hudson.remoting.ChannelBuilder.build(ChannelBuilder.java:310)
at hudson.slaves.Channels.forProcess(Channels.java:115)
at hudson.maven.AbstractMavenProcessFactory.newProcess(AbstractMavenProcessFactory.java:297)
at hudson.maven.ProcessCache.get(ProcessCache.java:236)
at hudson.maven.MavenModuleSetBuild$MavenModuleSetBuildExecution.doRun(MavenModuleSetBuild.java:778)
at hudson.model.AbstractBuild$AbstractBuildExecution.run(AbstractBuild.java:534)
at hudson.model.Run.execute(Run.java:1738)
at hudson.maven.MavenModuleSetBuild.run(MavenModuleSetBuild.java:531)
at hudson.model.ResourceController.execute(ResourceController.java:98)
at hudson.model.Executor.run(Executor.java:410)
---------------------------------------------------------------------
To unsubscribe, e-mail: log4j-dev-unsubscribe@logging.apache.org
For additional commands, e-mail: log4j-dev-help@logging.apache.org
Jenkins build is back to normal : Log4j 2.x #2025
Posted by Apache Jenkins Server <je...@builds.apache.org>.
See <https://builds.apache.org/job/Log4j%202.x/2025/changes>
---------------------------------------------------------------------
To unsubscribe, e-mail: log4j-dev-unsubscribe@logging.apache.org
For additional commands, e-mail: log4j-dev-help@logging.apache.org
Re: Build failed in Jenkins: Log4j 2.x #2024
Posted by Remko Popma <re...@gmail.com>.
Oh dang, it is the size check
Stacktrace
java.lang.AssertionError: Expected size: 35674 Size of onStartup-06-12-2016-1.log: 35574 at org.apache.logging.log4j.core.appender.rolling.RollingAppenderOnStartupTest.afterClass(RollingAppenderOnStartupTest.java:99)
Sent from my iPhone
> On 2016/06/12, at 22:15, Apache Jenkins Server <je...@builds.apache.org> wrote:
>
> See <https://builds.apache.org/job/Log4j%202.x/2024/changes>
>
> Changes:
>
> [mikael] Update Javadoc and changes.xml
>
> ------------------------------------------
> [...truncated 24271 lines...]
> Running org.apache.logging.log4j.jul.CallerInformationTest
> Tests run: 2, Failures: 0, Errors: 0, Skipped: 0, Time elapsed: 1.174 sec - in org.apache.logging.log4j.jul.CallerInformationTest
> Running org.apache.logging.log4j.jul.BracketInNotInterpolatedMessageTest
> Tests run: 1, Failures: 0, Errors: 0, Skipped: 0, Time elapsed: 1.032 sec - in org.apache.logging.log4j.jul.BracketInNotInterpolatedMessageTest
> Running org.apache.logging.log4j.jul.ApiLoggerTest
> Tests run: 19, Failures: 0, Errors: 0, Skipped: 0, Time elapsed: 1.225 sec - in org.apache.logging.log4j.jul.ApiLoggerTest
> Running org.apache.logging.log4j.jul.DefaultLevelConverterTest
> Tests run: 1, Failures: 0, Errors: 0, Skipped: 0, Time elapsed: 0.157 sec - in org.apache.logging.log4j.jul.DefaultLevelConverterTest
>
> Results :
>
> Tests run: 77, Failures: 0, Errors: 0, Skipped: 0
>
> [JENKINS] Recording test results
> [INFO]
> [INFO] --- maven-jar-plugin:2.3.1:jar (default-jar) @ log4j-jul ---
> [INFO] Building jar: <https://builds.apache.org/job/Log4j%202.x/ws/log4j-jul/target/log4j-jul-2.6.2-SNAPSHOT.jar>
> [INFO]
> [INFO] --- maven-failsafe-plugin:2.19.1:integration-test (integration-tests) @ log4j-jul ---
> [JENKINS] Recording test results
> [INFO]
> [INFO] --- maven-failsafe-plugin:2.19.1:verify (verify) @ log4j-jul ---
> [JENKINS] Recording test results[INFO]
> [INFO] --- maven-source-plugin:3.0.0:jar-no-fork (attach-sources) @ log4j-jul ---
> [INFO] Building jar: <https://builds.apache.org/job/Log4j%202.x/ws/log4j-jul/target/log4j-jul-2.6.2-SNAPSHOT-sources.jar>
>
> [INFO]
> [INFO] --- maven-install-plugin:2.3.1:install (default-install) @ log4j-jul ---
> [INFO] Installing <https://builds.apache.org/job/Log4j%202.x/ws/log4j-jul/target/log4j-jul-2.6.2-SNAPSHOT.jar> to /home/jenkins/jenkins-slave/maven-repositories/0/org/apache/logging/log4j/log4j-jul/2.6.2-SNAPSHOT/log4j-jul-2.6.2-SNAPSHOT.jar
> [INFO] Installing <https://builds.apache.org/job/Log4j%202.x/ws/log4j-jul/pom.xml> to /home/jenkins/jenkins-slave/maven-repositories/0/org/apache/logging/log4j/log4j-jul/2.6.2-SNAPSHOT/log4j-jul-2.6.2-SNAPSHOT.pom
> [INFO] Installing <https://builds.apache.org/job/Log4j%202.x/ws/log4j-jul/target/log4j-jul-2.6.2-SNAPSHOT-sources.jar> to /home/jenkins/jenkins-slave/maven-repositories/0/org/apache/logging/log4j/log4j-jul/2.6.2-SNAPSHOT/log4j-jul-2.6.2-SNAPSHOT-sources.jar
> [INFO]
> [INFO] ------------------------------------------------------------------------
> [INFO] Building Apache Log4j Liquibase Binding 2.6.2-SNAPSHOT
> [INFO] ------------------------------------------------------------------------
> [INFO]
> [INFO] --- maven-clean-plugin:2.4.1:clean (default-clean) @ log4j-liquibase ---
> [INFO] Deleting <https://builds.apache.org/job/Log4j%202.x/ws/log4j-liquibase/target>
> [INFO]
> [INFO] --- maven-remote-resources-plugin:1.1:process (default) @ log4j-liquibase ---
> [INFO]
> [INFO] --- maven-resources-plugin:2.7:resources (default-resources) @ log4j-liquibase ---
> [INFO] Using 'UTF-8' encoding to copy filtered resources.
> [INFO] skip non existing resourceDirectory <https://builds.apache.org/job/Log4j%202.x/ws/log4j-liquibase/src/main/resources>
> [INFO] Copying 3 resources
> [INFO]
> [INFO] --- maven-compiler-plugin:3.5.1:compile (default-compile) @ log4j-liquibase ---
> [INFO] Changes detected - recompiling the module!
> [INFO] Compiling 1 source file to <https://builds.apache.org/job/Log4j%202.x/ws/log4j-liquibase/target/classes>
> [INFO]
> [INFO] --- maven-bundle-plugin:2.5.3:manifest (default) @ log4j-liquibase ---
> [INFO]
> [INFO] --- maven-resources-plugin:2.7:testResources (default-testResources) @ log4j-liquibase ---
> [INFO] Using 'UTF-8' encoding to copy filtered resources.
> [INFO] Copying 1 resource
> [INFO] Copying 3 resources
> [INFO]
> [INFO] --- maven-compiler-plugin:3.5.1:testCompile (default-testCompile) @ log4j-liquibase ---
> [INFO] Changes detected - recompiling the module!
> [INFO] Compiling 1 source file to <https://builds.apache.org/job/Log4j%202.x/ws/log4j-liquibase/target/test-classes>
> [INFO]
> [INFO] --- maven-surefire-plugin:2.19.1:test (default-test) @ log4j-liquibase ---
> [JENKINS] Recording test results[INFO]
> [INFO] --- maven-surefire-plugin:2.19.1:test (default-tests) @ log4j-liquibase ---
>
> -------------------------------------------------------
> T E S T S
> -------------------------------------------------------
>
> Running liquibase.ext.logging.log4j2.LoggingTest
> Tests run: 5, Failures: 0, Errors: 0, Skipped: 0, Time elapsed: 0.922 sec - in liquibase.ext.logging.log4j2.LoggingTest
>
> Results :
>
> Tests run: 5, Failures: 0, Errors: 0, Skipped: 0
>
> [JENKINS] Recording test results
> [INFO]
> [INFO] --- maven-surefire-plugin:2.19.1:test (test-optional) @ log4j-liquibase ---
> [JENKINS] Recording test results
> [INFO]
> [INFO] --- maven-jar-plugin:2.3.1:jar (default-jar) @ log4j-liquibase ---
> [INFO] Building jar: <https://builds.apache.org/job/Log4j%202.x/ws/log4j-liquibase/target/log4j-liquibase-2.6.2-SNAPSHOT.jar>
> [INFO]
> [INFO] --- maven-failsafe-plugin:2.19.1:integration-test (integration-tests) @ log4j-liquibase ---
> [JENKINS] Recording test results
> [INFO]
> [INFO] --- maven-failsafe-plugin:2.19.1:verify (verify) @ log4j-liquibase ---
> [JENKINS] Recording test results[INFO]
> [INFO] --- maven-source-plugin:3.0.0:jar-no-fork (attach-sources) @ log4j-liquibase ---
>
> [INFO] Building jar: <https://builds.apache.org/job/Log4j%202.x/ws/log4j-liquibase/target/log4j-liquibase-2.6.2-SNAPSHOT-sources.jar>
> [INFO]
> [INFO] --- maven-install-plugin:2.3.1:install (default-install) @ log4j-liquibase ---
> [INFO] Installing <https://builds.apache.org/job/Log4j%202.x/ws/log4j-liquibase/target/log4j-liquibase-2.6.2-SNAPSHOT.jar> to /home/jenkins/jenkins-slave/maven-repositories/0/org/apache/logging/log4j/log4j-liquibase/2.6.2-SNAPSHOT/log4j-liquibase-2.6.2-SNAPSHOT.jar
> [INFO] Installing <https://builds.apache.org/job/Log4j%202.x/ws/log4j-liquibase/pom.xml> to /home/jenkins/jenkins-slave/maven-repositories/0/org/apache/logging/log4j/log4j-liquibase/2.6.2-SNAPSHOT/log4j-liquibase-2.6.2-SNAPSHOT.pom
> [INFO] Installing <https://builds.apache.org/job/Log4j%202.x/ws/log4j-liquibase/target/log4j-liquibase-2.6.2-SNAPSHOT-sources.jar> to /home/jenkins/jenkins-slave/maven-repositories/0/org/apache/logging/log4j/log4j-liquibase/2.6.2-SNAPSHOT/log4j-liquibase-2.6.2-SNAPSHOT-sources.jar
> [INFO] ------------------------------------------------------------------------
> [INFO] Reactor Summary:
> [INFO]
> [INFO] Apache Log4j 2 .................................... SUCCESS [ 9.953 s]
> [INFO] Apache Log4j API .................................. SUCCESS [ 20.960 s]
> [INFO] Apache Log4j Core ................................. SUCCESS [15:35 min]
> [INFO] Apache Log4j 1.x Compatibility API ................ SUCCESS [ 12.626 s]
> [INFO] Apache Log4j SLF4J Binding ........................ SUCCESS [ 9.312 s]
> [INFO] Apache Log4j to SLF4J Adapter ..................... SUCCESS [ 6.616 s]
> [INFO] Apache Log4j Commons Logging Bridge ............... SUCCESS [ 5.648 s]
> [INFO] Apache Log4j Flume Bridge ......................... SUCCESS [03:39 min]
> [INFO] Apache Log4j Web .................................. SUCCESS [ 8.036 s]
> [INFO] Apache Log4j Tag Library .......................... SUCCESS [ 19.175 s]
> [INFO] Apache Log4j JMX GUI .............................. SUCCESS [ 2.698 s]
> [INFO] Apache Log4j Samples .............................. SUCCESS [ 0.834 s]
> [INFO] Apache Log4j Samples: Flume - Common .............. SUCCESS [ 6.574 s]
> [INFO] Apache Log4j Samples: Flume - Remote .............. SUCCESS [ 3.935 s]
> [INFO] Apache Log4j Samples: Flume - Embedded ............ SUCCESS [ 6.091 s]
> [INFO] Apache Log4j Samples: Configuration ............... SUCCESS [ 3.919 s]
> [INFO] Apache Log4j Samples: LoggerProperties ............ SUCCESS [ 4.285 s]
> [INFO] Apache Log4j BOM .................................. SUCCESS [ 0.608 s]
> [INFO] Apache Log4j NoSQL ................................ SUCCESS [ 6.394 s]
> [INFO] Apache Log4J Performance Tests .................... SUCCESS [ 28.760 s]
> [INFO] Apache Log4j Streaming Interface .................. SUCCESS [ 8.797 s]
> [INFO] Apache Log4j JUL Adapter .......................... SUCCESS [ 17.819 s]
> [INFO] Apache Log4j Liquibase Binding .................... SUCCESS [ 6.297 s]
> [INFO] ------------------------------------------------------------------------
> [INFO] BUILD SUCCESS
> [INFO] ------------------------------------------------------------------------
> [INFO] Total time: 22:51 min
> [INFO] Finished at: 2016-06-12T13:12:11+00:00
> [INFO] Final Memory: 47M/944M
> [INFO] ------------------------------------------------------------------------
> Waiting for Jenkins to finish collecting data
> [JENKINS] Archiving <https://builds.apache.org/job/Log4j%202.x/ws/log4j-taglib/pom.xml> to org.apache.logging.log4j/log4j-taglib/2.6.2-SNAPSHOT/log4j-taglib-2.6.2-SNAPSHOT.pom
> [JENKINS] Archiving <https://builds.apache.org/job/Log4j%202.x/ws/log4j-taglib/target/log4j-taglib-2.6.2-SNAPSHOT.jar> to org.apache.logging.log4j/log4j-taglib/2.6.2-SNAPSHOT/log4j-taglib-2.6.2-SNAPSHOT.jar
> [JENKINS] Archiving <https://builds.apache.org/job/Log4j%202.x/ws/log4j-taglib/target/log4j-taglib-2.6.2-SNAPSHOT-sources.jar> to org.apache.logging.log4j/log4j-taglib/2.6.2-SNAPSHOT/log4j-taglib-2.6.2-SNAPSHOT-sources.jar
> [JENKINS] Archiving <https://builds.apache.org/job/Log4j%202.x/ws/log4j-1.2-api/pom.xml> to org.apache.logging.log4j/log4j-1.2-api/2.6.2-SNAPSHOT/log4j-1.2-api-2.6.2-SNAPSHOT.pom
> [JENKINS] Archiving <https://builds.apache.org/job/Log4j%202.x/ws/log4j-1.2-api/target/log4j-1.2-api-2.6.2-SNAPSHOT.jar> to org.apache.logging.log4j/log4j-1.2-api/2.6.2-SNAPSHOT/log4j-1.2-api-2.6.2-SNAPSHOT.jar
> [JENKINS] Archiving <https://builds.apache.org/job/Log4j%202.x/ws/log4j-1.2-api/target/log4j-1.2-api-2.6.2-SNAPSHOT-sources.jar> to org.apache.logging.log4j/log4j-1.2-api/2.6.2-SNAPSHOT/log4j-1.2-api-2.6.2-SNAPSHOT-sources.jar
> [JENKINS] Archiving <https://builds.apache.org/job/Log4j%202.x/ws/log4j-samples/loggerProperties/pom.xml> to org.apache.logging.log4j.samples/log4j-samples-loggerProperties/2.6.2-SNAPSHOT/log4j-samples-loggerProperties-2.6.2-SNAPSHOT.pom
> [JENKINS] Archiving <https://builds.apache.org/job/Log4j%202.x/ws/log4j-samples/loggerProperties/target/log4j-samples-loggerProperties-2.6.2-SNAPSHOT.jar> to org.apache.logging.log4j.samples/log4j-samples-loggerProperties/2.6.2-SNAPSHOT/log4j-samples-loggerProperties-2.6.2-SNAPSHOT.jar
> [JENKINS] Archiving <https://builds.apache.org/job/Log4j%202.x/ws/log4j-samples/loggerProperties/target/log4j-samples-loggerProperties-2.6.2-SNAPSHOT-sources.jar> to org.apache.logging.log4j.samples/log4j-samples-loggerProperties/2.6.2-SNAPSHOT/log4j-samples-loggerProperties-2.6.2-SNAPSHOT-sources.jar
> [JENKINS] Archiving <https://builds.apache.org/job/Log4j%202.x/ws/log4j-jmx-gui/pom.xml> to org.apache.logging.log4j/log4j-jmx-gui/2.6.2-SNAPSHOT/log4j-jmx-gui-2.6.2-SNAPSHOT.pom
> [JENKINS] Archiving <https://builds.apache.org/job/Log4j%202.x/ws/log4j-jmx-gui/target/log4j-jmx-gui-2.6.2-SNAPSHOT.jar> to org.apache.logging.log4j/log4j-jmx-gui/2.6.2-SNAPSHOT/log4j-jmx-gui-2.6.2-SNAPSHOT.jar
> [JENKINS] Archiving <https://builds.apache.org/job/Log4j%202.x/ws/log4j-jmx-gui/target/log4j-jmx-gui-2.6.2-SNAPSHOT-sources.jar> to org.apache.logging.log4j/log4j-jmx-gui/2.6.2-SNAPSHOT/log4j-jmx-gui-2.6.2-SNAPSHOT-sources.jar
> [JENKINS] Archiving <https://builds.apache.org/job/Log4j%202.x/ws/log4j-nosql/pom.xml> to org.apache.logging.log4j/log4j-nosql/2.6.2-SNAPSHOT/log4j-nosql-2.6.2-SNAPSHOT.pom
> [JENKINS] Archiving <https://builds.apache.org/job/Log4j%202.x/ws/log4j-nosql/target/log4j-nosql-2.6.2-SNAPSHOT.jar> to org.apache.logging.log4j/log4j-nosql/2.6.2-SNAPSHOT/log4j-nosql-2.6.2-SNAPSHOT.jar
> [JENKINS] Archiving <https://builds.apache.org/job/Log4j%202.x/ws/log4j-nosql/target/log4j-nosql-2.6.2-SNAPSHOT-sources.jar> to org.apache.logging.log4j/log4j-nosql/2.6.2-SNAPSHOT/log4j-nosql-2.6.2-SNAPSHOT-sources.jar
> [JENKINS] Archiving <https://builds.apache.org/job/Log4j%202.x/ws/log4j-samples/configuration/pom.xml> to org.apache.logging.log4j.samples/log4j-samples-configuration/2.6.2-SNAPSHOT/log4j-samples-configuration-2.6.2-SNAPSHOT.pom
> [JENKINS] Archiving <https://builds.apache.org/job/Log4j%202.x/ws/log4j-samples/configuration/target/log4j-samples-configuration-2.6.2-SNAPSHOT.jar> to org.apache.logging.log4j.samples/log4j-samples-configuration/2.6.2-SNAPSHOT/log4j-samples-configuration-2.6.2-SNAPSHOT.jar
> [JENKINS] Archiving <https://builds.apache.org/job/Log4j%202.x/ws/log4j-samples/configuration/target/log4j-samples-configuration-2.6.2-SNAPSHOT-sources.jar> to org.apache.logging.log4j.samples/log4j-samples-configuration/2.6.2-SNAPSHOT/log4j-samples-configuration-2.6.2-SNAPSHOT-sources.jar
> [JENKINS] Archiving <https://builds.apache.org/job/Log4j%202.x/ws/log4j-core/pom.xml> to org.apache.logging.log4j/log4j-core/2.6.2-SNAPSHOT/log4j-core-2.6.2-SNAPSHOT.pom
> [JENKINS] Archiving <https://builds.apache.org/job/Log4j%202.x/ws/log4j-core/target/log4j-core-2.6.2-SNAPSHOT.jar> to org.apache.logging.log4j/log4j-core/2.6.2-SNAPSHOT/log4j-core-2.6.2-SNAPSHOT.jar
> [JENKINS] Archiving <https://builds.apache.org/job/Log4j%202.x/ws/log4j-core/target/log4j-core-2.6.2-SNAPSHOT-tests.jar> to org.apache.logging.log4j/log4j-core/2.6.2-SNAPSHOT/log4j-core-2.6.2-SNAPSHOT-tests.jar
> [JENKINS] Archiving <https://builds.apache.org/job/Log4j%202.x/ws/log4j-core/target/log4j-core-2.6.2-SNAPSHOT-sources.jar> to org.apache.logging.log4j/log4j-core/2.6.2-SNAPSHOT/log4j-core-2.6.2-SNAPSHOT-sources.jar
> [JENKINS] Archiving <https://builds.apache.org/job/Log4j%202.x/ws/log4j-samples/flume-embedded/pom.xml> to org.apache.logging.log4j.samples/log4j-samples-flume-embedded/2.6.2-SNAPSHOT/log4j-samples-flume-embedded-2.6.2-SNAPSHOT.pom
> [JENKINS] Archiving <https://builds.apache.org/job/Log4j%202.x/ws/log4j-samples/flume-embedded/target/log4j-samples-flume-embedded-2.6.2-SNAPSHOT.war> to org.apache.logging.log4j.samples/log4j-samples-flume-embedded/2.6.2-SNAPSHOT/log4j-samples-flume-embedded-2.6.2-SNAPSHOT.war
> [JENKINS] Archiving <https://builds.apache.org/job/Log4j%202.x/ws/log4j-samples/flume-embedded/target/log4j-samples-flume-embedded-2.6.2-SNAPSHOT-sources.jar> to org.apache.logging.log4j.samples/log4j-samples-flume-embedded/2.6.2-SNAPSHOT/log4j-samples-flume-embedded-2.6.2-SNAPSHOT-sources.jar
> Compressed 36.61 MB of artifacts by 89.1% relative to #2023
> [JENKINS] Archiving <https://builds.apache.org/job/Log4j%202.x/ws/log4j-jcl/pom.xml> to org.apache.logging.log4j/log4j-jcl/2.6.2-SNAPSHOT/log4j-jcl-2.6.2-SNAPSHOT.pom
> [JENKINS] Archiving <https://builds.apache.org/job/Log4j%202.x/ws/log4j-jcl/target/log4j-jcl-2.6.2-SNAPSHOT.jar> to org.apache.logging.log4j/log4j-jcl/2.6.2-SNAPSHOT/log4j-jcl-2.6.2-SNAPSHOT.jar
> [JENKINS] Archiving <https://builds.apache.org/job/Log4j%202.x/ws/log4j-jcl/target/log4j-jcl-2.6.2-SNAPSHOT-sources.jar> to org.apache.logging.log4j/log4j-jcl/2.6.2-SNAPSHOT/log4j-jcl-2.6.2-SNAPSHOT-sources.jar
> [JENKINS] Archiving <https://builds.apache.org/job/Log4j%202.x/ws/log4j-liquibase/pom.xml> to org.apache.logging.log4j/log4j-liquibase/2.6.2-SNAPSHOT/log4j-liquibase-2.6.2-SNAPSHOT.pom
> [JENKINS] Archiving <https://builds.apache.org/job/Log4j%202.x/ws/log4j-liquibase/target/log4j-liquibase-2.6.2-SNAPSHOT.jar> to org.apache.logging.log4j/log4j-liquibase/2.6.2-SNAPSHOT/log4j-liquibase-2.6.2-SNAPSHOT.jar
> [JENKINS] Archiving <https://builds.apache.org/job/Log4j%202.x/ws/log4j-liquibase/target/log4j-liquibase-2.6.2-SNAPSHOT-sources.jar> to org.apache.logging.log4j/log4j-liquibase/2.6.2-SNAPSHOT/log4j-liquibase-2.6.2-SNAPSHOT-sources.jar
> [JENKINS] Archiving <https://builds.apache.org/job/Log4j%202.x/ws/log4j-perf/pom.xml> to org.apache.logging.log4j/log4j-perf/2.6.2-SNAPSHOT/log4j-perf-2.6.2-SNAPSHOT.pom
> [JENKINS] Archiving <https://builds.apache.org/job/Log4j%202.x/ws/log4j-perf/target/log4j-perf-2.6.2-SNAPSHOT.jar> to org.apache.logging.log4j/log4j-perf/2.6.2-SNAPSHOT/log4j-perf-2.6.2-SNAPSHOT.jar
> [JENKINS] Archiving <https://builds.apache.org/job/Log4j%202.x/ws/log4j-perf/target/log4j-perf-2.6.2-SNAPSHOT-sources.jar> to org.apache.logging.log4j/log4j-perf/2.6.2-SNAPSHOT/log4j-perf-2.6.2-SNAPSHOT-sources.jar
> [JENKINS] Archiving <https://builds.apache.org/job/Log4j%202.x/ws/log4j-jul/pom.xml> to org.apache.logging.log4j/log4j-jul/2.6.2-SNAPSHOT/log4j-jul-2.6.2-SNAPSHOT.pom
> [JENKINS] Archiving <https://builds.apache.org/job/Log4j%202.x/ws/log4j-jul/target/log4j-jul-2.6.2-SNAPSHOT.jar> to org.apache.logging.log4j/log4j-jul/2.6.2-SNAPSHOT/log4j-jul-2.6.2-SNAPSHOT.jar
> [JENKINS] Archiving <https://builds.apache.org/job/Log4j%202.x/ws/log4j-jul/target/log4j-jul-2.6.2-SNAPSHOT-sources.jar> to org.apache.logging.log4j/log4j-jul/2.6.2-SNAPSHOT/log4j-jul-2.6.2-SNAPSHOT-sources.jar
> [JENKINS] Archiving <https://builds.apache.org/job/Log4j%202.x/ws/log4j-slf4j-impl/pom.xml> to org.apache.logging.log4j/log4j-slf4j-impl/2.6.2-SNAPSHOT/log4j-slf4j-impl-2.6.2-SNAPSHOT.pom
> [JENKINS] Archiving <https://builds.apache.org/job/Log4j%202.x/ws/log4j-slf4j-impl/target/log4j-slf4j-impl-2.6.2-SNAPSHOT.jar> to org.apache.logging.log4j/log4j-slf4j-impl/2.6.2-SNAPSHOT/log4j-slf4j-impl-2.6.2-SNAPSHOT.jar
> [JENKINS] Archiving <https://builds.apache.org/job/Log4j%202.x/ws/log4j-slf4j-impl/target/log4j-slf4j-impl-2.6.2-SNAPSHOT-sources.jar> to org.apache.logging.log4j/log4j-slf4j-impl/2.6.2-SNAPSHOT/log4j-slf4j-impl-2.6.2-SNAPSHOT-sources.jar
> [JENKINS] Archiving <https://builds.apache.org/job/Log4j%202.x/ws/log4j-samples/flume-common/pom.xml> to org.apache.logging.log4j.samples/log4j-samples-flume-common/2.6.2-SNAPSHOT/log4j-samples-flume-common-2.6.2-SNAPSHOT.pom
> [JENKINS] Archiving <https://builds.apache.org/job/Log4j%202.x/ws/log4j-samples/flume-common/target/log4j-samples-flume-common-2.6.2-SNAPSHOT.jar> to org.apache.logging.log4j.samples/log4j-samples-flume-common/2.6.2-SNAPSHOT/log4j-samples-flume-common-2.6.2-SNAPSHOT.jar
> [JENKINS] Archiving <https://builds.apache.org/job/Log4j%202.x/ws/log4j-samples/flume-common/target/log4j-samples-flume-common-2.6.2-SNAPSHOT-sources.jar> to org.apache.logging.log4j.samples/log4j-samples-flume-common/2.6.2-SNAPSHOT/log4j-samples-flume-common-2.6.2-SNAPSHOT-sources.jar
> [JENKINS] Archiving <https://builds.apache.org/job/Log4j%202.x/ws/log4j-web/pom.xml> to org.apache.logging.log4j/log4j-web/2.6.2-SNAPSHOT/log4j-web-2.6.2-SNAPSHOT.pom
> [JENKINS] Archiving <https://builds.apache.org/job/Log4j%202.x/ws/log4j-web/target/log4j-web-2.6.2-SNAPSHOT.jar> to org.apache.logging.log4j/log4j-web/2.6.2-SNAPSHOT/log4j-web-2.6.2-SNAPSHOT.jar
> [JENKINS] Archiving <https://builds.apache.org/job/Log4j%202.x/ws/log4j-web/target/log4j-web-2.6.2-SNAPSHOT-sources.jar> to org.apache.logging.log4j/log4j-web/2.6.2-SNAPSHOT/log4j-web-2.6.2-SNAPSHOT-sources.jar
> [JENKINS] Archiving <https://builds.apache.org/job/Log4j%202.x/ws/log4j-bom/pom.xml> to org.apache.logging.log4j/log4j-bom/2.6.2-SNAPSHOT/log4j-bom-2.6.2-SNAPSHOT.pom
> [JENKINS] Archiving <https://builds.apache.org/job/Log4j%202.x/ws/pom.xml> to org.apache.logging.log4j/log4j/2.6.2-SNAPSHOT/log4j-2.6.2-SNAPSHOT.pom
> Compressed 50.12 KB of artifacts by 63.8% relative to #2023
> [JENKINS] Archiving <https://builds.apache.org/job/Log4j%202.x/ws/log4j-iostreams/pom.xml> to org.apache.logging.log4j/log4j-iostreams/2.6.2-SNAPSHOT/log4j-iostreams-2.6.2-SNAPSHOT.pom
> [JENKINS] Archiving <https://builds.apache.org/job/Log4j%202.x/ws/log4j-iostreams/target/log4j-iostreams-2.6.2-SNAPSHOT.jar> to org.apache.logging.log4j/log4j-iostreams/2.6.2-SNAPSHOT/log4j-iostreams-2.6.2-SNAPSHOT.jar
> [JENKINS] Archiving <https://builds.apache.org/job/Log4j%202.x/ws/log4j-iostreams/target/log4j-iostreams-2.6.2-SNAPSHOT-sources.jar> to org.apache.logging.log4j/log4j-iostreams/2.6.2-SNAPSHOT/log4j-iostreams-2.6.2-SNAPSHOT-sources.jar
> [JENKINS] Archiving <https://builds.apache.org/job/Log4j%202.x/ws/log4j-to-slf4j/pom.xml> to org.apache.logging.log4j/log4j-to-slf4j/2.6.2-SNAPSHOT/log4j-to-slf4j-2.6.2-SNAPSHOT.pom
> [JENKINS] Archiving <https://builds.apache.org/job/Log4j%202.x/ws/log4j-to-slf4j/target/log4j-to-slf4j-2.6.2-SNAPSHOT.jar> to org.apache.logging.log4j/log4j-to-slf4j/2.6.2-SNAPSHOT/log4j-to-slf4j-2.6.2-SNAPSHOT.jar
> [JENKINS] Archiving <https://builds.apache.org/job/Log4j%202.x/ws/log4j-to-slf4j/target/log4j-to-slf4j-2.6.2-SNAPSHOT-sources.jar> to org.apache.logging.log4j/log4j-to-slf4j/2.6.2-SNAPSHOT/log4j-to-slf4j-2.6.2-SNAPSHOT-sources.jar
> [JENKINS] Archiving <https://builds.apache.org/job/Log4j%202.x/ws/log4j-flume-ng/pom.xml> to org.apache.logging.log4j/log4j-flume-ng/2.6.2-SNAPSHOT/log4j-flume-ng-2.6.2-SNAPSHOT.pom
> [JENKINS] Archiving <https://builds.apache.org/job/Log4j%202.x/ws/log4j-flume-ng/target/log4j-flume-ng-2.6.2-SNAPSHOT.jar> to org.apache.logging.log4j/log4j-flume-ng/2.6.2-SNAPSHOT/log4j-flume-ng-2.6.2-SNAPSHOT.jar
> [JENKINS] Archiving <https://builds.apache.org/job/Log4j%202.x/ws/log4j-flume-ng/target/log4j-flume-ng-2.6.2-SNAPSHOT-tests.jar> to org.apache.logging.log4j/log4j-flume-ng/2.6.2-SNAPSHOT/log4j-flume-ng-2.6.2-SNAPSHOT-tests.jar
> [JENKINS] Archiving <https://builds.apache.org/job/Log4j%202.x/ws/log4j-flume-ng/target/log4j-flume-ng-2.6.2-SNAPSHOT-sources.jar> to org.apache.logging.log4j/log4j-flume-ng/2.6.2-SNAPSHOT/log4j-flume-ng-2.6.2-SNAPSHOT-sources.jar
> [JENKINS] Archiving <https://builds.apache.org/job/Log4j%202.x/ws/log4j-api/pom.xml> to org.apache.logging.log4j/log4j-api/2.6.2-SNAPSHOT/log4j-api-2.6.2-SNAPSHOT.pom
> [JENKINS] Archiving <https://builds.apache.org/job/Log4j%202.x/ws/log4j-api/target/log4j-api-2.6.2-SNAPSHOT.jar> to org.apache.logging.log4j/log4j-api/2.6.2-SNAPSHOT/log4j-api-2.6.2-SNAPSHOT.jar
> [JENKINS] Archiving <https://builds.apache.org/job/Log4j%202.x/ws/log4j-api/target/log4j-api-2.6.2-SNAPSHOT-tests.jar> to org.apache.logging.log4j/log4j-api/2.6.2-SNAPSHOT/log4j-api-2.6.2-SNAPSHOT-tests.jar
> [JENKINS] Archiving <https://builds.apache.org/job/Log4j%202.x/ws/log4j-api/target/log4j-api-2.6.2-SNAPSHOT-sources.jar> to org.apache.logging.log4j/log4j-api/2.6.2-SNAPSHOT/log4j-api-2.6.2-SNAPSHOT-sources.jar
> [JENKINS] Archiving <https://builds.apache.org/job/Log4j%202.x/ws/log4j-samples/flume-remote/pom.xml> to org.apache.logging.log4j.samples/log4j-samples-flume-remote/2.6.2-SNAPSHOT/log4j-samples-flume-remote-2.6.2-SNAPSHOT.pom
> [JENKINS] Archiving <https://builds.apache.org/job/Log4j%202.x/ws/log4j-samples/flume-remote/target/log4j-samples-flume-remote-2.6.2-SNAPSHOT.war> to org.apache.logging.log4j.samples/log4j-samples-flume-remote/2.6.2-SNAPSHOT/log4j-samples-flume-remote-2.6.2-SNAPSHOT.war
> [JENKINS] Archiving <https://builds.apache.org/job/Log4j%202.x/ws/log4j-samples/flume-remote/target/log4j-samples-flume-remote-2.6.2-SNAPSHOT-sources.jar> to org.apache.logging.log4j.samples/log4j-samples-flume-remote/2.6.2-SNAPSHOT/log4j-samples-flume-remote-2.6.2-SNAPSHOT-sources.jar
> Compressed 14.21 MB of artifacts by 84.0% relative to #2023
> [JENKINS] Archiving <https://builds.apache.org/job/Log4j%202.x/ws/log4j-samples/pom.xml> to org.apache.logging.log4j.samples/log4j-samples/2.6.2-SNAPSHOT/log4j-samples-2.6.2-SNAPSHOT.pom
> channel stopped
> Maven RedeployPublisher use remote H10 maven settings from : /home/jenkins/.m2/settings.xml
> [INFO] Deployment in https://repository.apache.org/content/repositories/snapshots (id=apache.snapshots.https,uniqueVersion=true)
> Deploying the main artifact log4j-2.6.2-SNAPSHOT.pom
> Downloading: https://repository.apache.org/content/repositories/snapshots/org/apache/logging/log4j/log4j/2.6.2-SNAPSHOT/maven-metadata.xml
> Downloaded: https://repository.apache.org/content/repositories/snapshots/org/apache/logging/log4j/log4j/2.6.2-SNAPSHOT/maven-metadata.xml (608 B at 4.6 KB/sec)
> Uploading: https://repository.apache.org/content/repositories/snapshots/org/apache/logging/log4j/log4j/2.6.2-SNAPSHOT/log4j-2.6.2-20160612.131229-18.pom
> Uploaded: https://repository.apache.org/content/repositories/snapshots/org/apache/logging/log4j/log4j/2.6.2-SNAPSHOT/log4j-2.6.2-20160612.131229-18.pom (51 KB at 0.9 KB/sec)
> Downloading: https://repository.apache.org/content/repositories/snapshots/org/apache/logging/log4j/log4j/maven-metadata.xml
> Downloaded: https://repository.apache.org/content/repositories/snapshots/org/apache/logging/log4j/log4j/maven-metadata.xml (616 B at 3.8 KB/sec)
> Uploading: https://repository.apache.org/content/repositories/snapshots/org/apache/logging/log4j/log4j/2.6.2-SNAPSHOT/maven-metadata.xml
> Uploaded: https://repository.apache.org/content/repositories/snapshots/org/apache/logging/log4j/log4j/2.6.2-SNAPSHOT/maven-metadata.xml (608 B at 0.0 KB/sec)
> Uploading: https://repository.apache.org/content/repositories/snapshots/org/apache/logging/log4j/log4j/maven-metadata.xml
> ERROR: Failed to deploy metadata: Could not transfer metadata org.apache.logging.log4j:log4j/maven-metadata.xml from/to apache.snapshots.https (https://repository.apache.org/content/repositories/snapshots): Failed to transfer file: https://repository.apache.org/content/repositories/snapshots/org/apache/logging/log4j/log4j/maven-metadata.xml. Return code is: 502, ReasonPhrase: Proxy Error.
> org.apache.maven.artifact.deployer.ArtifactDeploymentException: Failed to deploy metadata: Could not transfer metadata org.apache.logging.log4j:log4j/maven-metadata.xml from/to apache.snapshots.https (https://repository.apache.org/content/repositories/snapshots): Failed to transfer file: https://repository.apache.org/content/repositories/snapshots/org/apache/logging/log4j/log4j/maven-metadata.xml. Return code is: 502, ReasonPhrase: Proxy Error.
> at org.apache.maven.artifact.deployer.DefaultArtifactDeployer.deploy(DefaultArtifactDeployer.java:143)
> at hudson.maven.reporters.MavenArtifactRecord.deploy(MavenArtifactRecord.java:193)
> at hudson.maven.RedeployPublisher.perform(RedeployPublisher.java:176)
> at hudson.tasks.BuildStepMonitor$1.perform(BuildStepMonitor.java:20)
> at hudson.model.AbstractBuild$AbstractBuildExecution.perform(AbstractBuild.java:782)
> at hudson.model.AbstractBuild$AbstractBuildExecution.performAllBuildSteps(AbstractBuild.java:723)
> at hudson.maven.MavenModuleSetBuild$MavenModuleSetBuildExecution.post2(MavenModuleSetBuild.java:1047)
> at hudson.model.AbstractBuild$AbstractBuildExecution.post(AbstractBuild.java:668)
> at hudson.model.Run.execute(Run.java:1763)
> at hudson.maven.MavenModuleSetBuild.run(MavenModuleSetBuild.java:531)
> at hudson.model.ResourceController.execute(ResourceController.java:98)
> at hudson.model.Executor.run(Executor.java:410)
> Caused by: org.eclipse.aether.deployment.DeploymentException: Failed to deploy metadata: Could not transfer metadata org.apache.logging.log4j:log4j/maven-metadata.xml from/to apache.snapshots.https (https://repository.apache.org/content/repositories/snapshots): Failed to transfer file: https://repository.apache.org/content/repositories/snapshots/org/apache/logging/log4j/log4j/maven-metadata.xml. Return code is: 502, ReasonPhrase: Proxy Error.
> at org.eclipse.aether.internal.impl.DefaultDeployer.deploy(DefaultDeployer.java:372)
> at org.eclipse.aether.internal.impl.DefaultDeployer.deploy(DefaultDeployer.java:269)
> at org.eclipse.aether.internal.impl.DefaultRepositorySystem.deploy(DefaultRepositorySystem.java:413)
> at org.apache.maven.artifact.deployer.DefaultArtifactDeployer.deploy(DefaultArtifactDeployer.java:139)
> ... 11 more
> Caused by: org.eclipse.aether.transfer.MetadataTransferException: Could not transfer metadata org.apache.logging.log4j:log4j/maven-metadata.xml from/to apache.snapshots.https (https://repository.apache.org/content/repositories/snapshots): Failed to transfer file: https://repository.apache.org/content/repositories/snapshots/org/apache/logging/log4j/log4j/maven-metadata.xml. Return code is: 502, ReasonPhrase: Proxy Error.
> at org.eclipse.aether.connector.wagon.WagonRepositoryConnector$5.wrap(WagonRepositoryConnector.java:995)
> at org.eclipse.aether.connector.wagon.WagonRepositoryConnector$5.wrap(WagonRepositoryConnector.java:983)
> at org.eclipse.aether.connector.wagon.WagonRepositoryConnector$PutTask.run(WagonRepositoryConnector.java:895)
> at org.eclipse.aether.connector.wagon.WagonRepositoryConnector.put(WagonRepositoryConnector.java:530)
> at org.eclipse.aether.internal.impl.DefaultDeployer.deploy(DefaultDeployer.java:366)
> ... 14 more
> Caused by: org.apache.maven.wagon.TransferFailedException: Failed to transfer file: https://repository.apache.org/content/repositories/snapshots/org/apache/logging/log4j/log4j/maven-metadata.xml. Return code is: 502, ReasonPhrase: Proxy Error.
> at org.apache.maven.wagon.shared.http4.AbstractHttpClientWagon.put(AbstractHttpClientWagon.java:626)
> at org.apache.maven.wagon.shared.http4.AbstractHttpClientWagon.put(AbstractHttpClientWagon.java:524)
> at org.apache.maven.wagon.shared.http4.AbstractHttpClientWagon.put(AbstractHttpClientWagon.java:505)
> at org.apache.maven.wagon.shared.http4.AbstractHttpClientWagon.put(AbstractHttpClientWagon.java:485)
> at org.eclipse.aether.connector.wagon.WagonRepositoryConnector$PutTask.run(WagonRepositoryConnector.java:871)
> ... 16 more
> [INFO] Deployment failed after 2 min 36 sec
> Build step 'Deploy artifacts to Maven repository' changed build result to FAILURE
>
> ---------------------------------------------------------------------
> To unsubscribe, e-mail: log4j-dev-unsubscribe@logging.apache.org
> For additional commands, e-mail: log4j-dev-help@logging.apache.org
>
Build failed in Jenkins: Log4j 2.x #2024
Posted by Apache Jenkins Server <je...@builds.apache.org>.
See <https://builds.apache.org/job/Log4j%202.x/2024/changes>
Changes:
[mikael] Update Javadoc and changes.xml
------------------------------------------
[...truncated 24271 lines...]
Running org.apache.logging.log4j.jul.CallerInformationTest
Tests run: 2, Failures: 0, Errors: 0, Skipped: 0, Time elapsed: 1.174 sec - in org.apache.logging.log4j.jul.CallerInformationTest
Running org.apache.logging.log4j.jul.BracketInNotInterpolatedMessageTest
Tests run: 1, Failures: 0, Errors: 0, Skipped: 0, Time elapsed: 1.032 sec - in org.apache.logging.log4j.jul.BracketInNotInterpolatedMessageTest
Running org.apache.logging.log4j.jul.ApiLoggerTest
Tests run: 19, Failures: 0, Errors: 0, Skipped: 0, Time elapsed: 1.225 sec - in org.apache.logging.log4j.jul.ApiLoggerTest
Running org.apache.logging.log4j.jul.DefaultLevelConverterTest
Tests run: 1, Failures: 0, Errors: 0, Skipped: 0, Time elapsed: 0.157 sec - in org.apache.logging.log4j.jul.DefaultLevelConverterTest
Results :
Tests run: 77, Failures: 0, Errors: 0, Skipped: 0
[JENKINS] Recording test results
[INFO]
[INFO] --- maven-jar-plugin:2.3.1:jar (default-jar) @ log4j-jul ---
[INFO] Building jar: <https://builds.apache.org/job/Log4j%202.x/ws/log4j-jul/target/log4j-jul-2.6.2-SNAPSHOT.jar>
[INFO]
[INFO] --- maven-failsafe-plugin:2.19.1:integration-test (integration-tests) @ log4j-jul ---
[JENKINS] Recording test results
[INFO]
[INFO] --- maven-failsafe-plugin:2.19.1:verify (verify) @ log4j-jul ---
[JENKINS] Recording test results[INFO]
[INFO] --- maven-source-plugin:3.0.0:jar-no-fork (attach-sources) @ log4j-jul ---
[INFO] Building jar: <https://builds.apache.org/job/Log4j%202.x/ws/log4j-jul/target/log4j-jul-2.6.2-SNAPSHOT-sources.jar>
[INFO]
[INFO] --- maven-install-plugin:2.3.1:install (default-install) @ log4j-jul ---
[INFO] Installing <https://builds.apache.org/job/Log4j%202.x/ws/log4j-jul/target/log4j-jul-2.6.2-SNAPSHOT.jar> to /home/jenkins/jenkins-slave/maven-repositories/0/org/apache/logging/log4j/log4j-jul/2.6.2-SNAPSHOT/log4j-jul-2.6.2-SNAPSHOT.jar
[INFO] Installing <https://builds.apache.org/job/Log4j%202.x/ws/log4j-jul/pom.xml> to /home/jenkins/jenkins-slave/maven-repositories/0/org/apache/logging/log4j/log4j-jul/2.6.2-SNAPSHOT/log4j-jul-2.6.2-SNAPSHOT.pom
[INFO] Installing <https://builds.apache.org/job/Log4j%202.x/ws/log4j-jul/target/log4j-jul-2.6.2-SNAPSHOT-sources.jar> to /home/jenkins/jenkins-slave/maven-repositories/0/org/apache/logging/log4j/log4j-jul/2.6.2-SNAPSHOT/log4j-jul-2.6.2-SNAPSHOT-sources.jar
[INFO]
[INFO] ------------------------------------------------------------------------
[INFO] Building Apache Log4j Liquibase Binding 2.6.2-SNAPSHOT
[INFO] ------------------------------------------------------------------------
[INFO]
[INFO] --- maven-clean-plugin:2.4.1:clean (default-clean) @ log4j-liquibase ---
[INFO] Deleting <https://builds.apache.org/job/Log4j%202.x/ws/log4j-liquibase/target>
[INFO]
[INFO] --- maven-remote-resources-plugin:1.1:process (default) @ log4j-liquibase ---
[INFO]
[INFO] --- maven-resources-plugin:2.7:resources (default-resources) @ log4j-liquibase ---
[INFO] Using 'UTF-8' encoding to copy filtered resources.
[INFO] skip non existing resourceDirectory <https://builds.apache.org/job/Log4j%202.x/ws/log4j-liquibase/src/main/resources>
[INFO] Copying 3 resources
[INFO]
[INFO] --- maven-compiler-plugin:3.5.1:compile (default-compile) @ log4j-liquibase ---
[INFO] Changes detected - recompiling the module!
[INFO] Compiling 1 source file to <https://builds.apache.org/job/Log4j%202.x/ws/log4j-liquibase/target/classes>
[INFO]
[INFO] --- maven-bundle-plugin:2.5.3:manifest (default) @ log4j-liquibase ---
[INFO]
[INFO] --- maven-resources-plugin:2.7:testResources (default-testResources) @ log4j-liquibase ---
[INFO] Using 'UTF-8' encoding to copy filtered resources.
[INFO] Copying 1 resource
[INFO] Copying 3 resources
[INFO]
[INFO] --- maven-compiler-plugin:3.5.1:testCompile (default-testCompile) @ log4j-liquibase ---
[INFO] Changes detected - recompiling the module!
[INFO] Compiling 1 source file to <https://builds.apache.org/job/Log4j%202.x/ws/log4j-liquibase/target/test-classes>
[INFO]
[INFO] --- maven-surefire-plugin:2.19.1:test (default-test) @ log4j-liquibase ---
[JENKINS] Recording test results[INFO]
[INFO] --- maven-surefire-plugin:2.19.1:test (default-tests) @ log4j-liquibase ---
-------------------------------------------------------
T E S T S
-------------------------------------------------------
Running liquibase.ext.logging.log4j2.LoggingTest
Tests run: 5, Failures: 0, Errors: 0, Skipped: 0, Time elapsed: 0.922 sec - in liquibase.ext.logging.log4j2.LoggingTest
Results :
Tests run: 5, Failures: 0, Errors: 0, Skipped: 0
[JENKINS] Recording test results
[INFO]
[INFO] --- maven-surefire-plugin:2.19.1:test (test-optional) @ log4j-liquibase ---
[JENKINS] Recording test results
[INFO]
[INFO] --- maven-jar-plugin:2.3.1:jar (default-jar) @ log4j-liquibase ---
[INFO] Building jar: <https://builds.apache.org/job/Log4j%202.x/ws/log4j-liquibase/target/log4j-liquibase-2.6.2-SNAPSHOT.jar>
[INFO]
[INFO] --- maven-failsafe-plugin:2.19.1:integration-test (integration-tests) @ log4j-liquibase ---
[JENKINS] Recording test results
[INFO]
[INFO] --- maven-failsafe-plugin:2.19.1:verify (verify) @ log4j-liquibase ---
[JENKINS] Recording test results[INFO]
[INFO] --- maven-source-plugin:3.0.0:jar-no-fork (attach-sources) @ log4j-liquibase ---
[INFO] Building jar: <https://builds.apache.org/job/Log4j%202.x/ws/log4j-liquibase/target/log4j-liquibase-2.6.2-SNAPSHOT-sources.jar>
[INFO]
[INFO] --- maven-install-plugin:2.3.1:install (default-install) @ log4j-liquibase ---
[INFO] Installing <https://builds.apache.org/job/Log4j%202.x/ws/log4j-liquibase/target/log4j-liquibase-2.6.2-SNAPSHOT.jar> to /home/jenkins/jenkins-slave/maven-repositories/0/org/apache/logging/log4j/log4j-liquibase/2.6.2-SNAPSHOT/log4j-liquibase-2.6.2-SNAPSHOT.jar
[INFO] Installing <https://builds.apache.org/job/Log4j%202.x/ws/log4j-liquibase/pom.xml> to /home/jenkins/jenkins-slave/maven-repositories/0/org/apache/logging/log4j/log4j-liquibase/2.6.2-SNAPSHOT/log4j-liquibase-2.6.2-SNAPSHOT.pom
[INFO] Installing <https://builds.apache.org/job/Log4j%202.x/ws/log4j-liquibase/target/log4j-liquibase-2.6.2-SNAPSHOT-sources.jar> to /home/jenkins/jenkins-slave/maven-repositories/0/org/apache/logging/log4j/log4j-liquibase/2.6.2-SNAPSHOT/log4j-liquibase-2.6.2-SNAPSHOT-sources.jar
[INFO] ------------------------------------------------------------------------
[INFO] Reactor Summary:
[INFO]
[INFO] Apache Log4j 2 .................................... SUCCESS [ 9.953 s]
[INFO] Apache Log4j API .................................. SUCCESS [ 20.960 s]
[INFO] Apache Log4j Core ................................. SUCCESS [15:35 min]
[INFO] Apache Log4j 1.x Compatibility API ................ SUCCESS [ 12.626 s]
[INFO] Apache Log4j SLF4J Binding ........................ SUCCESS [ 9.312 s]
[INFO] Apache Log4j to SLF4J Adapter ..................... SUCCESS [ 6.616 s]
[INFO] Apache Log4j Commons Logging Bridge ............... SUCCESS [ 5.648 s]
[INFO] Apache Log4j Flume Bridge ......................... SUCCESS [03:39 min]
[INFO] Apache Log4j Web .................................. SUCCESS [ 8.036 s]
[INFO] Apache Log4j Tag Library .......................... SUCCESS [ 19.175 s]
[INFO] Apache Log4j JMX GUI .............................. SUCCESS [ 2.698 s]
[INFO] Apache Log4j Samples .............................. SUCCESS [ 0.834 s]
[INFO] Apache Log4j Samples: Flume - Common .............. SUCCESS [ 6.574 s]
[INFO] Apache Log4j Samples: Flume - Remote .............. SUCCESS [ 3.935 s]
[INFO] Apache Log4j Samples: Flume - Embedded ............ SUCCESS [ 6.091 s]
[INFO] Apache Log4j Samples: Configuration ............... SUCCESS [ 3.919 s]
[INFO] Apache Log4j Samples: LoggerProperties ............ SUCCESS [ 4.285 s]
[INFO] Apache Log4j BOM .................................. SUCCESS [ 0.608 s]
[INFO] Apache Log4j NoSQL ................................ SUCCESS [ 6.394 s]
[INFO] Apache Log4J Performance Tests .................... SUCCESS [ 28.760 s]
[INFO] Apache Log4j Streaming Interface .................. SUCCESS [ 8.797 s]
[INFO] Apache Log4j JUL Adapter .......................... SUCCESS [ 17.819 s]
[INFO] Apache Log4j Liquibase Binding .................... SUCCESS [ 6.297 s]
[INFO] ------------------------------------------------------------------------
[INFO] BUILD SUCCESS
[INFO] ------------------------------------------------------------------------
[INFO] Total time: 22:51 min
[INFO] Finished at: 2016-06-12T13:12:11+00:00
[INFO] Final Memory: 47M/944M
[INFO] ------------------------------------------------------------------------
Waiting for Jenkins to finish collecting data
[JENKINS] Archiving <https://builds.apache.org/job/Log4j%202.x/ws/log4j-taglib/pom.xml> to org.apache.logging.log4j/log4j-taglib/2.6.2-SNAPSHOT/log4j-taglib-2.6.2-SNAPSHOT.pom
[JENKINS] Archiving <https://builds.apache.org/job/Log4j%202.x/ws/log4j-taglib/target/log4j-taglib-2.6.2-SNAPSHOT.jar> to org.apache.logging.log4j/log4j-taglib/2.6.2-SNAPSHOT/log4j-taglib-2.6.2-SNAPSHOT.jar
[JENKINS] Archiving <https://builds.apache.org/job/Log4j%202.x/ws/log4j-taglib/target/log4j-taglib-2.6.2-SNAPSHOT-sources.jar> to org.apache.logging.log4j/log4j-taglib/2.6.2-SNAPSHOT/log4j-taglib-2.6.2-SNAPSHOT-sources.jar
[JENKINS] Archiving <https://builds.apache.org/job/Log4j%202.x/ws/log4j-1.2-api/pom.xml> to org.apache.logging.log4j/log4j-1.2-api/2.6.2-SNAPSHOT/log4j-1.2-api-2.6.2-SNAPSHOT.pom
[JENKINS] Archiving <https://builds.apache.org/job/Log4j%202.x/ws/log4j-1.2-api/target/log4j-1.2-api-2.6.2-SNAPSHOT.jar> to org.apache.logging.log4j/log4j-1.2-api/2.6.2-SNAPSHOT/log4j-1.2-api-2.6.2-SNAPSHOT.jar
[JENKINS] Archiving <https://builds.apache.org/job/Log4j%202.x/ws/log4j-1.2-api/target/log4j-1.2-api-2.6.2-SNAPSHOT-sources.jar> to org.apache.logging.log4j/log4j-1.2-api/2.6.2-SNAPSHOT/log4j-1.2-api-2.6.2-SNAPSHOT-sources.jar
[JENKINS] Archiving <https://builds.apache.org/job/Log4j%202.x/ws/log4j-samples/loggerProperties/pom.xml> to org.apache.logging.log4j.samples/log4j-samples-loggerProperties/2.6.2-SNAPSHOT/log4j-samples-loggerProperties-2.6.2-SNAPSHOT.pom
[JENKINS] Archiving <https://builds.apache.org/job/Log4j%202.x/ws/log4j-samples/loggerProperties/target/log4j-samples-loggerProperties-2.6.2-SNAPSHOT.jar> to org.apache.logging.log4j.samples/log4j-samples-loggerProperties/2.6.2-SNAPSHOT/log4j-samples-loggerProperties-2.6.2-SNAPSHOT.jar
[JENKINS] Archiving <https://builds.apache.org/job/Log4j%202.x/ws/log4j-samples/loggerProperties/target/log4j-samples-loggerProperties-2.6.2-SNAPSHOT-sources.jar> to org.apache.logging.log4j.samples/log4j-samples-loggerProperties/2.6.2-SNAPSHOT/log4j-samples-loggerProperties-2.6.2-SNAPSHOT-sources.jar
[JENKINS] Archiving <https://builds.apache.org/job/Log4j%202.x/ws/log4j-jmx-gui/pom.xml> to org.apache.logging.log4j/log4j-jmx-gui/2.6.2-SNAPSHOT/log4j-jmx-gui-2.6.2-SNAPSHOT.pom
[JENKINS] Archiving <https://builds.apache.org/job/Log4j%202.x/ws/log4j-jmx-gui/target/log4j-jmx-gui-2.6.2-SNAPSHOT.jar> to org.apache.logging.log4j/log4j-jmx-gui/2.6.2-SNAPSHOT/log4j-jmx-gui-2.6.2-SNAPSHOT.jar
[JENKINS] Archiving <https://builds.apache.org/job/Log4j%202.x/ws/log4j-jmx-gui/target/log4j-jmx-gui-2.6.2-SNAPSHOT-sources.jar> to org.apache.logging.log4j/log4j-jmx-gui/2.6.2-SNAPSHOT/log4j-jmx-gui-2.6.2-SNAPSHOT-sources.jar
[JENKINS] Archiving <https://builds.apache.org/job/Log4j%202.x/ws/log4j-nosql/pom.xml> to org.apache.logging.log4j/log4j-nosql/2.6.2-SNAPSHOT/log4j-nosql-2.6.2-SNAPSHOT.pom
[JENKINS] Archiving <https://builds.apache.org/job/Log4j%202.x/ws/log4j-nosql/target/log4j-nosql-2.6.2-SNAPSHOT.jar> to org.apache.logging.log4j/log4j-nosql/2.6.2-SNAPSHOT/log4j-nosql-2.6.2-SNAPSHOT.jar
[JENKINS] Archiving <https://builds.apache.org/job/Log4j%202.x/ws/log4j-nosql/target/log4j-nosql-2.6.2-SNAPSHOT-sources.jar> to org.apache.logging.log4j/log4j-nosql/2.6.2-SNAPSHOT/log4j-nosql-2.6.2-SNAPSHOT-sources.jar
[JENKINS] Archiving <https://builds.apache.org/job/Log4j%202.x/ws/log4j-samples/configuration/pom.xml> to org.apache.logging.log4j.samples/log4j-samples-configuration/2.6.2-SNAPSHOT/log4j-samples-configuration-2.6.2-SNAPSHOT.pom
[JENKINS] Archiving <https://builds.apache.org/job/Log4j%202.x/ws/log4j-samples/configuration/target/log4j-samples-configuration-2.6.2-SNAPSHOT.jar> to org.apache.logging.log4j.samples/log4j-samples-configuration/2.6.2-SNAPSHOT/log4j-samples-configuration-2.6.2-SNAPSHOT.jar
[JENKINS] Archiving <https://builds.apache.org/job/Log4j%202.x/ws/log4j-samples/configuration/target/log4j-samples-configuration-2.6.2-SNAPSHOT-sources.jar> to org.apache.logging.log4j.samples/log4j-samples-configuration/2.6.2-SNAPSHOT/log4j-samples-configuration-2.6.2-SNAPSHOT-sources.jar
[JENKINS] Archiving <https://builds.apache.org/job/Log4j%202.x/ws/log4j-core/pom.xml> to org.apache.logging.log4j/log4j-core/2.6.2-SNAPSHOT/log4j-core-2.6.2-SNAPSHOT.pom
[JENKINS] Archiving <https://builds.apache.org/job/Log4j%202.x/ws/log4j-core/target/log4j-core-2.6.2-SNAPSHOT.jar> to org.apache.logging.log4j/log4j-core/2.6.2-SNAPSHOT/log4j-core-2.6.2-SNAPSHOT.jar
[JENKINS] Archiving <https://builds.apache.org/job/Log4j%202.x/ws/log4j-core/target/log4j-core-2.6.2-SNAPSHOT-tests.jar> to org.apache.logging.log4j/log4j-core/2.6.2-SNAPSHOT/log4j-core-2.6.2-SNAPSHOT-tests.jar
[JENKINS] Archiving <https://builds.apache.org/job/Log4j%202.x/ws/log4j-core/target/log4j-core-2.6.2-SNAPSHOT-sources.jar> to org.apache.logging.log4j/log4j-core/2.6.2-SNAPSHOT/log4j-core-2.6.2-SNAPSHOT-sources.jar
[JENKINS] Archiving <https://builds.apache.org/job/Log4j%202.x/ws/log4j-samples/flume-embedded/pom.xml> to org.apache.logging.log4j.samples/log4j-samples-flume-embedded/2.6.2-SNAPSHOT/log4j-samples-flume-embedded-2.6.2-SNAPSHOT.pom
[JENKINS] Archiving <https://builds.apache.org/job/Log4j%202.x/ws/log4j-samples/flume-embedded/target/log4j-samples-flume-embedded-2.6.2-SNAPSHOT.war> to org.apache.logging.log4j.samples/log4j-samples-flume-embedded/2.6.2-SNAPSHOT/log4j-samples-flume-embedded-2.6.2-SNAPSHOT.war
[JENKINS] Archiving <https://builds.apache.org/job/Log4j%202.x/ws/log4j-samples/flume-embedded/target/log4j-samples-flume-embedded-2.6.2-SNAPSHOT-sources.jar> to org.apache.logging.log4j.samples/log4j-samples-flume-embedded/2.6.2-SNAPSHOT/log4j-samples-flume-embedded-2.6.2-SNAPSHOT-sources.jar
Compressed 36.61 MB of artifacts by 89.1% relative to #2023
[JENKINS] Archiving <https://builds.apache.org/job/Log4j%202.x/ws/log4j-jcl/pom.xml> to org.apache.logging.log4j/log4j-jcl/2.6.2-SNAPSHOT/log4j-jcl-2.6.2-SNAPSHOT.pom
[JENKINS] Archiving <https://builds.apache.org/job/Log4j%202.x/ws/log4j-jcl/target/log4j-jcl-2.6.2-SNAPSHOT.jar> to org.apache.logging.log4j/log4j-jcl/2.6.2-SNAPSHOT/log4j-jcl-2.6.2-SNAPSHOT.jar
[JENKINS] Archiving <https://builds.apache.org/job/Log4j%202.x/ws/log4j-jcl/target/log4j-jcl-2.6.2-SNAPSHOT-sources.jar> to org.apache.logging.log4j/log4j-jcl/2.6.2-SNAPSHOT/log4j-jcl-2.6.2-SNAPSHOT-sources.jar
[JENKINS] Archiving <https://builds.apache.org/job/Log4j%202.x/ws/log4j-liquibase/pom.xml> to org.apache.logging.log4j/log4j-liquibase/2.6.2-SNAPSHOT/log4j-liquibase-2.6.2-SNAPSHOT.pom
[JENKINS] Archiving <https://builds.apache.org/job/Log4j%202.x/ws/log4j-liquibase/target/log4j-liquibase-2.6.2-SNAPSHOT.jar> to org.apache.logging.log4j/log4j-liquibase/2.6.2-SNAPSHOT/log4j-liquibase-2.6.2-SNAPSHOT.jar
[JENKINS] Archiving <https://builds.apache.org/job/Log4j%202.x/ws/log4j-liquibase/target/log4j-liquibase-2.6.2-SNAPSHOT-sources.jar> to org.apache.logging.log4j/log4j-liquibase/2.6.2-SNAPSHOT/log4j-liquibase-2.6.2-SNAPSHOT-sources.jar
[JENKINS] Archiving <https://builds.apache.org/job/Log4j%202.x/ws/log4j-perf/pom.xml> to org.apache.logging.log4j/log4j-perf/2.6.2-SNAPSHOT/log4j-perf-2.6.2-SNAPSHOT.pom
[JENKINS] Archiving <https://builds.apache.org/job/Log4j%202.x/ws/log4j-perf/target/log4j-perf-2.6.2-SNAPSHOT.jar> to org.apache.logging.log4j/log4j-perf/2.6.2-SNAPSHOT/log4j-perf-2.6.2-SNAPSHOT.jar
[JENKINS] Archiving <https://builds.apache.org/job/Log4j%202.x/ws/log4j-perf/target/log4j-perf-2.6.2-SNAPSHOT-sources.jar> to org.apache.logging.log4j/log4j-perf/2.6.2-SNAPSHOT/log4j-perf-2.6.2-SNAPSHOT-sources.jar
[JENKINS] Archiving <https://builds.apache.org/job/Log4j%202.x/ws/log4j-jul/pom.xml> to org.apache.logging.log4j/log4j-jul/2.6.2-SNAPSHOT/log4j-jul-2.6.2-SNAPSHOT.pom
[JENKINS] Archiving <https://builds.apache.org/job/Log4j%202.x/ws/log4j-jul/target/log4j-jul-2.6.2-SNAPSHOT.jar> to org.apache.logging.log4j/log4j-jul/2.6.2-SNAPSHOT/log4j-jul-2.6.2-SNAPSHOT.jar
[JENKINS] Archiving <https://builds.apache.org/job/Log4j%202.x/ws/log4j-jul/target/log4j-jul-2.6.2-SNAPSHOT-sources.jar> to org.apache.logging.log4j/log4j-jul/2.6.2-SNAPSHOT/log4j-jul-2.6.2-SNAPSHOT-sources.jar
[JENKINS] Archiving <https://builds.apache.org/job/Log4j%202.x/ws/log4j-slf4j-impl/pom.xml> to org.apache.logging.log4j/log4j-slf4j-impl/2.6.2-SNAPSHOT/log4j-slf4j-impl-2.6.2-SNAPSHOT.pom
[JENKINS] Archiving <https://builds.apache.org/job/Log4j%202.x/ws/log4j-slf4j-impl/target/log4j-slf4j-impl-2.6.2-SNAPSHOT.jar> to org.apache.logging.log4j/log4j-slf4j-impl/2.6.2-SNAPSHOT/log4j-slf4j-impl-2.6.2-SNAPSHOT.jar
[JENKINS] Archiving <https://builds.apache.org/job/Log4j%202.x/ws/log4j-slf4j-impl/target/log4j-slf4j-impl-2.6.2-SNAPSHOT-sources.jar> to org.apache.logging.log4j/log4j-slf4j-impl/2.6.2-SNAPSHOT/log4j-slf4j-impl-2.6.2-SNAPSHOT-sources.jar
[JENKINS] Archiving <https://builds.apache.org/job/Log4j%202.x/ws/log4j-samples/flume-common/pom.xml> to org.apache.logging.log4j.samples/log4j-samples-flume-common/2.6.2-SNAPSHOT/log4j-samples-flume-common-2.6.2-SNAPSHOT.pom
[JENKINS] Archiving <https://builds.apache.org/job/Log4j%202.x/ws/log4j-samples/flume-common/target/log4j-samples-flume-common-2.6.2-SNAPSHOT.jar> to org.apache.logging.log4j.samples/log4j-samples-flume-common/2.6.2-SNAPSHOT/log4j-samples-flume-common-2.6.2-SNAPSHOT.jar
[JENKINS] Archiving <https://builds.apache.org/job/Log4j%202.x/ws/log4j-samples/flume-common/target/log4j-samples-flume-common-2.6.2-SNAPSHOT-sources.jar> to org.apache.logging.log4j.samples/log4j-samples-flume-common/2.6.2-SNAPSHOT/log4j-samples-flume-common-2.6.2-SNAPSHOT-sources.jar
[JENKINS] Archiving <https://builds.apache.org/job/Log4j%202.x/ws/log4j-web/pom.xml> to org.apache.logging.log4j/log4j-web/2.6.2-SNAPSHOT/log4j-web-2.6.2-SNAPSHOT.pom
[JENKINS] Archiving <https://builds.apache.org/job/Log4j%202.x/ws/log4j-web/target/log4j-web-2.6.2-SNAPSHOT.jar> to org.apache.logging.log4j/log4j-web/2.6.2-SNAPSHOT/log4j-web-2.6.2-SNAPSHOT.jar
[JENKINS] Archiving <https://builds.apache.org/job/Log4j%202.x/ws/log4j-web/target/log4j-web-2.6.2-SNAPSHOT-sources.jar> to org.apache.logging.log4j/log4j-web/2.6.2-SNAPSHOT/log4j-web-2.6.2-SNAPSHOT-sources.jar
[JENKINS] Archiving <https://builds.apache.org/job/Log4j%202.x/ws/log4j-bom/pom.xml> to org.apache.logging.log4j/log4j-bom/2.6.2-SNAPSHOT/log4j-bom-2.6.2-SNAPSHOT.pom
[JENKINS] Archiving <https://builds.apache.org/job/Log4j%202.x/ws/pom.xml> to org.apache.logging.log4j/log4j/2.6.2-SNAPSHOT/log4j-2.6.2-SNAPSHOT.pom
Compressed 50.12 KB of artifacts by 63.8% relative to #2023
[JENKINS] Archiving <https://builds.apache.org/job/Log4j%202.x/ws/log4j-iostreams/pom.xml> to org.apache.logging.log4j/log4j-iostreams/2.6.2-SNAPSHOT/log4j-iostreams-2.6.2-SNAPSHOT.pom
[JENKINS] Archiving <https://builds.apache.org/job/Log4j%202.x/ws/log4j-iostreams/target/log4j-iostreams-2.6.2-SNAPSHOT.jar> to org.apache.logging.log4j/log4j-iostreams/2.6.2-SNAPSHOT/log4j-iostreams-2.6.2-SNAPSHOT.jar
[JENKINS] Archiving <https://builds.apache.org/job/Log4j%202.x/ws/log4j-iostreams/target/log4j-iostreams-2.6.2-SNAPSHOT-sources.jar> to org.apache.logging.log4j/log4j-iostreams/2.6.2-SNAPSHOT/log4j-iostreams-2.6.2-SNAPSHOT-sources.jar
[JENKINS] Archiving <https://builds.apache.org/job/Log4j%202.x/ws/log4j-to-slf4j/pom.xml> to org.apache.logging.log4j/log4j-to-slf4j/2.6.2-SNAPSHOT/log4j-to-slf4j-2.6.2-SNAPSHOT.pom
[JENKINS] Archiving <https://builds.apache.org/job/Log4j%202.x/ws/log4j-to-slf4j/target/log4j-to-slf4j-2.6.2-SNAPSHOT.jar> to org.apache.logging.log4j/log4j-to-slf4j/2.6.2-SNAPSHOT/log4j-to-slf4j-2.6.2-SNAPSHOT.jar
[JENKINS] Archiving <https://builds.apache.org/job/Log4j%202.x/ws/log4j-to-slf4j/target/log4j-to-slf4j-2.6.2-SNAPSHOT-sources.jar> to org.apache.logging.log4j/log4j-to-slf4j/2.6.2-SNAPSHOT/log4j-to-slf4j-2.6.2-SNAPSHOT-sources.jar
[JENKINS] Archiving <https://builds.apache.org/job/Log4j%202.x/ws/log4j-flume-ng/pom.xml> to org.apache.logging.log4j/log4j-flume-ng/2.6.2-SNAPSHOT/log4j-flume-ng-2.6.2-SNAPSHOT.pom
[JENKINS] Archiving <https://builds.apache.org/job/Log4j%202.x/ws/log4j-flume-ng/target/log4j-flume-ng-2.6.2-SNAPSHOT.jar> to org.apache.logging.log4j/log4j-flume-ng/2.6.2-SNAPSHOT/log4j-flume-ng-2.6.2-SNAPSHOT.jar
[JENKINS] Archiving <https://builds.apache.org/job/Log4j%202.x/ws/log4j-flume-ng/target/log4j-flume-ng-2.6.2-SNAPSHOT-tests.jar> to org.apache.logging.log4j/log4j-flume-ng/2.6.2-SNAPSHOT/log4j-flume-ng-2.6.2-SNAPSHOT-tests.jar
[JENKINS] Archiving <https://builds.apache.org/job/Log4j%202.x/ws/log4j-flume-ng/target/log4j-flume-ng-2.6.2-SNAPSHOT-sources.jar> to org.apache.logging.log4j/log4j-flume-ng/2.6.2-SNAPSHOT/log4j-flume-ng-2.6.2-SNAPSHOT-sources.jar
[JENKINS] Archiving <https://builds.apache.org/job/Log4j%202.x/ws/log4j-api/pom.xml> to org.apache.logging.log4j/log4j-api/2.6.2-SNAPSHOT/log4j-api-2.6.2-SNAPSHOT.pom
[JENKINS] Archiving <https://builds.apache.org/job/Log4j%202.x/ws/log4j-api/target/log4j-api-2.6.2-SNAPSHOT.jar> to org.apache.logging.log4j/log4j-api/2.6.2-SNAPSHOT/log4j-api-2.6.2-SNAPSHOT.jar
[JENKINS] Archiving <https://builds.apache.org/job/Log4j%202.x/ws/log4j-api/target/log4j-api-2.6.2-SNAPSHOT-tests.jar> to org.apache.logging.log4j/log4j-api/2.6.2-SNAPSHOT/log4j-api-2.6.2-SNAPSHOT-tests.jar
[JENKINS] Archiving <https://builds.apache.org/job/Log4j%202.x/ws/log4j-api/target/log4j-api-2.6.2-SNAPSHOT-sources.jar> to org.apache.logging.log4j/log4j-api/2.6.2-SNAPSHOT/log4j-api-2.6.2-SNAPSHOT-sources.jar
[JENKINS] Archiving <https://builds.apache.org/job/Log4j%202.x/ws/log4j-samples/flume-remote/pom.xml> to org.apache.logging.log4j.samples/log4j-samples-flume-remote/2.6.2-SNAPSHOT/log4j-samples-flume-remote-2.6.2-SNAPSHOT.pom
[JENKINS] Archiving <https://builds.apache.org/job/Log4j%202.x/ws/log4j-samples/flume-remote/target/log4j-samples-flume-remote-2.6.2-SNAPSHOT.war> to org.apache.logging.log4j.samples/log4j-samples-flume-remote/2.6.2-SNAPSHOT/log4j-samples-flume-remote-2.6.2-SNAPSHOT.war
[JENKINS] Archiving <https://builds.apache.org/job/Log4j%202.x/ws/log4j-samples/flume-remote/target/log4j-samples-flume-remote-2.6.2-SNAPSHOT-sources.jar> to org.apache.logging.log4j.samples/log4j-samples-flume-remote/2.6.2-SNAPSHOT/log4j-samples-flume-remote-2.6.2-SNAPSHOT-sources.jar
Compressed 14.21 MB of artifacts by 84.0% relative to #2023
[JENKINS] Archiving <https://builds.apache.org/job/Log4j%202.x/ws/log4j-samples/pom.xml> to org.apache.logging.log4j.samples/log4j-samples/2.6.2-SNAPSHOT/log4j-samples-2.6.2-SNAPSHOT.pom
channel stopped
Maven RedeployPublisher use remote H10 maven settings from : /home/jenkins/.m2/settings.xml
[INFO] Deployment in https://repository.apache.org/content/repositories/snapshots (id=apache.snapshots.https,uniqueVersion=true)
Deploying the main artifact log4j-2.6.2-SNAPSHOT.pom
Downloading: https://repository.apache.org/content/repositories/snapshots/org/apache/logging/log4j/log4j/2.6.2-SNAPSHOT/maven-metadata.xml
Downloaded: https://repository.apache.org/content/repositories/snapshots/org/apache/logging/log4j/log4j/2.6.2-SNAPSHOT/maven-metadata.xml (608 B at 4.6 KB/sec)
Uploading: https://repository.apache.org/content/repositories/snapshots/org/apache/logging/log4j/log4j/2.6.2-SNAPSHOT/log4j-2.6.2-20160612.131229-18.pom
Uploaded: https://repository.apache.org/content/repositories/snapshots/org/apache/logging/log4j/log4j/2.6.2-SNAPSHOT/log4j-2.6.2-20160612.131229-18.pom (51 KB at 0.9 KB/sec)
Downloading: https://repository.apache.org/content/repositories/snapshots/org/apache/logging/log4j/log4j/maven-metadata.xml
Downloaded: https://repository.apache.org/content/repositories/snapshots/org/apache/logging/log4j/log4j/maven-metadata.xml (616 B at 3.8 KB/sec)
Uploading: https://repository.apache.org/content/repositories/snapshots/org/apache/logging/log4j/log4j/2.6.2-SNAPSHOT/maven-metadata.xml
Uploaded: https://repository.apache.org/content/repositories/snapshots/org/apache/logging/log4j/log4j/2.6.2-SNAPSHOT/maven-metadata.xml (608 B at 0.0 KB/sec)
Uploading: https://repository.apache.org/content/repositories/snapshots/org/apache/logging/log4j/log4j/maven-metadata.xml
ERROR: Failed to deploy metadata: Could not transfer metadata org.apache.logging.log4j:log4j/maven-metadata.xml from/to apache.snapshots.https (https://repository.apache.org/content/repositories/snapshots): Failed to transfer file: https://repository.apache.org/content/repositories/snapshots/org/apache/logging/log4j/log4j/maven-metadata.xml. Return code is: 502, ReasonPhrase: Proxy Error.
org.apache.maven.artifact.deployer.ArtifactDeploymentException: Failed to deploy metadata: Could not transfer metadata org.apache.logging.log4j:log4j/maven-metadata.xml from/to apache.snapshots.https (https://repository.apache.org/content/repositories/snapshots): Failed to transfer file: https://repository.apache.org/content/repositories/snapshots/org/apache/logging/log4j/log4j/maven-metadata.xml. Return code is: 502, ReasonPhrase: Proxy Error.
at org.apache.maven.artifact.deployer.DefaultArtifactDeployer.deploy(DefaultArtifactDeployer.java:143)
at hudson.maven.reporters.MavenArtifactRecord.deploy(MavenArtifactRecord.java:193)
at hudson.maven.RedeployPublisher.perform(RedeployPublisher.java:176)
at hudson.tasks.BuildStepMonitor$1.perform(BuildStepMonitor.java:20)
at hudson.model.AbstractBuild$AbstractBuildExecution.perform(AbstractBuild.java:782)
at hudson.model.AbstractBuild$AbstractBuildExecution.performAllBuildSteps(AbstractBuild.java:723)
at hudson.maven.MavenModuleSetBuild$MavenModuleSetBuildExecution.post2(MavenModuleSetBuild.java:1047)
at hudson.model.AbstractBuild$AbstractBuildExecution.post(AbstractBuild.java:668)
at hudson.model.Run.execute(Run.java:1763)
at hudson.maven.MavenModuleSetBuild.run(MavenModuleSetBuild.java:531)
at hudson.model.ResourceController.execute(ResourceController.java:98)
at hudson.model.Executor.run(Executor.java:410)
Caused by: org.eclipse.aether.deployment.DeploymentException: Failed to deploy metadata: Could not transfer metadata org.apache.logging.log4j:log4j/maven-metadata.xml from/to apache.snapshots.https (https://repository.apache.org/content/repositories/snapshots): Failed to transfer file: https://repository.apache.org/content/repositories/snapshots/org/apache/logging/log4j/log4j/maven-metadata.xml. Return code is: 502, ReasonPhrase: Proxy Error.
at org.eclipse.aether.internal.impl.DefaultDeployer.deploy(DefaultDeployer.java:372)
at org.eclipse.aether.internal.impl.DefaultDeployer.deploy(DefaultDeployer.java:269)
at org.eclipse.aether.internal.impl.DefaultRepositorySystem.deploy(DefaultRepositorySystem.java:413)
at org.apache.maven.artifact.deployer.DefaultArtifactDeployer.deploy(DefaultArtifactDeployer.java:139)
... 11 more
Caused by: org.eclipse.aether.transfer.MetadataTransferException: Could not transfer metadata org.apache.logging.log4j:log4j/maven-metadata.xml from/to apache.snapshots.https (https://repository.apache.org/content/repositories/snapshots): Failed to transfer file: https://repository.apache.org/content/repositories/snapshots/org/apache/logging/log4j/log4j/maven-metadata.xml. Return code is: 502, ReasonPhrase: Proxy Error.
at org.eclipse.aether.connector.wagon.WagonRepositoryConnector$5.wrap(WagonRepositoryConnector.java:995)
at org.eclipse.aether.connector.wagon.WagonRepositoryConnector$5.wrap(WagonRepositoryConnector.java:983)
at org.eclipse.aether.connector.wagon.WagonRepositoryConnector$PutTask.run(WagonRepositoryConnector.java:895)
at org.eclipse.aether.connector.wagon.WagonRepositoryConnector.put(WagonRepositoryConnector.java:530)
at org.eclipse.aether.internal.impl.DefaultDeployer.deploy(DefaultDeployer.java:366)
... 14 more
Caused by: org.apache.maven.wagon.TransferFailedException: Failed to transfer file: https://repository.apache.org/content/repositories/snapshots/org/apache/logging/log4j/log4j/maven-metadata.xml. Return code is: 502, ReasonPhrase: Proxy Error.
at org.apache.maven.wagon.shared.http4.AbstractHttpClientWagon.put(AbstractHttpClientWagon.java:626)
at org.apache.maven.wagon.shared.http4.AbstractHttpClientWagon.put(AbstractHttpClientWagon.java:524)
at org.apache.maven.wagon.shared.http4.AbstractHttpClientWagon.put(AbstractHttpClientWagon.java:505)
at org.apache.maven.wagon.shared.http4.AbstractHttpClientWagon.put(AbstractHttpClientWagon.java:485)
at org.eclipse.aether.connector.wagon.WagonRepositoryConnector$PutTask.run(WagonRepositoryConnector.java:871)
... 16 more
[INFO] Deployment failed after 2 min 36 sec
Build step 'Deploy artifacts to Maven repository' changed build result to FAILURE
---------------------------------------------------------------------
To unsubscribe, e-mail: log4j-dev-unsubscribe@logging.apache.org
For additional commands, e-mail: log4j-dev-help@logging.apache.org
Re: Jenkins build is still unstable: Log4j 2.x #2023
Posted by Ralph Goers <ra...@dslextreme.com>.
Same test though
Sent from my iPad
> On Jun 12, 2016, at 11:02 AM, Matt Sicker <bo...@gmail.com> wrote:
>
> xz is the new friend, bz2 was the old friend. ;)
>
>> On 12 June 2016 at 08:11, Remko Popma <re...@gmail.com> wrote:
>> This was not your test that failed but our old friend xz.
>>
>>> On Sun, Jun 12, 2016 at 10:07 PM, Ralph Goers <ra...@dslextreme.com> wrote:
>>> Crap. I had hoped the change I made might have fixed it. There might be some more information in the test output though.
>>>
>>> Sent from my iPad
>>>
>>>> On Jun 12, 2016, at 3:42 AM, Remko Popma <re...@gmail.com> wrote:
>>>>
>>>> back to the old XZ failure...
>>>>
>>>>> On Sun, Jun 12, 2016 at 6:11 PM, Apache Jenkins Server <je...@builds.apache.org> wrote:
>>>>> See <https://builds.apache.org/job/Log4j%202.x/changes>
>>>>>
>>>>>
>>>>> ---------------------------------------------------------------------
>>>>> To unsubscribe, e-mail: log4j-dev-unsubscribe@logging.apache.org
>>>>> For additional commands, e-mail: log4j-dev-help@logging.apache.org
>>>>>
>>>>
>>
>
>
>
> --
> Matt Sicker <bo...@gmail.com>
Re: Jenkins build is still unstable: Log4j 2.x #2023
Posted by Matt Sicker <bo...@gmail.com>.
xz is the new friend, bz2 was the old friend. ;)
On 12 June 2016 at 08:11, Remko Popma <re...@gmail.com> wrote:
> This was not your test that failed but our old friend xz.
>
> On Sun, Jun 12, 2016 at 10:07 PM, Ralph Goers <ra...@dslextreme.com>
> wrote:
>
>> Crap. I had hoped the change I made might have fixed it. There might be
>> some more information in the test output though.
>>
>> Sent from my iPad
>>
>> On Jun 12, 2016, at 3:42 AM, Remko Popma <re...@gmail.com> wrote:
>>
>> back to the old XZ failure...
>>
>> On Sun, Jun 12, 2016 at 6:11 PM, Apache Jenkins Server <
>> jenkins@builds.apache.org> wrote:
>>
>>> See <https://builds.apache.org/job/Log4j%202.x/changes>
>>>
>>>
>>> ---------------------------------------------------------------------
>>> To unsubscribe, e-mail: log4j-dev-unsubscribe@logging.apache.org
>>> For additional commands, e-mail: log4j-dev-help@logging.apache.org
>>>
>>>
>>
>
--
Matt Sicker <bo...@gmail.com>
Re: Jenkins build is still unstable: Log4j 2.x #2023
Posted by Remko Popma <re...@gmail.com>.
This was not your test that failed but our old friend xz.
On Sun, Jun 12, 2016 at 10:07 PM, Ralph Goers <ra...@dslextreme.com>
wrote:
> Crap. I had hoped the change I made might have fixed it. There might be
> some more information in the test output though.
>
> Sent from my iPad
>
> On Jun 12, 2016, at 3:42 AM, Remko Popma <re...@gmail.com> wrote:
>
> back to the old XZ failure...
>
> On Sun, Jun 12, 2016 at 6:11 PM, Apache Jenkins Server <
> jenkins@builds.apache.org> wrote:
>
>> See <https://builds.apache.org/job/Log4j%202.x/changes>
>>
>>
>> ---------------------------------------------------------------------
>> To unsubscribe, e-mail: log4j-dev-unsubscribe@logging.apache.org
>> For additional commands, e-mail: log4j-dev-help@logging.apache.org
>>
>>
>
Re: Jenkins build is still unstable: Log4j 2.x #2023
Posted by Ralph Goers <ra...@dslextreme.com>.
Crap. I had hoped the change I made might have fixed it. There might be some more information in the test output though.
Sent from my iPad
> On Jun 12, 2016, at 3:42 AM, Remko Popma <re...@gmail.com> wrote:
>
> back to the old XZ failure...
>
>> On Sun, Jun 12, 2016 at 6:11 PM, Apache Jenkins Server <je...@builds.apache.org> wrote:
>> See <https://builds.apache.org/job/Log4j%202.x/changes>
>>
>>
>> ---------------------------------------------------------------------
>> To unsubscribe, e-mail: log4j-dev-unsubscribe@logging.apache.org
>> For additional commands, e-mail: log4j-dev-help@logging.apache.org
>
Re: Jenkins build is still unstable: Log4j 2.x #2023
Posted by Remko Popma <re...@gmail.com>.
back to the old XZ failure...
On Sun, Jun 12, 2016 at 6:11 PM, Apache Jenkins Server <
jenkins@builds.apache.org> wrote:
> See <https://builds.apache.org/job/Log4j%202.x/changes>
>
>
> ---------------------------------------------------------------------
> To unsubscribe, e-mail: log4j-dev-unsubscribe@logging.apache.org
> For additional commands, e-mail: log4j-dev-help@logging.apache.org
>
>
Jenkins build is still unstable: Log4j 2.x #2023
Posted by Apache Jenkins Server <je...@builds.apache.org>.
See <https://builds.apache.org/job/Log4j%202.x/changes>
---------------------------------------------------------------------
To unsubscribe, e-mail: log4j-dev-unsubscribe@logging.apache.org
For additional commands, e-mail: log4j-dev-help@logging.apache.org
Jenkins build is still unstable: Log4j 2.x #2021
Posted by Apache Jenkins Server <je...@builds.apache.org>.
See <https://builds.apache.org/job/Log4j%202.x/changes>
---------------------------------------------------------------------
To unsubscribe, e-mail: log4j-dev-unsubscribe@logging.apache.org
For additional commands, e-mail: log4j-dev-help@logging.apache.org
Jenkins build is still unstable: Log4j 2.x #2020
Posted by Apache Jenkins Server <je...@builds.apache.org>.
See <https://builds.apache.org/job/Log4j%202.x/changes>
---------------------------------------------------------------------
To unsubscribe, e-mail: log4j-dev-unsubscribe@logging.apache.org
For additional commands, e-mail: log4j-dev-help@logging.apache.org
Re: Jenkins build is unstable: Log4j 2.x #2019
Posted by Ralph Goers <ra...@dslextreme.com>.
Oh, but yes, if the first file is non-zero and the second file is zero then it should fail - and that would be a correct failure.
Ralph
> On Jun 12, 2016, at 12:38 AM, Ralph Goers <ra...@dslextreme.com> wrote:
>
> Both files write a header, 100 events and a footer. Neither should be zero and both should be the same length.
>
> Ralph
>
>> On Jun 11, 2016, at 11:44 PM, Remko Popma <remko.popma@gmail.com <ma...@gmail.com>> wrote:
>>
>> If the first file on the stream is non-zero length, and the second file is zero length, then won't the test fail?
>>
>> On Sun, Jun 12, 2016 at 2:45 PM, Ralph Goers <ralph.goers@dslextreme.com <ma...@dslextreme.com>> wrote:
>> Looked at the test again. It had some bugs in it.
>>
>> Ralph
>>
>>> On Jun 11, 2016, at 10:22 PM, Ralph Goers <ralph.goers@dslextreme.com <ma...@dslextreme.com>> wrote:
>>>
>>> Yes. It creates the file and writes to it. The test should then end and run again. On the second run the file should roll over. The files should both have the header, footer, and same number of lines so they should be the same size.
>>>
>>> Ralph
>>>
>>> On Jun 11, 2016, at 10:08 PM, Remko Popma <remko.popma@gmail.com <ma...@gmail.com>> wrote:
>>>
>>>> Hm... this is the second time I see this test fail:
>>>> Stacktrace
>>>>
>>>> java.lang.AssertionError
>>>> at org.apache.logging.log4j.core.appender.rolling.RollingAppenderOnStartupTest.afterClass(RollingAppenderOnStartupTest.java:85)
>>>>
>>>> What does this test do? It looks like it remembers the size of the first non-empty file in the directory, and then asserts that all other files are the same size, is that correct?
>>>>
>>>> @AfterClass
>>>> public static void afterClass() throws Exception {
>>>> long size = 0;
>>>> try (DirectoryStream<Path> directoryStream = Files.newDirectoryStream(Paths.get("target/onStartup"))) {
>>>> for (Path path : directoryStream) {
>>>> if (size == 0) {
>>>> size = Files.size(path);
>>>> } else {
>>>> assertTrue(size == Files.size(path)); // <- line 85
>>>> }
>>>> Files.delete(path);
>>>> }
>>>> Files.delete(Paths.get("target/onStartup"));
>>>> }
>>>> }
>>>>
>>>>
>>>>
>>>>
>>>>
>>>>
>>>>
>>>>
>>>>
>>>> On Sun, Jun 12, 2016 at 1:17 PM, Apache Jenkins Server <jenkins@builds.apache.org <ma...@builds.apache.org>> wrote:
>>>> See <https://builds.apache.org/job/Log4j%202.x/2019/changes <https://builds.apache.org/job/Log4j%202.x/2019/changes>>
>>>>
>>>>
>>>> ---------------------------------------------------------------------
>>>> To unsubscribe, e-mail: log4j-dev-unsubscribe@logging.apache.org <ma...@logging.apache.org>
>>>> For additional commands, e-mail: log4j-dev-help@logging.apache.org <ma...@logging.apache.org>
>>>>
>>>>
>>
>>
>
Re: Jenkins build is unstable: Log4j 2.x #2019
Posted by Ralph Goers <ra...@dslextreme.com>.
Both files write a header, 100 events and a footer. Neither should be zero and both should be the same length.
Ralph
> On Jun 11, 2016, at 11:44 PM, Remko Popma <re...@gmail.com> wrote:
>
> If the first file on the stream is non-zero length, and the second file is zero length, then won't the test fail?
>
> On Sun, Jun 12, 2016 at 2:45 PM, Ralph Goers <ralph.goers@dslextreme.com <ma...@dslextreme.com>> wrote:
> Looked at the test again. It had some bugs in it.
>
> Ralph
>
>> On Jun 11, 2016, at 10:22 PM, Ralph Goers <ralph.goers@dslextreme.com <ma...@dslextreme.com>> wrote:
>>
>> Yes. It creates the file and writes to it. The test should then end and run again. On the second run the file should roll over. The files should both have the header, footer, and same number of lines so they should be the same size.
>>
>> Ralph
>>
>> On Jun 11, 2016, at 10:08 PM, Remko Popma <remko.popma@gmail.com <ma...@gmail.com>> wrote:
>>
>>> Hm... this is the second time I see this test fail:
>>> Stacktrace
>>>
>>> java.lang.AssertionError
>>> at org.apache.logging.log4j.core.appender.rolling.RollingAppenderOnStartupTest.afterClass(RollingAppenderOnStartupTest.java:85)
>>>
>>> What does this test do? It looks like it remembers the size of the first non-empty file in the directory, and then asserts that all other files are the same size, is that correct?
>>>
>>> @AfterClass
>>> public static void afterClass() throws Exception {
>>> long size = 0;
>>> try (DirectoryStream<Path> directoryStream = Files.newDirectoryStream(Paths.get("target/onStartup"))) {
>>> for (Path path : directoryStream) {
>>> if (size == 0) {
>>> size = Files.size(path);
>>> } else {
>>> assertTrue(size == Files.size(path)); // <- line 85
>>> }
>>> Files.delete(path);
>>> }
>>> Files.delete(Paths.get("target/onStartup"));
>>> }
>>> }
>>>
>>>
>>>
>>>
>>>
>>>
>>>
>>>
>>>
>>> On Sun, Jun 12, 2016 at 1:17 PM, Apache Jenkins Server <jenkins@builds.apache.org <ma...@builds.apache.org>> wrote:
>>> See <https://builds.apache.org/job/Log4j%202.x/2019/changes <https://builds.apache.org/job/Log4j%202.x/2019/changes>>
>>>
>>>
>>> ---------------------------------------------------------------------
>>> To unsubscribe, e-mail: log4j-dev-unsubscribe@logging.apache.org <ma...@logging.apache.org>
>>> For additional commands, e-mail: log4j-dev-help@logging.apache.org <ma...@logging.apache.org>
>>>
>>>
>
>
Re: Jenkins build is unstable: Log4j 2.x #2019
Posted by Remko Popma <re...@gmail.com>.
If the first file on the stream is non-zero length, and the second file is
zero length, then won't the test fail?
On Sun, Jun 12, 2016 at 2:45 PM, Ralph Goers <ra...@dslextreme.com>
wrote:
> Looked at the test again. It had some bugs in it.
>
> Ralph
>
> On Jun 11, 2016, at 10:22 PM, Ralph Goers <ra...@dslextreme.com>
> wrote:
>
> Yes. It creates the file and writes to it. The test should then end and
> run again. On the second run the file should roll over. The files should
> both have the header, footer, and same number of lines so they should be
> the same size.
>
> Ralph
>
> On Jun 11, 2016, at 10:08 PM, Remko Popma <re...@gmail.com> wrote:
>
> Hm... this is the second time I see this test fail:
> Stacktrace
>
> java.lang.AssertionError
> at org.apache.logging.log4j.core.appender.rolling.RollingAppenderOnStartupTest.afterClass(RollingAppenderOnStartupTest.java:85)
>
>
> What does this test do? It looks like it remembers the size of the first
> non-empty file in the directory, and then asserts that all other files are
> the same size, is that correct?
>
> @AfterClass
> public static void afterClass() throws Exception {
> long size = 0;
> try (DirectoryStream<Path> directoryStream = Files.newDirectoryStream(Paths.get("target/onStartup"))) {
> for (Path path : directoryStream) {
> if (size == 0) {
> size = Files.size(path);
> } else {
> assertTrue(size == Files.size(path)); // <- line 85
> }
> Files.delete(path);
> }
> Files.delete(Paths.get("target/onStartup"));
> }
> }
>
>
>
>
>
>
>
>
>
>
> On Sun, Jun 12, 2016 at 1:17 PM, Apache Jenkins Server <
> jenkins@builds.apache.org> wrote:
>
>> See <https://builds.apache.org/job/Log4j%202.x/2019/changes>
>>
>>
>> ---------------------------------------------------------------------
>> To unsubscribe, e-mail: log4j-dev-unsubscribe@logging.apache.org
>> For additional commands, e-mail: log4j-dev-help@logging.apache.org
>>
>>
>
>
Re: Jenkins build is unstable: Log4j 2.x #2019
Posted by Ralph Goers <ra...@dslextreme.com>.
Looked at the test again. It had some bugs in it.
Ralph
> On Jun 11, 2016, at 10:22 PM, Ralph Goers <ra...@dslextreme.com> wrote:
>
> Yes. It creates the file and writes to it. The test should then end and run again. On the second run the file should roll over. The files should both have the header, footer, and same number of lines so they should be the same size.
>
> Ralph
>
> On Jun 11, 2016, at 10:08 PM, Remko Popma <remko.popma@gmail.com <ma...@gmail.com>> wrote:
>
>> Hm... this is the second time I see this test fail:
>> Stacktrace
>>
>> java.lang.AssertionError
>> at org.apache.logging.log4j.core.appender.rolling.RollingAppenderOnStartupTest.afterClass(RollingAppenderOnStartupTest.java:85)
>>
>> What does this test do? It looks like it remembers the size of the first non-empty file in the directory, and then asserts that all other files are the same size, is that correct?
>>
>> @AfterClass
>> public static void afterClass() throws Exception {
>> long size = 0;
>> try (DirectoryStream<Path> directoryStream = Files.newDirectoryStream(Paths.get("target/onStartup"))) {
>> for (Path path : directoryStream) {
>> if (size == 0) {
>> size = Files.size(path);
>> } else {
>> assertTrue(size == Files.size(path)); // <- line 85
>> }
>> Files.delete(path);
>> }
>> Files.delete(Paths.get("target/onStartup"));
>> }
>> }
>>
>>
>>
>>
>>
>>
>>
>>
>>
>> On Sun, Jun 12, 2016 at 1:17 PM, Apache Jenkins Server <jenkins@builds.apache.org <ma...@builds.apache.org>> wrote:
>> See <https://builds.apache.org/job/Log4j%202.x/2019/changes <https://builds.apache.org/job/Log4j%202.x/2019/changes>>
>>
>>
>> ---------------------------------------------------------------------
>> To unsubscribe, e-mail: log4j-dev-unsubscribe@logging.apache.org <ma...@logging.apache.org>
>> For additional commands, e-mail: log4j-dev-help@logging.apache.org <ma...@logging.apache.org>
>>
>>
Re: Jenkins build is unstable: Log4j 2.x #2019
Posted by Ralph Goers <ra...@dslextreme.com>.
Yes. It creates the file and writes to it. The test should then end and run again. On the second run the file should roll over. The files should both have the header, footer, and same number of lines so they should be the same size.
Ralph
> On Jun 11, 2016, at 10:08 PM, Remko Popma <re...@gmail.com> wrote:
>
> Hm... this is the second time I see this test fail:
> Stacktrace
>
> java.lang.AssertionError
> at org.apache.logging.log4j.core.appender.rolling.RollingAppenderOnStartupTest.afterClass(RollingAppenderOnStartupTest.java:85)
>
> What does this test do? It looks like it remembers the size of the first non-empty file in the directory, and then asserts that all other files are the same size, is that correct?
>
> @AfterClass
> public static void afterClass() throws Exception {
> long size = 0;
> try (DirectoryStream<Path> directoryStream = Files.newDirectoryStream(Paths.get("target/onStartup"))) {
> for (Path path : directoryStream) {
> if (size == 0) {
> size = Files.size(path);
> } else {
> assertTrue(size == Files.size(path)); // <- line 85
> }
> Files.delete(path);
> }
> Files.delete(Paths.get("target/onStartup"));
> }
> }
>
>
>
>
>
>
>
>
>
>> On Sun, Jun 12, 2016 at 1:17 PM, Apache Jenkins Server <je...@builds.apache.org> wrote:
>> See <https://builds.apache.org/job/Log4j%202.x/2019/changes>
>>
>>
>> ---------------------------------------------------------------------
>> To unsubscribe, e-mail: log4j-dev-unsubscribe@logging.apache.org
>> For additional commands, e-mail: log4j-dev-help@logging.apache.org
>
Re: Jenkins build is unstable: Log4j 2.x #2019
Posted by Remko Popma <re...@gmail.com>.
Hm... this is the second time I see this test fail:
Stacktrace
java.lang.AssertionError
at org.apache.logging.log4j.core.appender.rolling.RollingAppenderOnStartupTest.afterClass(RollingAppenderOnStartupTest.java:85)
What does this test do? It looks like it remembers the size of the first
non-empty file in the directory, and then asserts that all other files are
the same size, is that correct?
@AfterClass
public static void afterClass() throws Exception {
long size = 0;
try (DirectoryStream<Path> directoryStream =
Files.newDirectoryStream(Paths.get("target/onStartup"))) {
for (Path path : directoryStream) {
if (size == 0) {
size = Files.size(path);
} else {
assertTrue(size == Files.size(path)); // <- line 85
}
Files.delete(path);
}
Files.delete(Paths.get("target/onStartup"));
}
}
On Sun, Jun 12, 2016 at 1:17 PM, Apache Jenkins Server <
jenkins@builds.apache.org> wrote:
> See <https://builds.apache.org/job/Log4j%202.x/2019/changes>
>
>
> ---------------------------------------------------------------------
> To unsubscribe, e-mail: log4j-dev-unsubscribe@logging.apache.org
> For additional commands, e-mail: log4j-dev-help@logging.apache.org
>
>
Jenkins build is unstable: Log4j 2.x #2019
Posted by Apache Jenkins Server <je...@builds.apache.org>.
See <https://builds.apache.org/job/Log4j%202.x/2019/changes>
---------------------------------------------------------------------
To unsubscribe, e-mail: log4j-dev-unsubscribe@logging.apache.org
For additional commands, e-mail: log4j-dev-help@logging.apache.org
Build failed in Jenkins: Log4j 2.x #2018
Posted by Apache Jenkins Server <je...@builds.apache.org>.
See <https://builds.apache.org/job/Log4j%202.x/2018/changes>
Changes:
[rgoers] LOG4J-1420 - RollingRandomAccessFileManager was not properly rolling
------------------------------------------
[...truncated 1732 lines...]
jdk1.7.0_51/jre/lib/zi/Asia/Jerusalem
jdk1.7.0_51/jre/lib/zi/Asia/Riyadh
jdk1.7.0_51/jre/lib/zi/Asia/Kamchatka
jdk1.7.0_51/jre/lib/zi/WET
jdk1.7.0_51/jre/lib/zi/PST8PDT
jdk1.7.0_51/jre/lib/images/
jdk1.7.0_51/jre/lib/images/icons/
jdk1.7.0_51/jre/lib/images/icons/sun-java_HighContrast.png
jdk1.7.0_51/jre/lib/images/icons/sun-java_HighContrastInverse.png
jdk1.7.0_51/jre/lib/images/icons/sun-java_LowContrast.png
jdk1.7.0_51/jre/lib/images/icons/sun-java.png
jdk1.7.0_51/jre/lib/images/cursors/
jdk1.7.0_51/jre/lib/images/cursors/motif_MoveDrop32x32.gif
jdk1.7.0_51/jre/lib/images/cursors/cursors.properties
jdk1.7.0_51/jre/lib/images/cursors/motif_MoveNoDrop32x32.gif
jdk1.7.0_51/jre/lib/images/cursors/motif_CopyNoDrop32x32.gif
jdk1.7.0_51/jre/lib/images/cursors/motif_LinkNoDrop32x32.gif
jdk1.7.0_51/jre/lib/images/cursors/motif_LinkDrop32x32.gif
jdk1.7.0_51/jre/lib/images/cursors/invalid32x32.gif
jdk1.7.0_51/jre/lib/images/cursors/motif_CopyDrop32x32.gif
jdk1.7.0_51/jre/lib/jfr.jar
jdk1.7.0_51/jre/lib/jvm.hprof.txt
jdk1.7.0_51/jre/lib/amd64/
jdk1.7.0_51/jre/lib/amd64/libjsoundalsa.so
jdk1.7.0_51/jre/lib/amd64/libkcms.so
jdk1.7.0_51/jre/lib/amd64/libjfxmedia.so
jdk1.7.0_51/jre/lib/amd64/libjpeg.so
jdk1.7.0_51/jre/lib/amd64/libnio.so
jdk1.7.0_51/jre/lib/amd64/libfontmanager.so
jdk1.7.0_51/jre/lib/amd64/libhprof.so
jdk1.7.0_51/jre/lib/amd64/libjsig.so
jdk1.7.0_51/jre/lib/amd64/libinstrument.so
jdk1.7.0_51/jre/lib/amd64/libnet.so
jdk1.7.0_51/jre/lib/amd64/libattach.so
jdk1.7.0_51/jre/lib/amd64/libsaproc.so
jdk1.7.0_51/jre/lib/amd64/jli/
jdk1.7.0_51/jre/lib/amd64/jli/libjli.so
jdk1.7.0_51/jre/lib/amd64/libjfxwebkit.so
jdk1.7.0_51/jre/lib/amd64/libnpt.so
jdk1.7.0_51/jre/lib/amd64/libjavafx-font.so
jdk1.7.0_51/jre/lib/amd64/libawt.so
jdk1.7.0_51/jre/lib/amd64/libprism-es2.so
jdk1.7.0_51/jre/lib/amd64/libsplashscreen.so
jdk1.7.0_51/jre/lib/amd64/libj2pcsc.so
jdk1.7.0_51/jre/lib/amd64/libmlib_image.so
jdk1.7.0_51/jre/lib/amd64/libj2pkcs11.so
jdk1.7.0_51/jre/lib/amd64/libsctp.so
jdk1.7.0_51/jre/lib/amd64/libdt_socket.so
jdk1.7.0_51/jre/lib/amd64/libjavafx-iio.so
jdk1.7.0_51/jre/lib/amd64/libjavaplugin_jni.so
jdk1.7.0_51/jre/lib/amd64/libgstplugins-lite.so
jdk1.7.0_51/jre/lib/amd64/libsunec.so
jdk1.7.0_51/jre/lib/amd64/libnpjp2.so
jdk1.7.0_51/jre/lib/amd64/libdeploy.so
jdk1.7.0_51/jre/lib/amd64/libjava_crw_demo.so
jdk1.7.0_51/jre/lib/amd64/libunpack.so
jdk1.7.0_51/jre/lib/amd64/libjfr.so
jdk1.7.0_51/jre/lib/amd64/libj2gss.so
jdk1.7.0_51/jre/lib/amd64/libt2k.so
jdk1.7.0_51/jre/lib/amd64/libverify.so
jdk1.7.0_51/jre/lib/amd64/libdcpr.so
jdk1.7.0_51/jre/lib/amd64/libjava.so
jdk1.7.0_51/jre/lib/amd64/libJdbcOdbc.so
jdk1.7.0_51/jre/lib/amd64/fxavcodecplugin-52.so
jdk1.7.0_51/jre/lib/amd64/server/
jdk1.7.0_51/jre/lib/amd64/server/libjsig.so
jdk1.7.0_51/jre/lib/amd64/server/Xusage.txt
jdk1.7.0_51/jre/lib/amd64/server/libjvm.so
jdk1.7.0_51/jre/lib/amd64/fxplugins.so
jdk1.7.0_51/jre/lib/amd64/xawt/
jdk1.7.0_51/jre/lib/amd64/xawt/libmawt.so
jdk1.7.0_51/jre/lib/amd64/fxavcodecplugin-53.so
jdk1.7.0_51/jre/lib/amd64/libjaas_unix.so
jdk1.7.0_51/jre/lib/amd64/libgstreamer-lite.so
jdk1.7.0_51/jre/lib/amd64/libmanagement.so
jdk1.7.0_51/jre/lib/amd64/jvm.cfg
jdk1.7.0_51/jre/lib/amd64/libjsdt.so
jdk1.7.0_51/jre/lib/amd64/libzip.so
jdk1.7.0_51/jre/lib/amd64/libglass.so
jdk1.7.0_51/jre/lib/amd64/headless/
jdk1.7.0_51/jre/lib/amd64/headless/libmawt.so
jdk1.7.0_51/jre/lib/amd64/libjsound.so
jdk1.7.0_51/jre/lib/amd64/libjdwp.so
jdk1.7.0_51/jre/lib/amd64/libjawt.so
jdk1.7.0_51/jre/lib/fontconfig.SuSE.10.bfc
jdk1.7.0_51/jre/lib/classlist
jdk1.7.0_51/jre/lib/management-agent.jar
jdk1.7.0_51/jre/lib/javaws.jar
jdk1.7.0_51/jre/lib/psfontj2d.properties
jdk1.7.0_51/jre/lib/rt.jar
jdk1.7.0_51/jre/lib/calendars.properties
jdk1.7.0_51/jre/lib/security/
jdk1.7.0_51/jre/lib/security/local_policy.jar
jdk1.7.0_51/jre/lib/security/trusted.libraries
jdk1.7.0_51/jre/lib/security/javafx.policy
jdk1.7.0_51/jre/lib/security/cacerts
jdk1.7.0_51/jre/lib/security/java.policy
jdk1.7.0_51/jre/lib/security/US_export_policy.jar
jdk1.7.0_51/jre/lib/security/java.security
jdk1.7.0_51/jre/lib/security/blacklist
jdk1.7.0_51/jre/lib/security/javaws.policy
jdk1.7.0_51/jre/lib/jfxrt.jar
jdk1.7.0_51/jre/lib/fontconfig.Turbo.properties.src
jdk1.7.0_51/jre/lib/jfr/
jdk1.7.0_51/jre/lib/jfr/profile.jfc
jdk1.7.0_51/jre/lib/jfr/default.jfc
jdk1.7.0_51/jre/lib/fontconfig.RedHat.5.properties.src
jdk1.7.0_51/jre/lib/net.properties
jdk1.7.0_51/jre/lib/content-types.properties
jdk1.7.0_51/jre/lib/fontconfig.RedHat.5.bfc
jdk1.7.0_51/jre/lib/alt-rt.jar
jdk1.7.0_51/jre/lib/logging.properties
jdk1.7.0_51/jre/lib/applet/
jdk1.7.0_51/jre/lib/cmm/
jdk1.7.0_51/jre/lib/cmm/LINEAR_RGB.pf
jdk1.7.0_51/jre/lib/cmm/GRAY.pf
jdk1.7.0_51/jre/lib/cmm/sRGB.pf
jdk1.7.0_51/jre/lib/cmm/PYCC.pf
jdk1.7.0_51/jre/lib/cmm/CIEXYZ.pf
jdk1.7.0_51/jre/lib/locale/
jdk1.7.0_51/jre/lib/locale/zh_TW.BIG5/
jdk1.7.0_51/jre/lib/locale/zh_TW.BIG5/LC_MESSAGES/
jdk1.7.0_51/jre/lib/locale/zh_TW.BIG5/LC_MESSAGES/sunw_java_plugin.mo
jdk1.7.0_51/jre/lib/locale/pt_BR/
jdk1.7.0_51/jre/lib/locale/pt_BR/LC_MESSAGES/
jdk1.7.0_51/jre/lib/locale/pt_BR/LC_MESSAGES/sunw_java_plugin.mo
jdk1.7.0_51/jre/lib/locale/de/
jdk1.7.0_51/jre/lib/locale/de/LC_MESSAGES/
jdk1.7.0_51/jre/lib/locale/de/LC_MESSAGES/sunw_java_plugin.mo
jdk1.7.0_51/jre/lib/locale/it/
jdk1.7.0_51/jre/lib/locale/it/LC_MESSAGES/
jdk1.7.0_51/jre/lib/locale/it/LC_MESSAGES/sunw_java_plugin.mo
jdk1.7.0_51/jre/lib/locale/zh_TW/
jdk1.7.0_51/jre/lib/locale/zh_TW/LC_MESSAGES/
jdk1.7.0_51/jre/lib/locale/zh_TW/LC_MESSAGES/sunw_java_plugin.mo
jdk1.7.0_51/jre/lib/locale/zh/
jdk1.7.0_51/jre/lib/locale/zh/LC_MESSAGES/
jdk1.7.0_51/jre/lib/locale/zh/LC_MESSAGES/sunw_java_plugin.mo
jdk1.7.0_51/jre/lib/locale/ja/
jdk1.7.0_51/jre/lib/locale/ja/LC_MESSAGES/
jdk1.7.0_51/jre/lib/locale/ja/LC_MESSAGES/sunw_java_plugin.mo
jdk1.7.0_51/jre/lib/locale/fr/
jdk1.7.0_51/jre/lib/locale/fr/LC_MESSAGES/
jdk1.7.0_51/jre/lib/locale/fr/LC_MESSAGES/sunw_java_plugin.mo
jdk1.7.0_51/jre/lib/locale/ko/
jdk1.7.0_51/jre/lib/locale/ko/LC_MESSAGES/
jdk1.7.0_51/jre/lib/locale/ko/LC_MESSAGES/sunw_java_plugin.mo
jdk1.7.0_51/jre/lib/locale/ko.UTF-8/
jdk1.7.0_51/jre/lib/locale/ko.UTF-8/LC_MESSAGES/
jdk1.7.0_51/jre/lib/locale/ko.UTF-8/LC_MESSAGES/sunw_java_plugin.mo
jdk1.7.0_51/jre/lib/locale/zh.GBK/
jdk1.7.0_51/jre/lib/locale/zh.GBK/LC_MESSAGES/
jdk1.7.0_51/jre/lib/locale/zh.GBK/LC_MESSAGES/sunw_java_plugin.mo
jdk1.7.0_51/jre/lib/locale/sv/
jdk1.7.0_51/jre/lib/locale/sv/LC_MESSAGES/
jdk1.7.0_51/jre/lib/locale/sv/LC_MESSAGES/sunw_java_plugin.mo
jdk1.7.0_51/jre/lib/locale/zh_HK.BIG5HK/
jdk1.7.0_51/jre/lib/locale/zh_HK.BIG5HK/LC_MESSAGES/
jdk1.7.0_51/jre/lib/locale/zh_HK.BIG5HK/LC_MESSAGES/sunw_java_plugin.mo
jdk1.7.0_51/jre/lib/locale/es/
jdk1.7.0_51/jre/lib/locale/es/LC_MESSAGES/
jdk1.7.0_51/jre/lib/locale/es/LC_MESSAGES/sunw_java_plugin.mo
jdk1.7.0_51/jre/lib/fonts/
jdk1.7.0_51/jre/lib/fonts/LucidaBrightDemiBold.ttf
jdk1.7.0_51/jre/lib/fonts/LucidaBrightItalic.ttf
jdk1.7.0_51/jre/lib/fonts/LucidaSansDemiBold.ttf
jdk1.7.0_51/jre/lib/fonts/LucidaTypewriterRegular.ttf
jdk1.7.0_51/jre/lib/fonts/LucidaBrightDemiItalic.ttf
jdk1.7.0_51/jre/lib/fonts/LucidaTypewriterBold.ttf
jdk1.7.0_51/jre/lib/fonts/LucidaSansRegular.ttf
jdk1.7.0_51/jre/lib/fonts/fonts.dir
jdk1.7.0_51/jre/lib/fonts/LucidaBrightRegular.ttf
jdk1.7.0_51/jre/lib/ext/
jdk1.7.0_51/jre/lib/ext/sunjce_provider.jar
jdk1.7.0_51/jre/lib/ext/meta-index
jdk1.7.0_51/jre/lib/ext/zipfs.jar
jdk1.7.0_51/jre/lib/ext/sunpkcs11.jar
jdk1.7.0_51/jre/lib/ext/dnsns.jar
jdk1.7.0_51/jre/lib/ext/localedata.jar
jdk1.7.0_51/jre/lib/ext/sunec.jar
jdk1.7.0_51/jre/lib/fontconfig.Turbo.bfc
jdk1.7.0_51/jre/lib/fontconfig.properties.src
jdk1.7.0_51/jre/lib/jce.jar
jdk1.7.0_51/jre/lib/fontconfig.RedHat.6.bfc
jdk1.7.0_51/jre/lib/currency.data
jdk1.7.0_51/jre/lib/javafx.properties
jdk1.7.0_51/jre/THIRDPARTYLICENSEREADME.txt
jdk1.7.0_51/jre/Welcome.html
jdk1.7.0_51/jre/LICENSE
jdk1.7.0_51/jre/plugin/
jdk1.7.0_51/jre/plugin/desktop/
jdk1.7.0_51/jre/plugin/desktop/sun_java.png
jdk1.7.0_51/jre/plugin/desktop/sun_java.desktop
jdk1.7.0_51/jre/COPYRIGHT
jdk1.7.0_51/jre/THIRDPARTYLICENSEREADME-JAVAFX.txt
jdk1.7.0_51/LICENSE
jdk1.7.0_51/COPYRIGHT
jdk1.7.0_51/THIRDPARTYLICENSEREADME-JAVAFX.txt
Building remotely on ubuntu-1 (docker Ubuntu ubuntu yahoo-not-h2 ubuntu1) in workspace <https://builds.apache.org/job/Log4j%202.x/ws/>
Cloning the remote Git repository
Cloning repository https://git-wip-us.apache.org/repos/asf/logging-log4j2.git
> git init <https://builds.apache.org/job/Log4j%202.x/ws/> # timeout=10
Fetching upstream changes from https://git-wip-us.apache.org/repos/asf/logging-log4j2.git
> git --version # timeout=10
> git -c core.askpass=true fetch --tags --progress https://git-wip-us.apache.org/repos/asf/logging-log4j2.git +refs/heads/*:refs/remotes/origin/*
> git config remote.origin.url https://git-wip-us.apache.org/repos/asf/logging-log4j2.git # timeout=10
> git config --add remote.origin.fetch +refs/heads/*:refs/remotes/origin/* # timeout=10
> git config remote.origin.url https://git-wip-us.apache.org/repos/asf/logging-log4j2.git # timeout=10
Fetching upstream changes from https://git-wip-us.apache.org/repos/asf/logging-log4j2.git
> git -c core.askpass=true fetch --tags --progress https://git-wip-us.apache.org/repos/asf/logging-log4j2.git +refs/heads/*:refs/remotes/origin/*
> git rev-parse refs/remotes/origin/master^{commit} # timeout=10
> git rev-parse refs/remotes/origin/origin/master^{commit} # timeout=10
Checking out Revision 0c556aecb20f807d2838073add3b29be61a5cd3b (refs/remotes/origin/master)
> git config core.sparsecheckout # timeout=10
> git checkout -f 0c556aecb20f807d2838073add3b29be61a5cd3b
> git rev-list fa90960708bb25183971a392d9e10a78301ae775 # timeout=10
[EnvInject] - Executing scripts and injecting environment variables after the SCM step.
[EnvInject] - Injecting as environment variables the properties content
LANG=en_US.UTF-8
[EnvInject] - Variables injected successfully.
Parsing POMs
Downloaded artifact http://repo.maven.apache.org/maven2/org/apache/apache/9/apache-9.pom
Modules changed, recalculating dependency graph
Established TCP socket on 42474
maven32-agent.jar already up to date
maven32-interceptor.jar already up to date
maven3-interceptor-commons.jar already up to date
[Log4j 2.x] $ /home/jenkins/jenkins-slave/tools/hudson.model.JDK/jdk-1.7u51/bin/java -Xmx2g -Xms256m -XX:MaxPermSize=512m -cp /home/jenkins/jenkins-slave/maven32-agent.jar:/home/jenkins/jenkins-slave/tools/hudson.tasks.Maven_MavenInstallation/maven-3.2.1/boot/plexus-classworlds-2.5.1.jar:/home/jenkins/jenkins-slave/tools/hudson.tasks.Maven_MavenInstallation/maven-3.2.1/conf/logging jenkins.maven3.agent.Maven32Main /home/jenkins/jenkins-slave/tools/hudson.tasks.Maven_MavenInstallation/maven-3.2.1 /home/jenkins/jenkins-slave/slave.jar /home/jenkins/jenkins-slave/maven32-interceptor.jar /home/jenkins/jenkins-slave/maven3-interceptor-commons.jar 42474
Exception in thread "main" java.lang.ClassNotFoundException: hudson.remoting.Launcher
at org.codehaus.plexus.classworlds.strategy.SelfFirstStrategy.loadClass(SelfFirstStrategy.java:50)
at org.codehaus.plexus.classworlds.realm.ClassRealm.unsynchronizedLoadClass(ClassRealm.java:259)
at org.codehaus.plexus.classworlds.realm.ClassRealm.loadClass(ClassRealm.java:235)
at org.codehaus.plexus.classworlds.realm.ClassRealm.loadClass(ClassRealm.java:227)
at jenkins.maven3.agent.Maven32Main.main(Maven32Main.java:143)
at jenkins.maven3.agent.Maven32Main.main(Maven32Main.java:74)
ERROR: Failed to parse POMs
java.io.EOFException: unexpected stream termination
at hudson.remoting.ChannelBuilder.negotiate(ChannelBuilder.java:365)
at hudson.remoting.ChannelBuilder.build(ChannelBuilder.java:310)
at hudson.slaves.Channels.forProcess(Channels.java:115)
at hudson.maven.AbstractMavenProcessFactory.newProcess(AbstractMavenProcessFactory.java:297)
at hudson.maven.ProcessCache.get(ProcessCache.java:236)
at hudson.maven.MavenModuleSetBuild$MavenModuleSetBuildExecution.doRun(MavenModuleSetBuild.java:778)
at hudson.model.AbstractBuild$AbstractBuildExecution.run(AbstractBuild.java:534)
at hudson.model.Run.execute(Run.java:1738)
at hudson.maven.MavenModuleSetBuild.run(MavenModuleSetBuild.java:531)
at hudson.model.ResourceController.execute(ResourceController.java:98)
at hudson.model.Executor.run(Executor.java:410)
---------------------------------------------------------------------
To unsubscribe, e-mail: log4j-dev-unsubscribe@logging.apache.org
For additional commands, e-mail: log4j-dev-help@logging.apache.org
Re: Jenkins build is still unstable: Log4j 2.x #2017
Posted by Remko Popma <re...@gmail.com>.
It's our old friend XZ.
Sent from my iPhone
> On 2016/06/11, at 18:08, Apache Jenkins Server <je...@builds.apache.org> wrote:
>
> See <https://builds.apache.org/job/Log4j%202.x/changes>
>
>
> ---------------------------------------------------------------------
> To unsubscribe, e-mail: log4j-dev-unsubscribe@logging.apache.org
> For additional commands, e-mail: log4j-dev-help@logging.apache.org
>
---------------------------------------------------------------------
To unsubscribe, e-mail: log4j-dev-unsubscribe@logging.apache.org
For additional commands, e-mail: log4j-dev-help@logging.apache.org
Jenkins build is still unstable: Log4j 2.x #2017
Posted by Apache Jenkins Server <je...@builds.apache.org>.
See <https://builds.apache.org/job/Log4j%202.x/changes>
---------------------------------------------------------------------
To unsubscribe, e-mail: log4j-dev-unsubscribe@logging.apache.org
For additional commands, e-mail: log4j-dev-help@logging.apache.org
Jenkins build is unstable: Log4j 2.x #2016
Posted by Apache Jenkins Server <je...@builds.apache.org>.
See <https://builds.apache.org/job/Log4j%202.x/2016/changes>
---------------------------------------------------------------------
To unsubscribe, e-mail: log4j-dev-unsubscribe@logging.apache.org
For additional commands, e-mail: log4j-dev-help@logging.apache.org