You are viewing a plain text version of this content. The canonical link for it is here.
Posted to builds@beam.apache.org by Apache Jenkins Server <je...@builds.apache.org> on 2024/01/24 07:40:32 UTC

Build failed in Jenkins: beam_PostCommit_Java_DataflowV2 #4024

See <https://ci-beam.apache.org/job/beam_PostCommit_Java_DataflowV2/4024/display/redirect>

Changes:


------------------------------------------
[...truncated 49.58 KB...]
  Attempting uninstall: setuptools
    Found existing installation: setuptools 44.0.0
    Uninstalling setuptools-44.0.0:
      Successfully uninstalled setuptools-44.0.0
Successfully installed pip-23.3.2 setuptools-69.0.3 wheel-0.42.0
Collecting beautifulsoup4<5.0,>=4.9.0 (from -r <https://ci-beam.apache.org/job/beam_PostCommit_Java_DataflowV2/ws/src/sdks/java/container/license_scripts/requirement.txt> (line 19))
  Using cached beautifulsoup4-4.12.3-py3-none-any.whl.metadata (3.8 kB)
Collecting pyyaml<7,>=6.0.1 (from -r <https://ci-beam.apache.org/job/beam_PostCommit_Java_DataflowV2/ws/src/sdks/java/container/license_scripts/requirement.txt> (line 20))
  Using cached PyYAML-6.0.1-cp38-cp38-manylinux_2_17_x86_64.manylinux2014_x86_64.whl.metadata (2.1 kB)
Collecting tenacity<9.0,>=6.1.0 (from -r <https://ci-beam.apache.org/job/beam_PostCommit_Java_DataflowV2/ws/src/sdks/java/container/license_scripts/requirement.txt> (line 21))
  Using cached tenacity-8.2.3-py3-none-any.whl.metadata (1.0 kB)
Collecting soupsieve>1.2 (from beautifulsoup4<5.0,>=4.9.0->-r <https://ci-beam.apache.org/job/beam_PostCommit_Java_DataflowV2/ws/src/sdks/java/container/license_scripts/requirement.txt> (line 19))
  Using cached soupsieve-2.5-py3-none-any.whl.metadata (4.7 kB)
Using cached beautifulsoup4-4.12.3-py3-none-any.whl (147 kB)
Using cached PyYAML-6.0.1-cp38-cp38-manylinux_2_17_x86_64.manylinux2014_x86_64.whl (736 kB)
Using cached tenacity-8.2.3-py3-none-any.whl (24 kB)
Using cached soupsieve-2.5-py3-none-any.whl (36 kB)
Installing collected packages: tenacity, soupsieve, pyyaml, beautifulsoup4
Successfully installed beautifulsoup4-4.12.3 pyyaml-6.0.1 soupsieve-2.5 tenacity-8.2.3
Executing python <https://ci-beam.apache.org/job/beam_PostCommit_Java_DataflowV2/ws/src/sdks/java/container/license_scripts/pull_licenses_java.py> --license_index=<https://ci-beam.apache.org/job/beam_PostCommit_Java_DataflowV2/ws/src/sdks/java/container/build/reports/dependency-license/index.json>        --output_dir=<https://ci-beam.apache.org/job/beam_PostCommit_Java_DataflowV2/ws/src/sdks/java/container/build/target/java_third_party_licenses>        --dep_url_yaml=<https://ci-beam.apache.org/job/beam_PostCommit_Java_DataflowV2/ws/src/sdks/java/container/license_scripts/dep_urls_java.yaml>        --manual_license_path=<https://ci-beam.apache.org/job/beam_PostCommit_Java_DataflowV2/ws/src/sdks/java/container/license_scripts/manual_licenses>
INFO:root:Pulling license for 129 dependencies using 16 threads.
INFO:root:Replaced local file URL with file://<https://ci-beam.apache.org/job/beam_PostCommit_Java_DataflowV2/ws/src/sdks/java/container/license_scripts/manual_licenses/xz/COPYING> for xz-1.5
INFO:root:pull_licenses_java.py succeed. It took 1.651004 seconds with 16 threads.
Copying licenses from <https://ci-beam.apache.org/job/beam_PostCommit_Java_DataflowV2/ws/src/sdks/java/container/build/target/java_third_party_licenses> to <https://ci-beam.apache.org/job/beam_PostCommit_Java_DataflowV2/ws/src/sdks/java/container/build/target/third_party_licenses.>
Finished license_scripts.sh

> Task :sdks:java:testing:test-utils:compileJava
> Task :sdks:java:testing:test-utils:classes
> Task :sdks:java:testing:test-utils:jar

> Task :release:go-licenses:java:dockerRun
go: downloading github.com/golang/protobuf v1.5.3
go: downloading google.golang.org/grpc v1.59.0
go: downloading google.golang.org/protobuf v1.31.0
go: downloading golang.org/x/sys v0.15.0
go: downloading google.golang.org/genproto/googleapis/rpc v0.0.0-20231120223509-83a465c0220f
go: downloading golang.org/x/net v0.19.0
go: downloading google.golang.org/genproto v0.0.0-20231106174013-bbf56f31fb17
go: downloading golang.org/x/text v0.14.0
go: added github.com/apache/beam/sdks/v2 v2.53.0
go: added github.com/golang/protobuf v1.5.3
go: added golang.org/x/net v0.19.0
go: added golang.org/x/sys v0.15.0
go: added golang.org/x/text v0.14.0
go: added google.golang.org/genproto/googleapis/rpc v0.0.0-20231120223509-83a465c0220f
go: added google.golang.org/grpc v1.59.0
go: added google.golang.org/protobuf v1.31.0
+ go-licenses save github.com/apache/beam/sdks/v2/java/container --save_path=/output/licenses
W0124 03:58:00.047955      32 library.go:101] "golang.org/x/sys/unix" contains non-Go code that can't be inspected for further dependencies:
/go/pkg/mod/golang.org/x/sys@v0.15.0/unix/asm_linux_amd64.s

> Task :sdks:java:testing:test-utils:compileTestJava FROM-CACHE
> Task :sdks:java:testing:test-utils:testClasses UP-TO-DATE
> Task :sdks:java:testing:test-utils:testJar
> Task :sdks:java:container:java8:copyJavaThirdPartyLicenses

> Task :sdks:java:container:downloadCloudProfilerAgent
  % Total    % Received % Xferd  Average Speed   Time    Time     Time  Current
                                 Dload  Upload   Total   Spent    Left  Speed
  0     0    0     0    0     0      0      0 --:--:-- --:--:-- --:--:--     0version.txt
NOTICES
profiler_java_agent.so
100 4183k  100 4183k    0     0  19.0M      0 --:--:-- --:--:-- --:--:-- 19.0M

> Task :sdks:java:container:goPrepare UP-TO-DATE

> Task :sdks:java:container:goBuild
/home/jenkins/go/bin/go1.21.5 build -o ./build/target/linux_amd64/boot boot.go boot_test.go pathingjar.go pathingjar_test.go

> Task :sdks:java:io:google-cloud-platform:compileTestJava FROM-CACHE
> Task :sdks:java:io:google-cloud-platform:testClasses

> Task :release:go-licenses:java:dockerRun
+ go-licenses csv github.com/apache/beam/sdks/v2/java/container
+ tee /output/licenses/list.csv

> Task :sdks:java:io:google-cloud-platform:testJar
> Task :sdks:java:container:java8:copySdkHarnessLauncher

> Task :release:go-licenses:java:dockerRun
W0124 03:58:05.153726      77 library.go:101] "golang.org/x/sys/unix" contains non-Go code that can't be inspected for further dependencies:
/go/pkg/mod/golang.org/x/sys@v0.15.0/unix/asm_linux_amd64.s
github.com/apache/beam/sdks/v2/go,https://github.com/apache/beam/blob/sdks/v2.53.0/sdks/go/README.md,Apache-2.0
github.com/apache/beam/sdks/v2/java/container,https://github.com/apache/beam/blob/sdks/v2.53.0/sdks/LICENSE,Apache-2.0
github.com/golang/protobuf,https://github.com/golang/protobuf/blob/v1.5.3/LICENSE,BSD-3-Clause
golang.org/x/net,https://cs.opensource.google/go/x/net/+/v0.19.0:LICENSE,BSD-3-Clause
golang.org/x/sys/unix,https://cs.opensource.google/go/x/sys/+/v0.15.0:LICENSE,BSD-3-Clause
golang.org/x/text,https://cs.opensource.google/go/x/text/+/v0.14.0:LICENSE,BSD-3-Clause
google.golang.org/genproto/googleapis/rpc/status,https://github.com/googleapis/go-genproto/blob/83a465c0220f/googleapis/rpc/LICENSE,Apache-2.0
google.golang.org/grpc,https://github.com/grpc/grpc-go/blob/v1.59.0/LICENSE,Apache-2.0
google.golang.org/protobuf,https://github.com/protocolbuffers/protobuf-go/blob/v1.31.0/LICENSE,BSD-3-Clause
+ chmod -R a+w /output/licenses

> Task :release:go-licenses:java:createLicenses
> Task :sdks:java:container:java8:copyGolangLicenses
> Task :sdks:java:container:java8:dockerPrepare
> Task :sdks:java:container:java8:docker

> Task :runners:google-cloud-dataflow-java:buildAndPushDockerJavaContainer
WARNING: `gcloud docker` will not be supported for Docker client versions above 18.03.

As an alternative, use `gcloud auth configure-docker` to configure `docker` to
use `gcloud` as a credential helper, then use `docker` as you would for non-GCR
registries, e.g. `docker pull gcr.io/project-id/my-image`. Add
`--verbosity=error` to silence this warning: `gcloud docker
--verbosity=error -- pull gcr.io/project-id/my-image`.

See: https://cloud.google.com/container-registry/docs/support/deprecation-notices#gcloud-docker

The push refers to repository [us.gcr.io/apache-beam-testing/java-postcommit-it/java]
2b0b05444d36: Preparing
946fd65d27af: Preparing
d6ae01004073: Preparing
9946582428e8: Preparing
6fe159cd7708: Preparing
abb1114db7bb: Preparing
ca0ea2521b5d: Preparing
19a71ab755a1: Preparing
3bf24a0e1fb3: Preparing
eb4be29e7ee8: Preparing
ce1458863412: Preparing
fa8edb5df1e8: Preparing
f736007470fa: Preparing
abb1114db7bb: Waiting
0c93205b2563: Preparing
ca0ea2521b5d: Waiting
916915948ce2: Preparing
3bf24a0e1fb3: Waiting
3b478ddd8a61: Preparing
cb90abe0244c: Preparing
eb4be29e7ee8: Waiting
f7ec018ed0af: Preparing
8e87ff28f1b5: Preparing
f736007470fa: Waiting
0c93205b2563: Waiting
3b478ddd8a61: Waiting
8e87ff28f1b5: Waiting
916915948ce2: Waiting
cb90abe0244c: Waiting
f7ec018ed0af: Waiting
6fe159cd7708: Pushed
946fd65d27af: Pushed
d6ae01004073: Pushed
2b0b05444d36: Pushed
9946582428e8: Pushed
abb1114db7bb: Pushed
19a71ab755a1: Pushed
eb4be29e7ee8: Pushed
3bf24a0e1fb3: Pushed
ce1458863412: Pushed
ca0ea2521b5d: Pushed
916915948ce2: Layer already exists
3b478ddd8a61: Layer already exists
fa8edb5df1e8: Pushed
cb90abe0244c: Layer already exists
f7ec018ed0af: Layer already exists
8e87ff28f1b5: Layer already exists
f736007470fa: Pushed
0c93205b2563: Pushed
20240124035740: digest: sha256:0bfc1800bd308ba31b4808b57d798c983ba868d5c052467954133b2d8879d983 size: 4299

> Task :runners:google-cloud-dataflow-java:coreSDKJavaRunnerV2IntegrationTest NO-SOURCE
> Task :runners:google-cloud-dataflow-java:googleCloudPlatformRunnerV2IntegrationTest

org.apache.beam.sdk.io.gcp.bigquery.StorageApiSinkSchemaUpdateIT > testExactlyOnceWithAutoSchemaUpdate[3] FAILED
    java.lang.RuntimeException at StorageApiSinkSchemaUpdateIT.java:410

org.apache.beam.sdk.io.gcp.healthcare.DicomIOReadIT > testDicomMetadataRead FAILED
    java.nio.file.NoSuchFileException at DicomIOReadIT.java:56

org.apache.beam.sdk.io.gcp.healthcare.DicomIOReadIT > testDicomFailedMetadataRead FAILED
    java.nio.file.NoSuchFileException at DicomIOReadIT.java:56

org.apache.beam.sdk.io.gcp.pubsub.PubsubWriteIT > testBoundedWriteMessageWithAttributes FAILED
    io.grpc.StatusRuntimeException at PubsubWriteIT.java:62
        Caused by: java.io.IOException at FileDispatcherImpl.java:-2

org.apache.beam.sdk.io.gcp.pubsub.PubsubWriteIT > testBoundedWriteSequence FAILED
    io.grpc.StatusRuntimeException at PubsubWriteIT.java:62
        Caused by: java.io.IOException at FileDispatcherImpl.java:-2

157 tests completed, 5 failed, 25 skipped

> Task :runners:google-cloud-dataflow-java:googleCloudPlatformRunnerV2IntegrationTest FAILED

> Task :runners:google-cloud-dataflow-java:cleanUpDockerJavaImages
Untagged: us.gcr.io/apache-beam-testing/java-postcommit-it/java:20240124035740
Untagged: us.gcr.io/apache-beam-testing/java-postcommit-it/java@sha256:0bfc1800bd308ba31b4808b57d798c983ba868d5c052467954133b2d8879d983
Deleted: sha256:d8a5020f3e8c882999ea6fdbbe4d5973e382409737430844103b84e6bc42175e
Deleted: sha256:bc66a3d23d0ab5038802add1cbc8ff7d275f4451d7401236900ea61e9a05dc04
Deleted: sha256:6b2569b7c5d740ab9e8b309ba32e2b6f844b1488c0084c7877c0d15d9f9518df
Deleted: sha256:895fb9f0e09d61df24d1bbf16d3414d8de3229aa8b4ee80f577d4ac6ba4f7257
Deleted: sha256:665a2cf9f670dfdd21be69027ea1afe75ac86785b392604896a1d52636144fec
Deleted: sha256:cf4d1c04d3eba9d418f97733166bdd205b1a60f0cdd78f7b53a6888b87e6a908
Deleted: sha256:e2a516a6ef8d08f27b97d85b0a28385991d44c51b1658dfd08316880219ffe10
Deleted: sha256:997f62df15041614d1ab899bd4867367cc33e799577cfd91850735992023c1dc
Deleted: sha256:60d57c90e3b3797d421772157dcade3db039d4acea16346810ee4e581042cc70
Deleted: sha256:6162a718040e80a2c11db16b8447995afbf62bfbc52c74f80857269d4bf3a19b
Deleted: sha256:7c724e5b1284e25bd8cd185488df2285469de8cd7583d5fb9462e256e12e7a1a
Deleted: sha256:866fadbb2ec219ec8652971e3eb6dda0f136578a967984e07666df11fd21c108
Deleted: sha256:87e2b5ea5a71d4d2cd4dad1646a95a6f849608899a32c2e5063c43d293ba6a6b
Deleted: sha256:52c908312f453e895359ed9559a4887dd5e44758a46cc04d1475c9dc4fb99bc2
Deleted: sha256:e4e4fb8b37d065292f3607affb32447fa927bf50fa6f9038bb7c5b341f6df3f4
Deleted: sha256:1de9b25fe583573f0d81b5532c862c8f368bcba9191f96bc301f3c93885e3c9e
Deleted: sha256:3dc7495a30b02041d48efaf5e6089825c8c2f3d406ab814371a598cd8d93b4fb
Deleted: sha256:0644ab454a7d8302a2fe4b69112a6db7e8661cced013e74b0e554b7019982a28
Deleted: sha256:9673a36d1f80f3464dcae6f63842f44e01d1806c087a3306c26257213c3e7aba
Deleted: sha256:d15e62c8498306b4420664a38fa233a975b8a50d97c5fa6955d5fb10d4f9e53a
Deleted: sha256:8ff176acd5938ca5a2c47058cd65c8f42d53968f4d5047392a1f6d8df4cfc03b
Deleted: sha256:0112c3dbae829da9d1790d3d94d117d0528221b8b410d082f89e2c068e551de3
Deleted: sha256:bb9577a7f1b19775c403c7408aeca77edb3e3e82ac922787c4acb6b5c04ee10d
Deleted: sha256:3b41f530937378326fb8e02250952bb5087b121e9939f3575a29db495fffb545
Deleted: sha256:18043c418c3938d97e99d0de8f180ff2be302bcb5234d6a8d8fb654d3b206708
Deleted: sha256:d11c16b1fbc9819fd87ef5e789bd4ef05297f52490815ef0e281a8a43e1a8525
Deleted: sha256:166a47b46ae811683a583e1e7ad91582d6f6f87650c12d4496aeacbaa4a96cea
Deleted: sha256:62f8e45c0538955229e7a67e9b553fb91f53c10face318b3241eca52c3094144
Deleted: sha256:5b5a76450bca30d615f8e518d211e7086c91443cb0eba411c548bd3559800ad7
Deleted: sha256:7331f1a6947200964b37163add8761bd7589364ab7609cff502adc8fa7d006df
Deleted: sha256:62818ed126fb102f16e1813df0c0f32eac8b39527b4b87bed5b8b62f2cc9628a
Deleted: sha256:a802f3b6f78b7d54f0df715f64dc744dc5522e4d04819655ceb21889a983b87e
Deleted: sha256:910f10f2f31a17f586ae8666837458e0552d70a6c45bbd9541fafdea22a539a1
Deleted: sha256:4c0a36992a7c96b582845cf14f8c76a7c82c578da736635f894705eec57c2194
WARNING: Successfully resolved tag to sha256, but it is recommended to use sha256 directly.
Tag: [us.gcr.io/apache-beam-testing/java-postcommit-it/java:20240124035740]
- referencing digest: [us.gcr.io/apache-beam-testing/java-postcommit-it/java@sha256:0bfc1800bd308ba31b4808b57d798c983ba868d5c052467954133b2d8879d983]

Deleted [[us.gcr.io/apache-beam-testing/java-postcommit-it/java:20240124035740] (referencing [us.gcr.io/apache-beam-testing/java-postcommit-it/java@sha256:0bfc1800bd308ba31b4808b57d798c983ba868d5c052467954133b2d8879d983])].
Removing untagged image us.gcr.io/apache-beam-testing/java-postcommit-it/java@sha256:0bfc1800bd308ba31b4808b57d798c983ba868d5c052467954133b2d8879d983

FAILURE: Build failed with an exception.

* What went wrong:
Execution failed for task ':runners:google-cloud-dataflow-java:googleCloudPlatformRunnerV2IntegrationTest'.
> There were failing tests. See the report at: file://<https://ci-beam.apache.org/job/beam_PostCommit_Java_DataflowV2/ws/src/runners/google-cloud-dataflow-java/build/reports/tests/googleCloudPlatformRunnerV2IntegrationTest/index.html>

Deprecated Gradle features were used in this build, making it incompatible with Gradle 9.0.

You can use '--warning-mode all' to show the individual deprecation warnings and determine if they come from your own scripts or plugins.

For more on this, please refer to https://docs.gradle.org/8.4/userguide/command_line_interface.html#sec:command_line_warnings in the Gradle documentation.

BUILD FAILED in 3h 43m 6s
136 actionable tasks: 89 executed, 45 from cache, 2 up-to-date

Publishing build scan...
https://ge.apache.org/s/axeni3ww4wm4g

Build step 'Invoke Gradle script' changed build result to FAILURE
Build step 'Invoke Gradle script' marked build as failure

---------------------------------------------------------------------
To unsubscribe, e-mail: builds-unsubscribe@beam.apache.org
For additional commands, e-mail: builds-help@beam.apache.org


Jenkins build is back to normal : beam_PostCommit_Java_DataflowV2 #4029

Posted by Apache Jenkins Server <je...@builds.apache.org>.
See <https://ci-beam.apache.org/job/beam_PostCommit_Java_DataflowV2/4029/display/redirect>


---------------------------------------------------------------------
To unsubscribe, e-mail: builds-unsubscribe@beam.apache.org
For additional commands, e-mail: builds-help@beam.apache.org


Build failed in Jenkins: beam_PostCommit_Java_DataflowV2 #4028

Posted by Apache Jenkins Server <je...@builds.apache.org>.
See <https://ci-beam.apache.org/job/beam_PostCommit_Java_DataflowV2/4028/display/redirect>

Changes:


------------------------------------------
[...truncated 48.12 KB...]
> Task :sdks:java:extensions:protobuf:compileTestJava FROM-CACHE
> Task :sdks:java:extensions:protobuf:testClasses
> Task :runners:direct-java:shadowTestJar FROM-CACHE
> Task :sdks:java:extensions:protobuf:testJar
> Task :sdks:java:io:google-cloud-platform:jar
> Task :runners:google-cloud-dataflow-java:compileJava FROM-CACHE
> Task :runners:google-cloud-dataflow-java:classes
> Task :runners:google-cloud-dataflow-java:jar
> Task :sdks:java:io:google-cloud-platform:compileTestJava FROM-CACHE
> Task :sdks:java:io:google-cloud-platform:testClasses
> Task :sdks:java:io:google-cloud-platform:testJar

> Task :sdks:java:container:pullLicenses
Collecting pip
  Using cached pip-23.3.2-py3-none-any.whl (2.1 MB)
Collecting setuptools
  Using cached setuptools-69.0.3-py3-none-any.whl (819 kB)
Collecting wheel
  Using cached wheel-0.42.0-py3-none-any.whl (65 kB)
Installing collected packages: pip, setuptools, wheel
  Attempting uninstall: pip
    Found existing installation: pip 20.0.2
    Uninstalling pip-20.0.2:
      Successfully uninstalled pip-20.0.2
  Attempting uninstall: setuptools
    Found existing installation: setuptools 44.0.0
    Uninstalling setuptools-44.0.0:
      Successfully uninstalled setuptools-44.0.0
Successfully installed pip-23.3.2 setuptools-69.0.3 wheel-0.42.0
Collecting beautifulsoup4<5.0,>=4.9.0 (from -r <https://ci-beam.apache.org/job/beam_PostCommit_Java_DataflowV2/ws/src/sdks/java/container/license_scripts/requirement.txt> (line 19))
  Using cached beautifulsoup4-4.12.3-py3-none-any.whl.metadata (3.8 kB)
Collecting pyyaml<7,>=6.0.1 (from -r <https://ci-beam.apache.org/job/beam_PostCommit_Java_DataflowV2/ws/src/sdks/java/container/license_scripts/requirement.txt> (line 20))
  Using cached PyYAML-6.0.1-cp38-cp38-manylinux_2_17_x86_64.manylinux2014_x86_64.whl.metadata (2.1 kB)
Collecting tenacity<9.0,>=6.1.0 (from -r <https://ci-beam.apache.org/job/beam_PostCommit_Java_DataflowV2/ws/src/sdks/java/container/license_scripts/requirement.txt> (line 21))
  Using cached tenacity-8.2.3-py3-none-any.whl.metadata (1.0 kB)
Collecting soupsieve>1.2 (from beautifulsoup4<5.0,>=4.9.0->-r <https://ci-beam.apache.org/job/beam_PostCommit_Java_DataflowV2/ws/src/sdks/java/container/license_scripts/requirement.txt> (line 19))
  Using cached soupsieve-2.5-py3-none-any.whl.metadata (4.7 kB)
Using cached beautifulsoup4-4.12.3-py3-none-any.whl (147 kB)
Using cached PyYAML-6.0.1-cp38-cp38-manylinux_2_17_x86_64.manylinux2014_x86_64.whl (736 kB)
Using cached tenacity-8.2.3-py3-none-any.whl (24 kB)
Using cached soupsieve-2.5-py3-none-any.whl (36 kB)
Installing collected packages: tenacity, soupsieve, pyyaml, beautifulsoup4
Successfully installed beautifulsoup4-4.12.3 pyyaml-6.0.1 soupsieve-2.5 tenacity-8.2.3
Executing python <https://ci-beam.apache.org/job/beam_PostCommit_Java_DataflowV2/ws/src/sdks/java/container/license_scripts/pull_licenses_java.py> --license_index=<https://ci-beam.apache.org/job/beam_PostCommit_Java_DataflowV2/ws/src/sdks/java/container/build/reports/dependency-license/index.json>        --output_dir=<https://ci-beam.apache.org/job/beam_PostCommit_Java_DataflowV2/ws/src/sdks/java/container/build/target/java_third_party_licenses>        --dep_url_yaml=<https://ci-beam.apache.org/job/beam_PostCommit_Java_DataflowV2/ws/src/sdks/java/container/license_scripts/dep_urls_java.yaml>        --manual_license_path=<https://ci-beam.apache.org/job/beam_PostCommit_Java_DataflowV2/ws/src/sdks/java/container/license_scripts/manual_licenses>
INFO:root:Pulling license for 129 dependencies using 16 threads.
INFO:root:Replaced local file URL with file://<https://ci-beam.apache.org/job/beam_PostCommit_Java_DataflowV2/ws/src/sdks/java/container/license_scripts/manual_licenses/xz/COPYING> for xz-1.5
INFO:root:pull_licenses_java.py succeed. It took 1.632155 seconds with 16 threads.
Copying licenses from <https://ci-beam.apache.org/job/beam_PostCommit_Java_DataflowV2/ws/src/sdks/java/container/build/target/java_third_party_licenses> to <https://ci-beam.apache.org/job/beam_PostCommit_Java_DataflowV2/ws/src/sdks/java/container/build/target/third_party_licenses.>
Finished license_scripts.sh

> Task :release:go-licenses:java:dockerRun
go: downloading github.com/golang/protobuf v1.5.3
go: downloading google.golang.org/grpc v1.59.0
go: downloading google.golang.org/protobuf v1.31.0
go: downloading golang.org/x/sys v0.15.0
go: downloading golang.org/x/net v0.19.0
go: downloading google.golang.org/genproto/googleapis/rpc v0.0.0-20231120223509-83a465c0220f
go: downloading google.golang.org/genproto v0.0.0-20231106174013-bbf56f31fb17
go: downloading golang.org/x/text v0.14.0
go: added github.com/apache/beam/sdks/v2 v2.53.0
go: added github.com/golang/protobuf v1.5.3
go: added golang.org/x/net v0.19.0
go: added golang.org/x/sys v0.15.0
go: added golang.org/x/text v0.14.0
go: added google.golang.org/genproto/googleapis/rpc v0.0.0-20231120223509-83a465c0220f
go: added google.golang.org/grpc v1.59.0
go: added google.golang.org/protobuf v1.31.0
+ go-licenses save github.com/apache/beam/sdks/v2/java/container --save_path=/output/licenses
W0125 03:58:03.297331      37 library.go:101] "golang.org/x/sys/unix" contains non-Go code that can't be inspected for further dependencies:
/go/pkg/mod/golang.org/x/sys@v0.15.0/unix/asm_linux_amd64.s
+ go-licenses csv github.com/apache/beam/sdks/v2/java/container
+ tee /output/licenses/list.csv
W0125 03:58:07.562401      84 library.go:101] "golang.org/x/sys/unix" contains non-Go code that can't be inspected for further dependencies:
/go/pkg/mod/golang.org/x/sys@v0.15.0/unix/asm_linux_amd64.s

> Task :sdks:java:container:java8:copyJavaThirdPartyLicenses

> Task :sdks:java:container:downloadCloudProfilerAgent
  % Total    % Received % Xferd  Average Speed   Time    Time     Time  Current
                                 Dload  Upload   Total   Spent    Left  Speed
  0     0    0     0    0     0      0      0 --:--:-- --:--:-- --:--:--     0version.txt
NOTICES
profiler_java_agent.so
100 4183k  100 4183k    0     0  22.5M      0 --:--:-- --:--:-- --:--:-- 22.5M

> Task :sdks:java:container:goPrepare UP-TO-DATE

> Task :sdks:java:container:goBuild
/home/jenkins/go/bin/go1.21.6 build -o ./build/target/linux_amd64/boot boot.go boot_test.go pathingjar.go pathingjar_test.go

> Task :release:go-licenses:java:dockerRun
github.com/apache/beam/sdks/v2/go,https://github.com/apache/beam/blob/sdks/v2.53.0/sdks/go/README.md,Apache-2.0
github.com/apache/beam/sdks/v2/java/container,https://github.com/apache/beam/blob/sdks/v2.53.0/sdks/LICENSE,Apache-2.0
github.com/golang/protobuf,https://github.com/golang/protobuf/blob/v1.5.3/LICENSE,BSD-3-Clause
golang.org/x/net,https://cs.opensource.google/go/x/net/+/v0.19.0:LICENSE,BSD-3-Clause
golang.org/x/sys/unix,https://cs.opensource.google/go/x/sys/+/v0.15.0:LICENSE,BSD-3-Clause
golang.org/x/text,https://cs.opensource.google/go/x/text/+/v0.14.0:LICENSE,BSD-3-Clause
google.golang.org/genproto/googleapis/rpc/status,https://github.com/googleapis/go-genproto/blob/83a465c0220f/googleapis/rpc/LICENSE,Apache-2.0
google.golang.org/grpc,https://github.com/grpc/grpc-go/blob/v1.59.0/LICENSE,Apache-2.0
google.golang.org/protobuf,https://github.com/protocolbuffers/protobuf-go/blob/v1.31.0/LICENSE,BSD-3-Clause
+ chmod -R a+w /output/licenses

> Task :sdks:java:container:java8:copySdkHarnessLauncher
> Task :release:go-licenses:java:createLicenses
> Task :sdks:java:container:java8:copyGolangLicenses
> Task :sdks:java:container:java8:dockerPrepare
> Task :sdks:java:container:java8:docker

> Task :runners:google-cloud-dataflow-java:buildAndPushDockerJavaContainer
WARNING: `gcloud docker` will not be supported for Docker client versions above 18.03.

As an alternative, use `gcloud auth configure-docker` to configure `docker` to
use `gcloud` as a credential helper, then use `docker` as you would for non-GCR
registries, e.g. `docker pull gcr.io/project-id/my-image`. Add
`--verbosity=error` to silence this warning: `gcloud docker
--verbosity=error -- pull gcr.io/project-id/my-image`.

See: https://cloud.google.com/container-registry/docs/support/deprecation-notices#gcloud-docker

The push refers to repository [us.gcr.io/apache-beam-testing/java-postcommit-it/java]
4e1d3d3b6b10: Preparing
ea0e4ac890e3: Preparing
d47d0edb1b58: Preparing
b03cc7780e7a: Preparing
6e03ca026b01: Preparing
005ed1f3a96a: Preparing
4c7e7885367a: Preparing
37a62abd0c63: Preparing
5dc87ebf8f65: Preparing
aa55fe090f5f: Preparing
6bdc0b9d41e0: Preparing
c839a8217582: Preparing
d264796c5577: Preparing
645965c0437b: Preparing
23c75aa05051: Preparing
1a48e3b17b09: Preparing
3fa2ab95569b: Preparing
f7ec018ed0af: Preparing
8e87ff28f1b5: Preparing
d264796c5577: Waiting
1a48e3b17b09: Waiting
645965c0437b: Waiting
005ed1f3a96a: Waiting
23c75aa05051: Waiting
3fa2ab95569b: Waiting
aa55fe090f5f: Waiting
4c7e7885367a: Waiting
f7ec018ed0af: Waiting
37a62abd0c63: Waiting
c839a8217582: Waiting
6bdc0b9d41e0: Waiting
8e87ff28f1b5: Waiting
5dc87ebf8f65: Waiting
6e03ca026b01: Pushed
d47d0edb1b58: Pushed
ea0e4ac890e3: Pushed
4e1d3d3b6b10: Pushed
b03cc7780e7a: Pushed
37a62abd0c63: Pushed
005ed1f3a96a: Pushed
4c7e7885367a: Pushed
5dc87ebf8f65: Pushed
aa55fe090f5f: Pushed
23c75aa05051: Layer already exists
c839a8217582: Pushed
1a48e3b17b09: Layer already exists
3fa2ab95569b: Layer already exists
6bdc0b9d41e0: Pushed
f7ec018ed0af: Layer already exists
8e87ff28f1b5: Layer already exists
d264796c5577: Pushed
645965c0437b: Pushed
20240125035742: digest: sha256:4bb5f8e7c00055f5f9ca3ee12f28daec3c3f11641eae38dae8f48b4a2927ccc2 size: 4299

> Task :runners:google-cloud-dataflow-java:coreSDKJavaRunnerV2IntegrationTest NO-SOURCE
> Task :runners:google-cloud-dataflow-java:googleCloudPlatformRunnerV2IntegrationTest

org.apache.beam.sdk.io.gcp.pubsub.PubsubWriteIT > testBoundedWriteSmallMessage FAILED
    io.grpc.StatusRuntimeException at PubsubWriteIT.java:62
        Caused by: java.io.IOException at FileDispatcherImpl.java:-2

157 tests completed, 1 failed, 27 skipped

> Task :runners:google-cloud-dataflow-java:googleCloudPlatformRunnerV2IntegrationTest FAILED

> Task :runners:google-cloud-dataflow-java:cleanUpDockerJavaImages
Untagged: us.gcr.io/apache-beam-testing/java-postcommit-it/java:20240125035742
Untagged: us.gcr.io/apache-beam-testing/java-postcommit-it/java@sha256:4bb5f8e7c00055f5f9ca3ee12f28daec3c3f11641eae38dae8f48b4a2927ccc2
Deleted: sha256:48127b6c0650e6f7d16efcdb4de0c865e06cdc8f3016491a1f4012e6853bb0f5
Deleted: sha256:b36467dc6947cf3be818501f046dcbf73ba770f89da3862ef01825752a92ebb8
Deleted: sha256:a679bf72e3f04fd6b881c51db1471c5de0dcf87dd81adb5aa65f9806aaec90a1
Deleted: sha256:9933ea055eae642a13aa513ba900c97281ed3a255f853e1cfab1a68b09984ce3
Deleted: sha256:01046d12301fad4cefb6d18c90afed466c473cb0e3cbd24caea16e684d65b93a
Deleted: sha256:bdf6a7e52d83573ca09eb1f9d9652ce3c87f9c51a4628d2d1c13476cde780943
Deleted: sha256:e1841b139b965918fc0d90cb875f8f3bc34033baacac73b30790d2675dbf941e
Deleted: sha256:03ce15d68ec78f5f5cb2fd8f3bb8c7f8df8d761bf0c915c47c396aa178230b02
Deleted: sha256:461ba2405050b109e97d7eff70f85f73cbb5511af2edf5e40acb523ea9ade61b
Deleted: sha256:5e9d8c5d56152449257e90f8046aa6878da0ed76f63a8c1f2cb04b37550064dc
Deleted: sha256:85b39548217d97da5b82cbc71b7fec4653b057f8e4cbed04ce7f65026701144e
Deleted: sha256:0b7b6074a26dffb45347629576881e6353b3beb7a892b0d89b7bc7f297716f20
Deleted: sha256:b2f869ea0911fe1211d26f4d3d1429a4a8a21d302bc72d76016094b88e315875
Deleted: sha256:5499a3d3f41e5136b37cd255977013a50aa52681c44dba216fea9de8988d1a00
Deleted: sha256:c5ce3197dcfd3ebd0492e52b31f770de81611d06cc6377005d59ceb8099dc7bd
Deleted: sha256:38d0c55db2495def4bd0b3b292aed98be3f934b4bf253a9c25ec20cc9f1022a5
Deleted: sha256:424c95ad049079d0524e41ef7034ad103631756707ba708b1bd952fc1cb4e898
Deleted: sha256:c91697ab0f90234e7a8e7c67a583693fb4a37cf2ff2f6f80bd204bd4a971a86e
Deleted: sha256:52af0f0ba403058fac4362af1aa88aaafe1e183928cd3446f1294c00e60825d6
Deleted: sha256:4c539ec9c1c1d4a1b8609e6964535863955a01e1731109252f4b7486dbbe6bd5
Deleted: sha256:9a0849d6411ac3af2c158fc102476160f062d0a244b8a4cd7d22dff0034ec898
Deleted: sha256:532a51b8e652a6325918d246afcae5d91a6b5f482a8f12221e59ff21ed4f9403
Deleted: sha256:44e10550e2940c4f84cf6f322786d4a2c61f06db1670636d2d5bb0f037194376
Deleted: sha256:9f44bfbc7187babf53a384556349a3cbd709621799105dd382574df676ebd9cd
Deleted: sha256:e03c33bf3e31f7ca2f97e3311941bafa75ce24b2f185b3b8e241d2ab7a171272
Deleted: sha256:4c72707945036db00be2025266449956d2a58f7765a9da8240e3e00a51e88972
Deleted: sha256:8959e22ecdd8db1e75b6607c5e0e8b27846a5371e3c647ae7638c4065f9dfe39
Deleted: sha256:0f509fb2c1f1165daf3d09db97d53be1a79972ba2bf24121e5d50e7c26d07369
Deleted: sha256:9ae11b9835aeb260d89c452a766568ef0196f3cf45820c30a08a1f901f519dd3
Deleted: sha256:5efe6fcb5b03d68dfd18a56c28d6b57520d257fcb8052e263933beef09392bd2
Deleted: sha256:e8cc22eeb40e7d1deda0054176b6613be20fdeb66ca8b9b898c7065594465dee
Deleted: sha256:2b7044fbbab633e7e7434fdd6912d059ecdf0c5026566c18fdc690c960fcd33b
Deleted: sha256:7dcd422c26e09124d3345383566048ce13f71a75ba39568ecd06887362a0af38
Deleted: sha256:a6a7b74e29bddca6530082f32e5efba68024bc5919ec23858b9d15c8b4365dc1
WARNING: Successfully resolved tag to sha256, but it is recommended to use sha256 directly.
Tag: [us.gcr.io/apache-beam-testing/java-postcommit-it/java:20240125035742]
- referencing digest: [us.gcr.io/apache-beam-testing/java-postcommit-it/java@sha256:4bb5f8e7c00055f5f9ca3ee12f28daec3c3f11641eae38dae8f48b4a2927ccc2]

Deleted [[us.gcr.io/apache-beam-testing/java-postcommit-it/java:20240125035742] (referencing [us.gcr.io/apache-beam-testing/java-postcommit-it/java@sha256:4bb5f8e7c00055f5f9ca3ee12f28daec3c3f11641eae38dae8f48b4a2927ccc2])].
Removing untagged image us.gcr.io/apache-beam-testing/java-postcommit-it/java@sha256:4bb5f8e7c00055f5f9ca3ee12f28daec3c3f11641eae38dae8f48b4a2927ccc2

FAILURE: Build failed with an exception.

* What went wrong:
Execution failed for task ':runners:google-cloud-dataflow-java:googleCloudPlatformRunnerV2IntegrationTest'.
> There were failing tests. See the report at: file://<https://ci-beam.apache.org/job/beam_PostCommit_Java_DataflowV2/ws/src/runners/google-cloud-dataflow-java/build/reports/tests/googleCloudPlatformRunnerV2IntegrationTest/index.html>

Deprecated Gradle features were used in this build, making it incompatible with Gradle 9.0.

You can use '--warning-mode all' to show the individual deprecation warnings and determine if they come from your own scripts or plugins.

For more on this, please refer to https://docs.gradle.org/8.4/userguide/command_line_interface.html#sec:command_line_warnings in the Gradle documentation.

BUILD FAILED in 3h 46m 13s
136 actionable tasks: 88 executed, 46 from cache, 2 up-to-date

Publishing build scan...
https://ge.apache.org/s/cvjq2yzpkpdds

Build step 'Invoke Gradle script' changed build result to FAILURE
Build step 'Invoke Gradle script' marked build as failure

---------------------------------------------------------------------
To unsubscribe, e-mail: builds-unsubscribe@beam.apache.org
For additional commands, e-mail: builds-help@beam.apache.org


Build failed in Jenkins: beam_PostCommit_Java_DataflowV2 #4027

Posted by Apache Jenkins Server <je...@builds.apache.org>.
See <https://ci-beam.apache.org/job/beam_PostCommit_Java_DataflowV2/4027/display/redirect>

Changes:


------------------------------------------
[...truncated 49.56 KB...]
  Attempting uninstall: pip
    Found existing installation: pip 20.0.2
    Uninstalling pip-20.0.2:
      Successfully uninstalled pip-20.0.2
  Attempting uninstall: setuptools
    Found existing installation: setuptools 44.0.0
    Uninstalling setuptools-44.0.0:
      Successfully uninstalled setuptools-44.0.0
Successfully installed pip-23.3.2 setuptools-69.0.3 wheel-0.42.0
Collecting beautifulsoup4<5.0,>=4.9.0 (from -r <https://ci-beam.apache.org/job/beam_PostCommit_Java_DataflowV2/ws/src/sdks/java/container/license_scripts/requirement.txt> (line 19))
  Using cached beautifulsoup4-4.12.3-py3-none-any.whl.metadata (3.8 kB)
Collecting pyyaml<7,>=6.0.1 (from -r <https://ci-beam.apache.org/job/beam_PostCommit_Java_DataflowV2/ws/src/sdks/java/container/license_scripts/requirement.txt> (line 20))
  Using cached PyYAML-6.0.1-cp38-cp38-manylinux_2_17_x86_64.manylinux2014_x86_64.whl.metadata (2.1 kB)
Collecting tenacity<9.0,>=6.1.0 (from -r <https://ci-beam.apache.org/job/beam_PostCommit_Java_DataflowV2/ws/src/sdks/java/container/license_scripts/requirement.txt> (line 21))
  Using cached tenacity-8.2.3-py3-none-any.whl.metadata (1.0 kB)
Collecting soupsieve>1.2 (from beautifulsoup4<5.0,>=4.9.0->-r <https://ci-beam.apache.org/job/beam_PostCommit_Java_DataflowV2/ws/src/sdks/java/container/license_scripts/requirement.txt> (line 19))
  Using cached soupsieve-2.5-py3-none-any.whl.metadata (4.7 kB)
Using cached beautifulsoup4-4.12.3-py3-none-any.whl (147 kB)
Using cached PyYAML-6.0.1-cp38-cp38-manylinux_2_17_x86_64.manylinux2014_x86_64.whl (736 kB)
Using cached tenacity-8.2.3-py3-none-any.whl (24 kB)
Using cached soupsieve-2.5-py3-none-any.whl (36 kB)
Installing collected packages: tenacity, soupsieve, pyyaml, beautifulsoup4
Successfully installed beautifulsoup4-4.12.3 pyyaml-6.0.1 soupsieve-2.5 tenacity-8.2.3
Executing python <https://ci-beam.apache.org/job/beam_PostCommit_Java_DataflowV2/ws/src/sdks/java/container/license_scripts/pull_licenses_java.py> --license_index=<https://ci-beam.apache.org/job/beam_PostCommit_Java_DataflowV2/ws/src/sdks/java/container/build/reports/dependency-license/index.json>        --output_dir=<https://ci-beam.apache.org/job/beam_PostCommit_Java_DataflowV2/ws/src/sdks/java/container/build/target/java_third_party_licenses>        --dep_url_yaml=<https://ci-beam.apache.org/job/beam_PostCommit_Java_DataflowV2/ws/src/sdks/java/container/license_scripts/dep_urls_java.yaml>        --manual_license_path=<https://ci-beam.apache.org/job/beam_PostCommit_Java_DataflowV2/ws/src/sdks/java/container/license_scripts/manual_licenses>
INFO:root:Pulling license for 129 dependencies using 16 threads.
INFO:root:Replaced local file URL with file://<https://ci-beam.apache.org/job/beam_PostCommit_Java_DataflowV2/ws/src/sdks/java/container/license_scripts/manual_licenses/xz/COPYING> for xz-1.5
INFO:root:pull_licenses_java.py succeed. It took 3.235201 seconds with 16 threads.
Copying licenses from <https://ci-beam.apache.org/job/beam_PostCommit_Java_DataflowV2/ws/src/sdks/java/container/build/target/java_third_party_licenses> to <https://ci-beam.apache.org/job/beam_PostCommit_Java_DataflowV2/ws/src/sdks/java/container/build/target/third_party_licenses.>
Finished license_scripts.sh

> Task :release:go-licenses:java:dockerRun
go: downloading github.com/golang/protobuf v1.5.3
go: downloading google.golang.org/grpc v1.59.0
go: downloading google.golang.org/protobuf v1.31.0
go: downloading golang.org/x/sys v0.15.0
go: downloading golang.org/x/net v0.19.0
go: downloading google.golang.org/genproto/googleapis/rpc v0.0.0-20231120223509-83a465c0220f
go: downloading google.golang.org/genproto v0.0.0-20231106174013-bbf56f31fb17
go: downloading golang.org/x/text v0.14.0
go: added github.com/apache/beam/sdks/v2 v2.53.0
go: added github.com/golang/protobuf v1.5.3
go: added golang.org/x/net v0.19.0
go: added golang.org/x/sys v0.15.0
go: added golang.org/x/text v0.14.0
go: added google.golang.org/genproto/googleapis/rpc v0.0.0-20231120223509-83a465c0220f
go: added google.golang.org/grpc v1.59.0
go: added google.golang.org/protobuf v1.31.0
+ go-licenses save github.com/apache/beam/sdks/v2/java/container --save_path=/output/licenses
W0124 21:58:01.063849      38 library.go:101] "golang.org/x/sys/unix" contains non-Go code that can't be inspected for further dependencies:
/go/pkg/mod/golang.org/x/sys@v0.15.0/unix/asm_linux_amd64.s
+ go-licenses csv github.com/apache/beam/sdks/v2/java/container
+ tee /output/licenses/list.csv

> Task :sdks:java:container:java8:copyJavaThirdPartyLicenses

> Task :sdks:java:container:downloadCloudProfilerAgent
  % Total    % Received % Xferd  Average Speed   Time    Time     Time  Current
                                 Dload  Upload   Total   Spent    Left  Speed
  0     0    0     0    0     0      0      0 --:--:-- --:--:-- --:--:--     0version.txt
NOTICES
profiler_java_agent.so
100 4183k  100 4183k    0     0  23.3M      0 --:--:-- --:--:-- --:--:-- 23.3M

> Task :sdks:java:container:goPrepare UP-TO-DATE

> Task :release:go-licenses:java:dockerRun
W0124 21:58:06.311383      83 library.go:101] "golang.org/x/sys/unix" contains non-Go code that can't be inspected for further dependencies:
/go/pkg/mod/golang.org/x/sys@v0.15.0/unix/asm_linux_amd64.s

> Task :sdks:java:testing:test-utils:compileJava
> Task :sdks:java:testing:test-utils:classes

> Task :sdks:java:container:goBuild
/home/jenkins/go/bin/go1.21.6 build -o ./build/target/linux_amd64/boot boot.go boot_test.go pathingjar.go pathingjar_test.go

> Task :sdks:java:testing:test-utils:jar
> Task :sdks:java:testing:test-utils:compileTestJava FROM-CACHE
> Task :sdks:java:testing:test-utils:testClasses UP-TO-DATE
> Task :sdks:java:testing:test-utils:testJar

> Task :release:go-licenses:java:dockerRun
github.com/apache/beam/sdks/v2/go,https://github.com/apache/beam/blob/sdks/v2.53.0/sdks/go/README.md,Apache-2.0
github.com/apache/beam/sdks/v2/java/container,https://github.com/apache/beam/blob/sdks/v2.53.0/sdks/LICENSE,Apache-2.0
github.com/golang/protobuf,https://github.com/golang/protobuf/blob/v1.5.3/LICENSE,BSD-3-Clause
golang.org/x/net,https://cs.opensource.google/go/x/net/+/v0.19.0:LICENSE,BSD-3-Clause
golang.org/x/sys/unix,https://cs.opensource.google/go/x/sys/+/v0.15.0:LICENSE,BSD-3-Clause
golang.org/x/text,https://cs.opensource.google/go/x/text/+/v0.14.0:LICENSE,BSD-3-Clause
google.golang.org/genproto/googleapis/rpc/status,https://github.com/googleapis/go-genproto/blob/83a465c0220f/googleapis/rpc/LICENSE,Apache-2.0
google.golang.org/grpc,https://github.com/grpc/grpc-go/blob/v1.59.0/LICENSE,Apache-2.0
google.golang.org/protobuf,https://github.com/protocolbuffers/protobuf-go/blob/v1.31.0/LICENSE,BSD-3-Clause
+ chmod -R a+w /output/licenses

> Task :release:go-licenses:java:createLicenses
> Task :sdks:java:container:java8:copyGolangLicenses
> Task :sdks:java:container:java8:copySdkHarnessLauncher
> Task :sdks:java:container:java8:dockerPrepare
> Task :sdks:java:io:google-cloud-platform:compileTestJava FROM-CACHE
> Task :sdks:java:io:google-cloud-platform:testClasses
> Task :sdks:java:io:google-cloud-platform:testJar
> Task :sdks:java:container:java8:docker

> Task :runners:google-cloud-dataflow-java:buildAndPushDockerJavaContainer
WARNING: `gcloud docker` will not be supported for Docker client versions above 18.03.

As an alternative, use `gcloud auth configure-docker` to configure `docker` to
use `gcloud` as a credential helper, then use `docker` as you would for non-GCR
registries, e.g. `docker pull gcr.io/project-id/my-image`. Add
`--verbosity=error` to silence this warning: `gcloud docker
--verbosity=error -- pull gcr.io/project-id/my-image`.

See: https://cloud.google.com/container-registry/docs/support/deprecation-notices#gcloud-docker

The push refers to repository [us.gcr.io/apache-beam-testing/java-postcommit-it/java]
9657c191f870: Preparing
608145f7a133: Preparing
d1835ef79363: Preparing
7a7927b8b496: Preparing
cc5670efe078: Preparing
0e184432d6ea: Preparing
e38039b33207: Preparing
1493739e03e4: Preparing
0998c87d3f45: Preparing
b3b14370f813: Preparing
934fdd20a5cb: Preparing
0ee51125dd26: Preparing
ae5ade8d6073: Preparing
0f4c8665f084: Preparing
916915948ce2: Preparing
3b478ddd8a61: Preparing
cb90abe0244c: Preparing
f7ec018ed0af: Preparing
8e87ff28f1b5: Preparing
934fdd20a5cb: Waiting
0ee51125dd26: Waiting
ae5ade8d6073: Waiting
b3b14370f813: Waiting
0f4c8665f084: Waiting
e38039b33207: Waiting
916915948ce2: Waiting
0e184432d6ea: Waiting
1493739e03e4: Waiting
cb90abe0244c: Waiting
3b478ddd8a61: Waiting
f7ec018ed0af: Waiting
8e87ff28f1b5: Waiting
d1835ef79363: Pushed
cc5670efe078: Pushed
608145f7a133: Pushed
9657c191f870: Pushed
0e184432d6ea: Pushed
7a7927b8b496: Pushed
1493739e03e4: Pushed
0998c87d3f45: Pushed
e38039b33207: Pushed
b3b14370f813: Pushed
934fdd20a5cb: Pushed
916915948ce2: Layer already exists
3b478ddd8a61: Layer already exists
0ee51125dd26: Pushed
cb90abe0244c: Layer already exists
f7ec018ed0af: Layer already exists
8e87ff28f1b5: Layer already exists
ae5ade8d6073: Pushed
0f4c8665f084: Pushed
20240124215738: digest: sha256:1c5ca695001874523dce5b9e8f401555e3ce35dca965e14b2633bb3ec7c0b52b size: 4299

> Task :runners:google-cloud-dataflow-java:coreSDKJavaRunnerV2IntegrationTest NO-SOURCE
> Task :runners:google-cloud-dataflow-java:googleCloudPlatformRunnerV2IntegrationTest

org.apache.beam.sdk.io.gcp.bigtable.changestreams.it.BigtableChangeStreamIT > testDeleteRow FAILED
    java.lang.RuntimeException at BigtableChangeStreamIT.java:190
        Caused by: com.google.api.client.googleapis.json.GoogleJsonResponseException at BigtableChangeStreamIT.java:190

org.apache.beam.sdk.io.gcp.bigtable.changestreams.it.BigtableChangeStreamIT > testDeleteColumnFamily FAILED
    java.lang.RuntimeException at BigtableChangeStreamIT.java:215
        Caused by: com.google.api.client.googleapis.json.GoogleJsonResponseException at BigtableChangeStreamIT.java:215

org.apache.beam.sdk.io.gcp.bigtable.changestreams.it.BigtableChangeStreamIT > testDeleteCell FAILED
    java.lang.RuntimeException at BigtableChangeStreamIT.java:247
        Caused by: com.google.api.client.googleapis.json.GoogleJsonResponseException at BigtableChangeStreamIT.java:247

157 tests completed, 3 failed, 27 skipped

> Task :runners:google-cloud-dataflow-java:googleCloudPlatformRunnerV2IntegrationTest FAILED

> Task :runners:google-cloud-dataflow-java:cleanUpDockerJavaImages
Untagged: us.gcr.io/apache-beam-testing/java-postcommit-it/java:20240124215738
Untagged: us.gcr.io/apache-beam-testing/java-postcommit-it/java@sha256:1c5ca695001874523dce5b9e8f401555e3ce35dca965e14b2633bb3ec7c0b52b
Deleted: sha256:e58a899abccf0f84af99f12c766a2757529969455ffa1703da325de08c9f1c72
Deleted: sha256:19aad18859d1512fdf839dbe1e84fc23204dce714344d7ed69192a893a5c6b32
Deleted: sha256:1fe096d2869a5bfbd5e786e9340770bc84941ba43d4417ff389a17dd6eae43b7
Deleted: sha256:a6724e2f099d056d40f789883e405926fd8ccc467fb15dc1f088f6b86b2c7fd1
Deleted: sha256:5e56eca787ef3791c2eaf7f869f164ddfb0c4a6a3fae1ff5ce4c3f9d95009184
Deleted: sha256:1ad3c9f2f6e14cf471559617ad37be11252c49449904645bd8466452acf1ce06
Deleted: sha256:32b0b38272ebc6b8324c22d2837b945939c68237f5045f48309806a0276cfbea
Deleted: sha256:85d0060b8af30d0abe8f39d244493e183148a6320aac158fd0bf52cf8114642c
Deleted: sha256:986e1f7f890a415558224cf480119a2b01b64c19d4dff80ed645a70c3d6db41a
Deleted: sha256:fdfb3c5140842c15fda7515842600252468f351e9cffd939241614b68294750c
Deleted: sha256:82fcd24e5411c7ee22978d20d0bbf467785c27b517ffce33490a0ae69fc48814
Deleted: sha256:4a8ef216492dd8e03ffa745c63aba67fc46df75e619d36c68e2e257ecadcdd5a
Deleted: sha256:d7e1acc4afe841d753f7c60e8e88b700f00a38117e78c202013f5b710bc58f54
Deleted: sha256:418ed81756079cfc64e548fdeb1e7276b773fb9ab9d7461ba2b0a8fcf9aefc09
Deleted: sha256:df2bd25a89d2c02811fa386c351924435afa049cef2ab42f1661380876627bec
Deleted: sha256:4e2fffb2771acb5e0a5f7350912ccc6a247ecafb12581123307738d48abe3c9d
Deleted: sha256:f7858d7841261e5f9ba2947e80052c9c66bc8d5f0d8bf8ba9d2a6da3a7dd2fa1
Deleted: sha256:77ec9cb7a8e87bebdc47699c632325d84149bb426b0e7fbfc38ef3009e3e6f05
Deleted: sha256:570ca9d3af62168344183bad14dd4e81fb18c9e76d5711cc137eaf3d9257a242
Deleted: sha256:52c47521cfee4bdff69868cd56e28e1424db85593df82d4b342003ac1b7205fa
Deleted: sha256:959005d2ec7fb9903c5a9d1f1a7c5f5ae2f90a21b545ec426dfaf1f1d3998ea7
Deleted: sha256:40021b2da22412e4a49b9a3ddf3e9a2bfffa53512eb7b085ed443d27f6bc562b
Deleted: sha256:e595d73cdf5fcfd9efabd70a7036bc51bd645e3892d5d3541be364b120fa7caa
Deleted: sha256:86fcb5428131c14db61eeb1c8f1e663f3f995841dd9ea95805d3fca062a19675
Deleted: sha256:feae9fb839cd408c36f299410649fb4dcfa1b0d19ea3aca4ff9e4d490bf9611f
Deleted: sha256:02b2a611d5e2676b849bc64af94f0373980a327385de9b6db33aa8af8377696c
Deleted: sha256:dc2c68aa6783edaf2e2b05ede196dd5a04b06b0596698f1b57bb5e384f89c371
Deleted: sha256:2300ee1bc0d391d43becd432bb085bfadd04f4259805cfddec3159e9b9be92f0
Deleted: sha256:528dd9aec9e9e8beb82a6e3a027b1bcf519253a2c5ef433d50fbbaa0126350de
Deleted: sha256:8aa3edeb8d2f7d5f9b1ce2c25a45766621b1bb0a01925e9fb9de99b0d6b8a061
Deleted: sha256:d580b4c69d4a1037c88be940e7512f040f7c2f184a26b27daa0192124fbfa768
Deleted: sha256:4b26fdf6fae927c5739aabe605ce48c5315e95c0f74ba7179dc81402281a549c
Deleted: sha256:34a08cba6c697c860170be725d89fd70db5e186c8bb00e36cd5e8fe1d68ccbb5
Deleted: sha256:a288ba21a8cf78d76932d29884c99b7e319ed8c4383da9365b6fb44f04e5515c
WARNING: Successfully resolved tag to sha256, but it is recommended to use sha256 directly.
Tag: [us.gcr.io/apache-beam-testing/java-postcommit-it/java:20240124215738]
- referencing digest: [us.gcr.io/apache-beam-testing/java-postcommit-it/java@sha256:1c5ca695001874523dce5b9e8f401555e3ce35dca965e14b2633bb3ec7c0b52b]

Deleted [[us.gcr.io/apache-beam-testing/java-postcommit-it/java:20240124215738] (referencing [us.gcr.io/apache-beam-testing/java-postcommit-it/java@sha256:1c5ca695001874523dce5b9e8f401555e3ce35dca965e14b2633bb3ec7c0b52b])].
Removing untagged image us.gcr.io/apache-beam-testing/java-postcommit-it/java@sha256:1c5ca695001874523dce5b9e8f401555e3ce35dca965e14b2633bb3ec7c0b52b

FAILURE: Build failed with an exception.

* What went wrong:
Execution failed for task ':runners:google-cloud-dataflow-java:googleCloudPlatformRunnerV2IntegrationTest'.
> There were failing tests. See the report at: file://<https://ci-beam.apache.org/job/beam_PostCommit_Java_DataflowV2/ws/src/runners/google-cloud-dataflow-java/build/reports/tests/googleCloudPlatformRunnerV2IntegrationTest/index.html>

Deprecated Gradle features were used in this build, making it incompatible with Gradle 9.0.

You can use '--warning-mode all' to show the individual deprecation warnings and determine if they come from your own scripts or plugins.

For more on this, please refer to https://docs.gradle.org/8.4/userguide/command_line_interface.html#sec:command_line_warnings in the Gradle documentation.

BUILD FAILED in 3h 26m 9s
136 actionable tasks: 89 executed, 45 from cache, 2 up-to-date

Publishing build scan...
https://ge.apache.org/s/pyquw327fztvm

Build step 'Invoke Gradle script' changed build result to FAILURE
Build step 'Invoke Gradle script' marked build as failure

---------------------------------------------------------------------
To unsubscribe, e-mail: builds-unsubscribe@beam.apache.org
For additional commands, e-mail: builds-help@beam.apache.org


Build failed in Jenkins: beam_PostCommit_Java_DataflowV2 #4026

Posted by Apache Jenkins Server <je...@builds.apache.org>.
See <https://ci-beam.apache.org/job/beam_PostCommit_Java_DataflowV2/4026/display/redirect>

Changes:


------------------------------------------
[...truncated 41.08 KB...]
> Task :sdks:java:harness:jar
> Task :runners:java-fn-execution:compileJava FROM-CACHE
> Task :runners:java-fn-execution:classes UP-TO-DATE
> Task :runners:java-fn-execution:jar
> Task :sdks:java:extensions:google-cloud-platform-core:compileTestJava FROM-CACHE
> Task :sdks:java:extensions:avro:compileTestJava FROM-CACHE
> Task :sdks:java:extensions:avro:testClasses UP-TO-DATE
> Task :sdks:java:expansion-service:compileJava FROM-CACHE
> Task :sdks:java:expansion-service:classes UP-TO-DATE
> Task :sdks:java:expansion-service:jar
> Task :sdks:java:extensions:avro:testJar
> Task :runners:core-java:compileTestJava FROM-CACHE
> Task :runners:core-java:testClasses UP-TO-DATE
> Task :runners:direct-java:compileJava FROM-CACHE
> Task :runners:direct-java:classes UP-TO-DATE
> Task :runners:core-java:testJar
> Task :sdks:java:extensions:google-cloud-platform-core:testClasses UP-TO-DATE
> Task :sdks:java:extensions:google-cloud-platform-core:testJar
> Task :sdks:java:io:kafka:compileJava FROM-CACHE
> Task :sdks:java:io:kafka:classes UP-TO-DATE
> Task :sdks:java:io:kafka:jar
> Task :sdks:java:harness:shadowJar FROM-CACHE
> Task :sdks:java:container:java8:copyDockerfileDependencies
> Task :runners:direct-java:shadowJar FROM-CACHE
> Task :runners:direct-java:compileTestJava FROM-CACHE
> Task :runners:direct-java:testClasses UP-TO-DATE
> Task :sdks:java:extensions:protobuf:extractIncludeTestProto
> Task :sdks:java:extensions:protobuf:generateTestProto FROM-CACHE
> Task :sdks:java:extensions:protobuf:compileTestJava FROM-CACHE
> Task :sdks:java:extensions:protobuf:testClasses
> Task :sdks:java:extensions:protobuf:testJar
> Task :runners:direct-java:shadowTestJar FROM-CACHE
> Task :sdks:java:io:google-cloud-platform:compileJava FROM-CACHE
> Task :sdks:java:io:google-cloud-platform:classes UP-TO-DATE
> Task :sdks:java:io:google-cloud-platform:jar
> Task :runners:google-cloud-dataflow-java:compileJava FROM-CACHE
> Task :runners:google-cloud-dataflow-java:classes
> Task :runners:google-cloud-dataflow-java:jar

> Task :sdks:java:container:pullLicenses
Collecting pip
  Using cached pip-23.3.2-py3-none-any.whl (2.1 MB)

> Task :sdks:java:io:google-cloud-platform:compileTestJava FROM-CACHE
> Task :sdks:java:io:google-cloud-platform:testClasses

> Task :release:go-licenses:java:dockerRun
go: downloading github.com/golang/protobuf v1.5.3
go: downloading google.golang.org/grpc v1.59.0
go: downloading google.golang.org/protobuf v1.31.0
go: downloading golang.org/x/sys v0.15.0
go: downloading google.golang.org/genproto/googleapis/rpc v0.0.0-20231120223509-83a465c0220f
go: downloading golang.org/x/net v0.19.0
go: downloading google.golang.org/genproto v0.0.0-20231106174013-bbf56f31fb17

> Task :sdks:java:io:google-cloud-platform:testJar

> Task :sdks:java:container:pullLicenses
Collecting setuptools
  Using cached setuptools-69.0.3-py3-none-any.whl (819 kB)
Collecting wheel
  Using cached wheel-0.42.0-py3-none-any.whl (65 kB)
Installing collected packages: pip, setuptools, wheel
  Attempting uninstall: pip
    Found existing installation: pip 20.0.2
    Uninstalling pip-20.0.2:
      Successfully uninstalled pip-20.0.2
  Attempting uninstall: setuptools
    Found existing installation: setuptools 44.0.0
    Uninstalling setuptools-44.0.0:
      Successfully uninstalled setuptools-44.0.0
Successfully installed pip-23.3.2 setuptools-69.0.3 wheel-0.42.0
Collecting beautifulsoup4<5.0,>=4.9.0 (from -r /home/jenkins/jenkins-slave/workspace/beam_PostCommit_Java_DataflowV2/src/sdks/java/container/license_scripts/requirement.txt (line 19))
  Using cached beautifulsoup4-4.12.3-py3-none-any.whl.metadata (3.8 kB)
Collecting pyyaml<7,>=6.0.1 (from -r /home/jenkins/jenkins-slave/workspace/beam_PostCommit_Java_DataflowV2/src/sdks/java/container/license_scripts/requirement.txt (line 20))
  Using cached PyYAML-6.0.1-cp38-cp38-manylinux_2_17_x86_64.manylinux2014_x86_64.whl.metadata (2.1 kB)
Collecting tenacity<9.0,>=6.1.0 (from -r /home/jenkins/jenkins-slave/workspace/beam_PostCommit_Java_DataflowV2/src/sdks/java/container/license_scripts/requirement.txt (line 21))
  Using cached tenacity-8.2.3-py3-none-any.whl.metadata (1.0 kB)
Collecting soupsieve>1.2 (from beautifulsoup4<5.0,>=4.9.0->-r /home/jenkins/jenkins-slave/workspace/beam_PostCommit_Java_DataflowV2/src/sdks/java/container/license_scripts/requirement.txt (line 19))
  Using cached soupsieve-2.5-py3-none-any.whl.metadata (4.7 kB)
Using cached beautifulsoup4-4.12.3-py3-none-any.whl (147 kB)
Using cached PyYAML-6.0.1-cp38-cp38-manylinux_2_17_x86_64.manylinux2014_x86_64.whl (736 kB)
Using cached tenacity-8.2.3-py3-none-any.whl (24 kB)
Using cached soupsieve-2.5-py3-none-any.whl (36 kB)
Installing collected packages: tenacity, soupsieve, pyyaml, beautifulsoup4
Successfully installed beautifulsoup4-4.12.3 pyyaml-6.0.1 soupsieve-2.5 tenacity-8.2.3
Executing python /home/jenkins/jenkins-slave/workspace/beam_PostCommit_Java_DataflowV2/src/sdks/java/container/license_scripts/pull_licenses_java.py --license_index=/home/jenkins/jenkins-slave/workspace/beam_PostCommit_Java_DataflowV2/src/sdks/java/container/build/reports/dependency-license/index.json        --output_dir=/home/jenkins/jenkins-slave/workspace/beam_PostCommit_Java_DataflowV2/src/sdks/java/container/build/target/java_third_party_licenses        --dep_url_yaml=/home/jenkins/jenkins-slave/workspace/beam_PostCommit_Java_DataflowV2/src/sdks/java/container/license_scripts/dep_urls_java.yaml        --manual_license_path=/home/jenkins/jenkins-slave/workspace/beam_PostCommit_Java_DataflowV2/src/sdks/java/container/license_scripts/manual_licenses
INFO:root:Pulling license for 129 dependencies using 16 threads.
INFO:root:Replaced local file URL with file:///home/jenkins/jenkins-slave/workspace/beam_PostCommit_Java_DataflowV2/src/sdks/java/container/license_scripts/manual_licenses/xz/COPYING for xz-1.5
INFO:root:pull_licenses_java.py succeed. It took 8.156202 seconds with 16 threads.
Copying licenses from /home/jenkins/jenkins-slave/workspace/beam_PostCommit_Java_DataflowV2/src/sdks/java/container/build/target/java_third_party_licenses to /home/jenkins/jenkins-slave/workspace/beam_PostCommit_Java_DataflowV2/src/sdks/java/container/build/target/third_party_licenses.
Finished license_scripts.sh

> Task :release:go-licenses:java:dockerRun
go: downloading golang.org/x/text v0.14.0
go: added github.com/apache/beam/sdks/v2 v2.53.0
go: added github.com/golang/protobuf v1.5.3
go: added golang.org/x/net v0.19.0
go: added golang.org/x/sys v0.15.0
go: added golang.org/x/text v0.14.0
go: added google.golang.org/genproto/googleapis/rpc v0.0.0-20231120223509-83a465c0220f
go: added google.golang.org/grpc v1.59.0
go: added google.golang.org/protobuf v1.31.0
+ go-licenses save github.com/apache/beam/sdks/v2/java/container --save_path=/output/licenses
W0124 15:58:04.103751      37 library.go:101] "golang.org/x/sys/unix" contains non-Go code that can't be inspected for further dependencies:
/go/pkg/mod/golang.org/x/sys@v0.15.0/unix/asm_linux_amd64.s
+ go-licenses csv github.com/apache/beam/sdks/v2/java/container
+ tee /output/licenses/list.csv
W0124 15:58:08.252860      82 library.go:101] "golang.org/x/sys/unix" contains non-Go code that can't be inspected for further dependencies:
/go/pkg/mod/golang.org/x/sys@v0.15.0/unix/asm_linux_amd64.s
github.com/apache/beam/sdks/v2/go,https://github.com/apache/beam/blob/sdks/v2.53.0/sdks/go/README.md,Apache-2.0
github.com/apache/beam/sdks/v2/java/container,https://github.com/apache/beam/blob/sdks/v2.53.0/sdks/LICENSE,Apache-2.0
github.com/golang/protobuf,https://github.com/golang/protobuf/blob/v1.5.3/LICENSE,BSD-3-Clause
golang.org/x/net,https://cs.opensource.google/go/x/net/+/v0.19.0:LICENSE,BSD-3-Clause
golang.org/x/sys/unix,https://cs.opensource.google/go/x/sys/+/v0.15.0:LICENSE,BSD-3-Clause
golang.org/x/text,https://cs.opensource.google/go/x/text/+/v0.14.0:LICENSE,BSD-3-Clause
google.golang.org/genproto/googleapis/rpc/status,https://github.com/googleapis/go-genproto/blob/83a465c0220f/googleapis/rpc/LICENSE,Apache-2.0
google.golang.org/grpc,https://github.com/grpc/grpc-go/blob/v1.59.0/LICENSE,Apache-2.0
google.golang.org/protobuf,https://github.com/protocolbuffers/protobuf-go/blob/v1.31.0/LICENSE,BSD-3-Clause
+ chmod -R a+w /output/licenses

> Task :sdks:java:container:java8:copyJavaThirdPartyLicenses

> Task :sdks:java:container:downloadCloudProfilerAgent
  % Total    % Received % Xferd  Average Speed   Time    Time     Time  Current
                                 Dload  Upload   Total   Spent    Left  Speed
  0     0    0     0    0     0      0      0 --:--:-- --:--:-- --:--:--     0version.txt
NOTICES
profiler_java_agent.so
100 4183k  100 4183k    0     0  23.2M      0 --:--:-- --:--:-- --:--:-- 23.2M

> Task :sdks:java:container:goPrepare UP-TO-DATE

> Task :sdks:java:container:goBuild
/home/jenkins/go/bin/go1.21.5 build -o ./build/target/linux_amd64/boot boot.go boot_test.go pathingjar.go pathingjar_test.go

> Task :sdks:java:container:java8:copySdkHarnessLauncher
> Task :release:go-licenses:java:createLicenses
> Task :sdks:java:container:java8:copyGolangLicenses
> Task :sdks:java:container:java8:dockerPrepare
> Task :sdks:java:container:java8:docker

> Task :runners:google-cloud-dataflow-java:buildAndPushDockerJavaContainer
WARNING: `gcloud docker` will not be supported for Docker client versions above 18.03.

As an alternative, use `gcloud auth configure-docker` to configure `docker` to
use `gcloud` as a credential helper, then use `docker` as you would for non-GCR
registries, e.g. `docker pull gcr.io/project-id/my-image`. Add
`--verbosity=error` to silence this warning: `gcloud docker
--verbosity=error -- pull gcr.io/project-id/my-image`.

See: https://cloud.google.com/container-registry/docs/support/deprecation-notices#gcloud-docker

The push refers to repository [us.gcr.io/apache-beam-testing/java-postcommit-it/java]
841abcdcf363: Preparing
c545aa38664d: Preparing
93ec65f2a0f0: Preparing
2f38f64039bb: Preparing
cdbec3a9152e: Preparing
e9f179795dfe: Preparing
effbfd3e6f3a: Preparing
b5d8d00f29da: Preparing
f6abe880dd09: Preparing
fe9616c244c6: Preparing
0afa75fbc8e0: Preparing
3c9e883abfcb: Preparing
d8dcfdef8c46: Preparing
2e049207a5d1: Preparing
916915948ce2: Preparing
3b478ddd8a61: Preparing
cb90abe0244c: Preparing
f7ec018ed0af: Preparing
8e87ff28f1b5: Preparing
e9f179795dfe: Waiting
fe9616c244c6: Waiting
b5d8d00f29da: Waiting
f6abe880dd09: Waiting
effbfd3e6f3a: Waiting
0afa75fbc8e0: Waiting
d8dcfdef8c46: Waiting
3c9e883abfcb: Waiting
2e049207a5d1: Waiting
f7ec018ed0af: Waiting
8e87ff28f1b5: Waiting
cb90abe0244c: Waiting
916915948ce2: Waiting
3b478ddd8a61: Waiting
c545aa38664d: Pushed
93ec65f2a0f0: Pushed
cdbec3a9152e: Pushed
841abcdcf363: Pushed
2f38f64039bb: Pushed
e9f179795dfe: Pushed
b5d8d00f29da: Pushed
fe9616c244c6: Pushed
effbfd3e6f3a: Pushed
0afa75fbc8e0: Pushed
916915948ce2: Layer already exists
3b478ddd8a61: Layer already exists
cb90abe0244c: Layer already exists
f7ec018ed0af: Layer already exists
f6abe880dd09: Pushed
3c9e883abfcb: Pushed
8e87ff28f1b5: Layer already exists
d8dcfdef8c46: Pushed
2e049207a5d1: Pushed
20240124155744: digest: sha256:a3e1e0b842e1335db421dbb50204222564043168ef2367c6dd0057639bccd663 size: 4299

> Task :runners:google-cloud-dataflow-java:coreSDKJavaRunnerV2IntegrationTest NO-SOURCE
> Task :runners:google-cloud-dataflow-java:googleCloudPlatformRunnerV2IntegrationTest

org.apache.beam.sdk.io.gcp.healthcare.DicomIOReadIT > testDicomMetadataRead FAILED
    java.nio.file.NoSuchFileException at DicomIOReadIT.java:56

org.apache.beam.sdk.io.gcp.healthcare.DicomIOReadIT > testDicomFailedMetadataRead FAILED
    java.nio.file.NoSuchFileException at DicomIOReadIT.java:56
FATAL: command execution failed
java.io.IOException: Backing channel 'apache-beam-jenkins-14' is disconnected.
	at hudson.remoting.RemoteInvocationHandler.channelOrFail(RemoteInvocationHandler.java:215)
	at hudson.remoting.RemoteInvocationHandler.invoke(RemoteInvocationHandler.java:285)
	at com.sun.proxy.$Proxy197.isAlive(Unknown Source)
	at hudson.Launcher$RemoteLauncher$ProcImpl.isAlive(Launcher.java:1215)
	at hudson.Launcher$RemoteLauncher$ProcImpl.join(Launcher.java:1207)
	at hudson.Launcher$ProcStarter.join(Launcher.java:524)
	at hudson.plugins.gradle.Gradle.perform(Gradle.java:321)
	at hudson.tasks.BuildStepMonitor$1.perform(BuildStepMonitor.java:20)
	at hudson.model.AbstractBuild$AbstractBuildExecution.perform(AbstractBuild.java:818)
	at hudson.model.Build$BuildExecution.build(Build.java:199)
	at hudson.model.Build$BuildExecution.doRun(Build.java:164)
	at hudson.model.AbstractBuild$AbstractBuildExecution.run(AbstractBuild.java:526)
	at hudson.model.Run.execute(Run.java:1900)
	at hudson.model.FreeStyleBuild.run(FreeStyleBuild.java:44)
	at hudson.model.ResourceController.execute(ResourceController.java:101)
	at hudson.model.Executor.run(Executor.java:442)
Caused by: java.io.IOException: Unexpected termination of the channel
	at hudson.remoting.SynchronousCommandTransport$ReaderThread.run(SynchronousCommandTransport.java:75)
Caused by: java.io.EOFException
	at java.base/java.io.ObjectInputStream$PeekInputStream.readFully(ObjectInputStream.java:2911)
	at java.base/java.io.ObjectInputStream$BlockDataInputStream.readShort(ObjectInputStream.java:3406)
	at java.base/java.io.ObjectInputStream.readStreamHeader(ObjectInputStream.java:932)
	at java.base/java.io.ObjectInputStream.<init>(ObjectInputStream.java:375)
	at hudson.remoting.ObjectInputStreamEx.<init>(ObjectInputStreamEx.java:49)
	at hudson.remoting.Command.readFrom(Command.java:142)
	at hudson.remoting.Command.readFrom(Command.java:128)
	at hudson.remoting.AbstractSynchronousByteArrayCommandTransport.read(AbstractSynchronousByteArrayCommandTransport.java:35)
	at hudson.remoting.SynchronousCommandTransport$ReaderThread.run(SynchronousCommandTransport.java:61)
Build step 'Invoke Gradle script' changed build result to FAILURE
Build step 'Invoke Gradle script' marked build as failure
ERROR: apache-beam-jenkins-14 is offline; cannot locate jdk_1.8_latest

---------------------------------------------------------------------
To unsubscribe, e-mail: builds-unsubscribe@beam.apache.org
For additional commands, e-mail: builds-help@beam.apache.org


Build failed in Jenkins: beam_PostCommit_Java_DataflowV2 #4025

Posted by Apache Jenkins Server <je...@builds.apache.org>.
See <https://ci-beam.apache.org/job/beam_PostCommit_Java_DataflowV2/4025/display/redirect?page=changes>

Changes:

[noreply] Merge pull request #30059 [YAML] Require numStreams for unbounded


------------------------------------------
[...truncated 49.07 KB...]
> Task :sdks:java:container:pullLicenses
Collecting setuptools
  Using cached setuptools-69.0.3-py3-none-any.whl (819 kB)
Collecting wheel
  Using cached wheel-0.42.0-py3-none-any.whl (65 kB)
Installing collected packages: pip, setuptools, wheel
  Attempting uninstall: pip
    Found existing installation: pip 20.0.2
    Uninstalling pip-20.0.2:
      Successfully uninstalled pip-20.0.2
  Attempting uninstall: setuptools
    Found existing installation: setuptools 44.0.0
    Uninstalling setuptools-44.0.0:
      Successfully uninstalled setuptools-44.0.0
Successfully installed pip-23.3.2 setuptools-69.0.3 wheel-0.42.0
Collecting beautifulsoup4<5.0,>=4.9.0 (from -r <https://ci-beam.apache.org/job/beam_PostCommit_Java_DataflowV2/ws/src/sdks/java/container/license_scripts/requirement.txt> (line 19))
  Using cached beautifulsoup4-4.12.3-py3-none-any.whl.metadata (3.8 kB)
Collecting pyyaml<7,>=6.0.1 (from -r <https://ci-beam.apache.org/job/beam_PostCommit_Java_DataflowV2/ws/src/sdks/java/container/license_scripts/requirement.txt> (line 20))
  Using cached PyYAML-6.0.1-cp38-cp38-manylinux_2_17_x86_64.manylinux2014_x86_64.whl.metadata (2.1 kB)
Collecting tenacity<9.0,>=6.1.0 (from -r <https://ci-beam.apache.org/job/beam_PostCommit_Java_DataflowV2/ws/src/sdks/java/container/license_scripts/requirement.txt> (line 21))
  Using cached tenacity-8.2.3-py3-none-any.whl.metadata (1.0 kB)
Collecting soupsieve>1.2 (from beautifulsoup4<5.0,>=4.9.0->-r <https://ci-beam.apache.org/job/beam_PostCommit_Java_DataflowV2/ws/src/sdks/java/container/license_scripts/requirement.txt> (line 19))
  Using cached soupsieve-2.5-py3-none-any.whl.metadata (4.7 kB)
Using cached beautifulsoup4-4.12.3-py3-none-any.whl (147 kB)
Using cached PyYAML-6.0.1-cp38-cp38-manylinux_2_17_x86_64.manylinux2014_x86_64.whl (736 kB)
Using cached tenacity-8.2.3-py3-none-any.whl (24 kB)
Using cached soupsieve-2.5-py3-none-any.whl (36 kB)
Installing collected packages: tenacity, soupsieve, pyyaml, beautifulsoup4
Successfully installed beautifulsoup4-4.12.3 pyyaml-6.0.1 soupsieve-2.5 tenacity-8.2.3
Executing python <https://ci-beam.apache.org/job/beam_PostCommit_Java_DataflowV2/ws/src/sdks/java/container/license_scripts/pull_licenses_java.py> --license_index=<https://ci-beam.apache.org/job/beam_PostCommit_Java_DataflowV2/ws/src/sdks/java/container/build/reports/dependency-license/index.json>        --output_dir=<https://ci-beam.apache.org/job/beam_PostCommit_Java_DataflowV2/ws/src/sdks/java/container/build/target/java_third_party_licenses>        --dep_url_yaml=<https://ci-beam.apache.org/job/beam_PostCommit_Java_DataflowV2/ws/src/sdks/java/container/license_scripts/dep_urls_java.yaml>        --manual_license_path=<https://ci-beam.apache.org/job/beam_PostCommit_Java_DataflowV2/ws/src/sdks/java/container/license_scripts/manual_licenses>
INFO:root:Pulling license for 129 dependencies using 16 threads.
INFO:root:Replaced local file URL with file://<https://ci-beam.apache.org/job/beam_PostCommit_Java_DataflowV2/ws/src/sdks/java/container/license_scripts/manual_licenses/xz/COPYING> for xz-1.5
INFO:root:pull_licenses_java.py succeed. It took 1.633419 seconds with 16 threads.
Copying licenses from <https://ci-beam.apache.org/job/beam_PostCommit_Java_DataflowV2/ws/src/sdks/java/container/build/target/java_third_party_licenses> to <https://ci-beam.apache.org/job/beam_PostCommit_Java_DataflowV2/ws/src/sdks/java/container/build/target/third_party_licenses.>
Finished license_scripts.sh

> Task :sdks:java:testing:test-utils:compileJava
> Task :sdks:java:testing:test-utils:classes

> Task :release:go-licenses:java:dockerRun
go: downloading github.com/golang/protobuf v1.5.3
go: downloading google.golang.org/grpc v1.59.0
go: downloading golang.org/x/sys v0.15.0
go: downloading google.golang.org/protobuf v1.31.0
go: downloading google.golang.org/genproto/googleapis/rpc v0.0.0-20231120223509-83a465c0220f
go: downloading golang.org/x/net v0.19.0
go: downloading google.golang.org/genproto v0.0.0-20231106174013-bbf56f31fb17
go: downloading golang.org/x/text v0.14.0
go: added github.com/apache/beam/sdks/v2 v2.53.0
go: added github.com/golang/protobuf v1.5.3
go: added golang.org/x/net v0.19.0
go: added golang.org/x/sys v0.15.0
go: added golang.org/x/text v0.14.0
go: added google.golang.org/genproto/googleapis/rpc v0.0.0-20231120223509-83a465c0220f
go: added google.golang.org/grpc v1.59.0
go: added google.golang.org/protobuf v1.31.0
+ go-licenses save github.com/apache/beam/sdks/v2/java/container --save_path=/output/licenses
W0124 09:57:57.854392      36 library.go:101] "golang.org/x/sys/unix" contains non-Go code that can't be inspected for further dependencies:
/go/pkg/mod/golang.org/x/sys@v0.15.0/unix/asm_linux_amd64.s

> Task :sdks:java:testing:test-utils:jar
> Task :sdks:java:testing:test-utils:compileTestJava FROM-CACHE
> Task :sdks:java:testing:test-utils:testClasses UP-TO-DATE
> Task :sdks:java:testing:test-utils:testJar
> Task :sdks:java:container:java8:copyJavaThirdPartyLicenses

> Task :sdks:java:container:downloadCloudProfilerAgent
  % Total    % Received % Xferd  Average Speed   Time    Time     Time  Current
                                 Dload  Upload   Total   Spent    Left  Speed
  0     0    0     0    0     0      0      0 --:--:-- --:--:-- --:--:--     0version.txt
NOTICES
profiler_java_agent.so
100 4183k  100 4183k    0     0  24.1M      0 --:--:-- --:--:-- --:--:-- 24.1M

> Task :sdks:java:container:goPrepare UP-TO-DATE
> Task :sdks:java:io:google-cloud-platform:compileTestJava FROM-CACHE
> Task :sdks:java:io:google-cloud-platform:testClasses
> Task :sdks:java:io:google-cloud-platform:testJar

> Task :release:go-licenses:java:dockerRun
+ go-licenses csv github.com/apache/beam/sdks/v2/java/container
+ tee /output/licenses/list.csv
W0124 09:58:02.683273      81 library.go:101] "golang.org/x/sys/unix" contains non-Go code that can't be inspected for further dependencies:
/go/pkg/mod/golang.org/x/sys@v0.15.0/unix/asm_linux_amd64.s

> Task :sdks:java:container:goBuild
/home/jenkins/go/bin/go1.21.5 build -o ./build/target/linux_amd64/boot boot.go boot_test.go pathingjar.go pathingjar_test.go

> Task :sdks:java:container:java8:copySdkHarnessLauncher

> Task :release:go-licenses:java:dockerRun
github.com/apache/beam/sdks/v2/go,https://github.com/apache/beam/blob/sdks/v2.53.0/sdks/go/README.md,Apache-2.0
github.com/apache/beam/sdks/v2/java/container,https://github.com/apache/beam/blob/sdks/v2.53.0/sdks/LICENSE,Apache-2.0
github.com/golang/protobuf,https://github.com/golang/protobuf/blob/v1.5.3/LICENSE,BSD-3-Clause
golang.org/x/net,https://cs.opensource.google/go/x/net/+/v0.19.0:LICENSE,BSD-3-Clause
golang.org/x/sys/unix,https://cs.opensource.google/go/x/sys/+/v0.15.0:LICENSE,BSD-3-Clause
golang.org/x/text,https://cs.opensource.google/go/x/text/+/v0.14.0:LICENSE,BSD-3-Clause
google.golang.org/genproto/googleapis/rpc/status,https://github.com/googleapis/go-genproto/blob/83a465c0220f/googleapis/rpc/LICENSE,Apache-2.0
google.golang.org/grpc,https://github.com/grpc/grpc-go/blob/v1.59.0/LICENSE,Apache-2.0
google.golang.org/protobuf,https://github.com/protocolbuffers/protobuf-go/blob/v1.31.0/LICENSE,BSD-3-Clause
+ chmod -R a+w /output/licenses

> Task :release:go-licenses:java:createLicenses
> Task :sdks:java:container:java8:copyGolangLicenses
> Task :sdks:java:container:java8:dockerPrepare
> Task :sdks:java:container:java8:docker

> Task :runners:google-cloud-dataflow-java:buildAndPushDockerJavaContainer
WARNING: `gcloud docker` will not be supported for Docker client versions above 18.03.

As an alternative, use `gcloud auth configure-docker` to configure `docker` to
use `gcloud` as a credential helper, then use `docker` as you would for non-GCR
registries, e.g. `docker pull gcr.io/project-id/my-image`. Add
`--verbosity=error` to silence this warning: `gcloud docker
--verbosity=error -- pull gcr.io/project-id/my-image`.

See: https://cloud.google.com/container-registry/docs/support/deprecation-notices#gcloud-docker

The push refers to repository [us.gcr.io/apache-beam-testing/java-postcommit-it/java]
f75fd7be5988: Preparing
a466ef848432: Preparing
ee6333944722: Preparing
911cb1f523b6: Preparing
a2836b66413f: Preparing
c645b4f3e024: Preparing
cca82f8a9e52: Preparing
82e748db6edc: Preparing
2128719df500: Preparing
f8a14311b2b3: Preparing
9f8e56bc36df: Preparing
daac7a6656d3: Preparing
fb38b05bdc25: Preparing
7291dbbb95e5: Preparing
916915948ce2: Preparing
3b478ddd8a61: Preparing
cb90abe0244c: Preparing
c645b4f3e024: Waiting
9f8e56bc36df: Waiting
f7ec018ed0af: Preparing
cca82f8a9e52: Waiting
8e87ff28f1b5: Preparing
daac7a6656d3: Waiting
82e748db6edc: Waiting
7291dbbb95e5: Waiting
fb38b05bdc25: Waiting
3b478ddd8a61: Waiting
f8a14311b2b3: Waiting
916915948ce2: Waiting
cb90abe0244c: Waiting
8e87ff28f1b5: Waiting
f7ec018ed0af: Waiting
ee6333944722: Pushed
a2836b66413f: Pushed
a466ef848432: Pushed
911cb1f523b6: Pushed
f75fd7be5988: Pushed
c645b4f3e024: Pushed
82e748db6edc: Pushed
f8a14311b2b3: Pushed
9f8e56bc36df: Pushed
daac7a6656d3: Pushed
916915948ce2: Layer already exists
3b478ddd8a61: Layer already exists
cb90abe0244c: Layer already exists
cca82f8a9e52: Pushed
f7ec018ed0af: Layer already exists
8e87ff28f1b5: Layer already exists
2128719df500: Pushed
7291dbbb95e5: Pushed
fb38b05bdc25: Pushed
20240124095738: digest: sha256:61127ff9404e90afa3d54970b9d96bff5b3dd48c3033ce7169b2b9907bff302b size: 4299

> Task :runners:google-cloud-dataflow-java:coreSDKJavaRunnerV2IntegrationTest NO-SOURCE
> Task :runners:google-cloud-dataflow-java:googleCloudPlatformRunnerV2IntegrationTest

org.apache.beam.sdk.io.gcp.healthcare.DicomIOReadIT > testDicomMetadataRead FAILED
    java.nio.file.NoSuchFileException at DicomIOReadIT.java:56

org.apache.beam.sdk.io.gcp.healthcare.DicomIOReadIT > testDicomFailedMetadataRead FAILED
    java.nio.file.NoSuchFileException at DicomIOReadIT.java:56

157 tests completed, 2 failed, 25 skipped

> Task :runners:google-cloud-dataflow-java:googleCloudPlatformRunnerV2IntegrationTest FAILED

> Task :runners:google-cloud-dataflow-java:cleanUpDockerJavaImages
Untagged: us.gcr.io/apache-beam-testing/java-postcommit-it/java:20240124095738
Untagged: us.gcr.io/apache-beam-testing/java-postcommit-it/java@sha256:61127ff9404e90afa3d54970b9d96bff5b3dd48c3033ce7169b2b9907bff302b
Deleted: sha256:1cac6420f56cab66c969bd4c8127114fa34c5daa0db74563959d27f589f3a078
Deleted: sha256:8f40d9e81f6dd49f94274c747c5f796d05407e78c70e4330febfd6466372cb3c
Deleted: sha256:90ccec0a4feeb32f32e12eb407cd7eaca91aa13acd718e5c14d8cdf371f963d3
Deleted: sha256:a3514b44997e66ee56ec00d12a7ae10cb7b06d68f44aaf6dd584a6171ef5a765
Deleted: sha256:273ebe0b3d0733d125634ff86c0ff0da6133595087151e2f423cc7228e99627e
Deleted: sha256:e72758cde06599f2489bbdb44944dfac9e58275b5dcaecb6ca3cd61ac50d61b1
Deleted: sha256:4d8e891998d50c36487545aea086b61941888eca307fc5b208d0acb598080dd2
Deleted: sha256:e89f8ce8b2f560b439cd7f0fb5732865267876c41a8fdf2258aaf844c3ad9fbc
Deleted: sha256:0842d890813d27e625fccf2df396068ba1a27eb3e37445576fa3efbd682ede5a
Deleted: sha256:5fba37ae24225ebcb66abfdcc759fe09f45b8b8fa3647db85db0581fae852703
Deleted: sha256:0ae6a2b7a4b2a9cbe1157db38bb6f2e84ef27a5398420d43072e904e649ffba1
Deleted: sha256:bd61137ea47b5a85bbc5199d84d116b045ffdbc2bfa736bef7a23682f76c8549
Deleted: sha256:ea60e5a6ccdb6bb6ef99c1154572e65dd37a654590d7e45a9a5f035d64f97220
Deleted: sha256:997b4d572ac894986624e8d795255f56495c9e14e23bb036abb130dfcfcaa550
Deleted: sha256:d9cbd1a427c60e40013557b1b49646c694158b791a6c481be700316b9d356ec2
Deleted: sha256:880e0bfc3107424d9bcf6f213668fa747e68db7e111dab4b866bbbb35a4dba24
Deleted: sha256:473a742b7fd8edbb6a75d6f7f7ce4ddc9fddd2acb94db22bce5973ae000bfb1b
Deleted: sha256:6ca3e35a74e8af28c34d3972e6f925159145cc384f73e6b9cdc301e052cacb85
Deleted: sha256:511614abb0dced51742d2f099592098f84311960ccc5a94e0c1e61bb6d4f1906
Deleted: sha256:80746600a6b26fff3be35c106e985c656a7f41fc18845df8d3758342acfe6ff2
Deleted: sha256:253a12b15cba7ed7f3c2d3a4bdd890a1288feaa2d5b58a02f4d2530b7276696f
Deleted: sha256:e4d2aec71d1b06f9c99ede7ded1b400ba78db90ce2f312317f8dcdcf6992bbcd
Deleted: sha256:c9d6d7295ab0075bdee044e4051eb3d51cebccb641a30da914bda13362cbaf77
Deleted: sha256:4be39a946cdb8f01830d590135e12580ec597cf984671b9b7ed235c402ed2597
Deleted: sha256:b02f0f42fa3e86411830842bc9de05d562334d7fb1a44fa953c5db25c2d9d893
Deleted: sha256:54a2413ba363dc2a7f436bee53c2bbaa136c2ecb79145b67369cb753ea7f5d1b
Deleted: sha256:2ade75f623e96d10af7bd3c16999e91926c5decd9ef9c63d514c4d3c986a3cdd
Deleted: sha256:7d829c071120e5d2d83fea7089e88e123799017769501d79f680b8bcbed8a26d
Deleted: sha256:3dc8540c02760747d51606150e4bee15f61d48eff5ef6b698806c063a0cc52b1
Deleted: sha256:d286183587ab8ca1e5681af3368d8964f9963560ba3e329e2559267bfec610c4
Deleted: sha256:95fae112e1ff43ce97f8b365f660872739e0d5aa59c7d503d6716f6fcf871049
Deleted: sha256:20143195db081cba6046b68d4d95169f2fb55d27edfcfee7f2f89668d1cc09a9
Deleted: sha256:e7bdf39a5b8bbe33fab527976bbd359e5f952a7529b52109e1e5f6d9e69dabe7
Deleted: sha256:dbd0a23474a39c7fda2f3cae3d0dc535fe5b23b4201734f342745d7d24053620
WARNING: Successfully resolved tag to sha256, but it is recommended to use sha256 directly.
Tag: [us.gcr.io/apache-beam-testing/java-postcommit-it/java:20240124095738]
- referencing digest: [us.gcr.io/apache-beam-testing/java-postcommit-it/java@sha256:61127ff9404e90afa3d54970b9d96bff5b3dd48c3033ce7169b2b9907bff302b]

Deleted [[us.gcr.io/apache-beam-testing/java-postcommit-it/java:20240124095738] (referencing [us.gcr.io/apache-beam-testing/java-postcommit-it/java@sha256:61127ff9404e90afa3d54970b9d96bff5b3dd48c3033ce7169b2b9907bff302b])].
Removing untagged image us.gcr.io/apache-beam-testing/java-postcommit-it/java@sha256:61127ff9404e90afa3d54970b9d96bff5b3dd48c3033ce7169b2b9907bff302b

FAILURE: Build failed with an exception.

* What went wrong:
Execution failed for task ':runners:google-cloud-dataflow-java:googleCloudPlatformRunnerV2IntegrationTest'.
> There were failing tests. See the report at: file://<https://ci-beam.apache.org/job/beam_PostCommit_Java_DataflowV2/ws/src/runners/google-cloud-dataflow-java/build/reports/tests/googleCloudPlatformRunnerV2IntegrationTest/index.html>

Deprecated Gradle features were used in this build, making it incompatible with Gradle 9.0.

You can use '--warning-mode all' to show the individual deprecation warnings and determine if they come from your own scripts or plugins.

For more on this, please refer to https://docs.gradle.org/8.4/userguide/command_line_interface.html#sec:command_line_warnings in the Gradle documentation.

BUILD FAILED in 3h 46m 14s
136 actionable tasks: 89 executed, 45 from cache, 2 up-to-date

Publishing build scan...
https://ge.apache.org/s/mok557culcpzg

Build step 'Invoke Gradle script' changed build result to FAILURE
Build step 'Invoke Gradle script' marked build as failure

---------------------------------------------------------------------
To unsubscribe, e-mail: builds-unsubscribe@beam.apache.org
For additional commands, e-mail: builds-help@beam.apache.org