You are viewing a plain text version of this content. The canonical link for it is here.
Posted to builds@solr.apache.org by Apache Jenkins Server <je...@builds.apache.org> on 2025/04/01 14:42:55 UTC
[JENKINS] Solr » Solr-Test-9.8 - Build # 448 - Still Unstable!
Build: https://ci-builds.apache.org/job/Solr/job/Solr-Test-9.8/448/
12 tests failed.
FAILED: org.apache.solr.cloud.MissingSegmentRecoveryTest.testLeaderRecovery
Error Message:
java.lang.AssertionError: Expected a collection with one shard and two replicas
Timeout waiting to see state for collection=MissingSegmentRecoveryTest :DocCollection(MissingSegmentRecoveryTest//collections/MissingSegmentRecoveryTest/state.json/8 )={
"pullReplicas":"0",
"configName":"conf",
"replicationFactor":2,
"router":{"name":"compositeId"},
"nrtReplicas":2,
"tlogReplicas":"0",
"shards":{"shard1":{
"range":"80000000-7fffffff",
"state":"active",
"replicas":{
"core_node3":{
"core":"MissingSegmentRecoveryTest_shard1_replica_n1",
"node_name":"127.0.0.1:33869_solr",
"type":"NRT",
"state":"active",
"leader":"true",
"force_set_state":"false",
"base_url":"http://127.0.0.1:33869/solr"},
"core_node4":{
"core":"MissingSegmentRecoveryTest_shard1_replica_n2",
"node_name":"127.0.0.1:46101_solr",
"type":"NRT",
"state":"down",
"force_set_state":"false",
"base_url":"http://127.0.0.1:46101/solr"}}}}}
Live Nodes: [127.0.0.1:33869_solr, 127.0.0.1:46101_solr]
Last available state: DocCollection(MissingSegmentRecoveryTest//collections/MissingSegmentRecoveryTest/state.json/8 )={
"pullReplicas":"0",
"configName":"conf",
"replicationFactor":2,
"router":{"name":"compositeId"},
"nrtReplicas":2,
"tlogReplicas":"0",
"shards":{"shard1":{
"range":"80000000-7fffffff",
"state":"active",
"replicas":{
"core_node3":{
"core":"MissingSegmentRecoveryTest_shard1_replica_n1",
"node_name":"127.0.0.1:33869_solr",
"type":"NRT",
"state":"active",
"leader":"true",
"force_set_state":"false",
"base_url":"http://127.0.0.1:33869/solr"},
"core_node4":{
"core":"MissingSegmentRecoveryTest_shard1_replica_n2",
"node_name":"127.0.0.1:46101_solr",
"type":"NRT",
"state":"down",
"force_set_state":"false",
"base_url":"http://127.0.0.1:46101/solr"}}}}}
Stack Trace:
java.lang.AssertionError: Expected a collection with one shard and two replicas
Timeout waiting to see state for collection=MissingSegmentRecoveryTest :DocCollection(MissingSegmentRecoveryTest//collections/MissingSegmentRecoveryTest/state.json/8 )={
"pullReplicas":"0",
"configName":"conf",
"replicationFactor":2,
"router":{"name":"compositeId"},
"nrtReplicas":2,
"tlogReplicas":"0",
"shards":{"shard1":{
"range":"80000000-7fffffff",
"state":"active",
"replicas":{
"core_node3":{
"core":"MissingSegmentRecoveryTest_shard1_replica_n1",
"node_name":"127.0.0.1:33869_solr",
"type":"NRT",
"state":"active",
"leader":"true",
"force_set_state":"false",
"base_url":"http://127.0.0.1:33869/solr"},
"core_node4":{
"core":"MissingSegmentRecoveryTest_shard1_replica_n2",
"node_name":"127.0.0.1:46101_solr",
"type":"NRT",
"state":"down",
"force_set_state":"false",
"base_url":"http://127.0.0.1:46101/solr"}}}}}
Live Nodes: [127.0.0.1:33869_solr, 127.0.0.1:46101_solr]
Last available state: DocCollection(MissingSegmentRecoveryTest//collections/MissingSegmentRecoveryTest/state.json/8 )={
"pullReplicas":"0",
"configName":"conf",
"replicationFactor":2,
"router":{"name":"compositeId"},
"nrtReplicas":2,
"tlogReplicas":"0",
"shards":{"shard1":{
"range":"80000000-7fffffff",
"state":"active",
"replicas":{
"core_node3":{
"core":"MissingSegmentRecoveryTest_shard1_replica_n1",
"node_name":"127.0.0.1:33869_solr",
"type":"NRT",
"state":"active",
"leader":"true",
"force_set_state":"false",
"base_url":"http://127.0.0.1:33869/solr"},
"core_node4":{
"core":"MissingSegmentRecoveryTest_shard1_replica_n2",
"node_name":"127.0.0.1:46101_solr",
"type":"NRT",
"state":"down",
"force_set_state":"false",
"base_url":"http://127.0.0.1:46101/solr"}}}}}
at __randomizedtesting.SeedInfo.seed([1A7BD75F7A7131DE:4A2E4F5C235087C3]:0)
at org.junit.Assert.fail(Assert.java:89)
at org.apache.solr.cloud.SolrCloudTestCase.waitForState(SolrCloudTestCase.java:171)
at org.apache.solr.cloud.SolrCloudTestCase.waitForState(SolrCloudTestCase.java:137)
at org.apache.solr.cloud.MissingSegmentRecoveryTest.testLeaderRecovery(MissingSegmentRecoveryTest.java:104)
at java.base/jdk.internal.reflect.NativeMethodAccessorImpl.invoke0(Native Method)
at java.base/jdk.internal.reflect.NativeMethodAccessorImpl.invoke(NativeMethodAccessorImpl.java:62)
at java.base/jdk.internal.reflect.DelegatingMethodAccessorImpl.invoke(DelegatingMethodAccessorImpl.java:43)
at java.base/java.lang.reflect.Method.invoke(Method.java:566)
at com.carrotsearch.randomizedtesting.RandomizedRunner.invoke(RandomizedRunner.java:1758)
at com.carrotsearch.randomizedtesting.RandomizedRunner$8.evaluate(RandomizedRunner.java:946)
at com.carrotsearch.randomizedtesting.RandomizedRunner$9.evaluate(RandomizedRunner.java:982)
at com.carrotsearch.randomizedtesting.RandomizedRunner$10.evaluate(RandomizedRunner.java:996)
at com.carrotsearch.randomizedtesting.rules.SystemPropertiesRestoreRule$1.evaluate(SystemPropertiesRestoreRule.java:80)
at org.junit.rules.RunRules.evaluate(RunRules.java:20)
at org.apache.lucene.tests.util.TestRuleSetupTeardownChained$1.evaluate(TestRuleSetupTeardownChained.java:48)
at org.apache.lucene.tests.util.AbstractBeforeAfterRule$1.evaluate(AbstractBeforeAfterRule.java:43)
at org.apache.lucene.tests.util.TestRuleThreadAndTestName$1.evaluate(TestRuleThreadAndTestName.java:45)
at org.apache.lucene.tests.util.TestRuleIgnoreAfterMaxFailures$1.evaluate(TestRuleIgnoreAfterMaxFailures.java:60)
at org.apache.lucene.tests.util.TestRuleMarkFailure$1.evaluate(TestRuleMarkFailure.java:44)
at org.junit.rules.RunRules.evaluate(RunRules.java:20)
at com.carrotsearch.randomizedtesting.rules.StatementAdapter.evaluate(StatementAdapter.java:36)
at com.carrotsearch.randomizedtesting.ThreadLeakControl$StatementRunner.run(ThreadLeakControl.java:390)
at com.carrotsearch.randomizedtesting.ThreadLeakControl.forkTimeoutingTask(ThreadLeakControl.java:843)
at com.carrotsearch.randomizedtesting.ThreadLeakControl$3.evaluate(ThreadLeakControl.java:490)
at com.carrotsearch.randomizedtesting.RandomizedRunner.runSingleTest(RandomizedRunner.java:955)
at com.carrotsearch.randomizedtesting.RandomizedRunner$5.evaluate(RandomizedRunner.java:840)
at com.carrotsearch.randomizedtesting.RandomizedRunner$6.evaluate(RandomizedRunner.java:891)
at com.carrotsearch.randomizedtesting.RandomizedRunner$7.evaluate(RandomizedRunner.java:902)
at com.carrotsearch.randomizedtesting.rules.StatementAdapter.evaluate(StatementAdapter.java:36)
at com.carrotsearch.randomizedtesting.rules.StatementAdapter.evaluate(StatementAdapter.java:36)
at org.apache.lucene.tests.util.AbstractBeforeAfterRule$1.evaluate(AbstractBeforeAfterRule.java:43)
at org.apache.lucene.tests.util.AbstractBeforeAfterRule$1.evaluate(AbstractBeforeAfterRule.java:43)
at com.carrotsearch.randomizedtesting.rules.SystemPropertiesRestoreRule$1.evaluate(SystemPropertiesRestoreRule.java:80)
at org.junit.rules.RunRules.evaluate(RunRules.java:20)
at org.apache.lucene.tests.util.AbstractBeforeAfterRule$1.evaluate(AbstractBeforeAfterRule.java:43)
at com.carrotsearch.randomizedtesting.rules.StatementAdapter.evaluate(StatementAdapter.java:36)
at org.apache.lucene.tests.util.TestRuleStoreClassName$1.evaluate(TestRuleStoreClassName.java:38)
at com.carrotsearch.randomizedtesting.rules.NoShadowingOrOverridesOnMethodsRule$1.evaluate(NoShadowingOrOverridesOnMethodsRule.java:40)
at com.carrotsearch.randomizedtesting.rules.NoShadowingOrOverridesOnMethodsRule$1.evaluate(NoShadowingOrOverridesOnMethodsRule.java:40)
at com.carrotsearch.randomizedtesting.rules.StatementAdapter.evaluate(StatementAdapter.java:36)
at com.carrotsearch.randomizedtesting.rules.StatementAdapter.evaluate(StatementAdapter.java:36)
at org.apache.lucene.tests.util.TestRuleAssertionsRequired$1.evaluate(TestRuleAssertionsRequired.java:53)
at org.apache.lucene.tests.util.AbstractBeforeAfterRule$1.evaluate(AbstractBeforeAfterRule.java:43)
at org.apache.lucene.tests.util.TestRuleMarkFailure$1.evaluate(TestRuleMarkFailure.java:44)
at org.apache.lucene.tests.util.TestRuleIgnoreAfterMaxFailures$1.evaluate(TestRuleIgnoreAfterMaxFailures.java:60)
at org.apache.lucene.tests.util.TestRuleIgnoreTestSuites$1.evaluate(TestRuleIgnoreTestSuites.java:47)
at org.junit.rules.RunRules.evaluate(RunRules.java:20)
at com.carrotsearch.randomizedtesting.rules.StatementAdapter.evaluate(StatementAdapter.java:36)
at com.carrotsearch.randomizedtesting.ThreadLeakControl$StatementRunner.run(ThreadLeakControl.java:390)
at com.carrotsearch.randomizedtesting.ThreadLeakControl.lambda$forkTimeoutingTask$0(ThreadLeakControl.java:850)
at java.base/java.lang.Thread.run(Thread.java:829)
FAILED: org.apache.solr.cloud.ReindexCollectionTest.testSameTargetReindexing
Error Message:
com.carrotsearch.randomizedtesting.UncaughtExceptionError: Captured an uncaught exception in thread: Thread[id=8796, name=zkCallback-5025-thread-3, state=RUNNABLE, group=TGRP-ReindexCollectionTest]
Stack Trace:
com.carrotsearch.randomizedtesting.UncaughtExceptionError: Captured an uncaught exception in thread: Thread[id=8796, name=zkCallback-5025-thread-3, state=RUNNABLE, group=TGRP-ReindexCollectionTest]
at __randomizedtesting.SeedInfo.seed([1A7BD75F7A7131DE:AF023C887D17A99A]:0)
Caused by: org.apache.solr.common.SolrException: Error updating shard term for collection: sameTargetReindexing_true_false
at __randomizedtesting.SeedInfo.seed([1A7BD75F7A7131DE]:0)
at app//org.apache.solr.cloud.ZkShardTerms.refreshTerms(ZkShardTerms.java:377)
at app//org.apache.solr.cloud.ZkShardTerms.lambda$registerWatcher$8(ZkShardTerms.java:430)
at app//org.apache.solr.common.cloud.SolrZkClient$ProcessWatchWithExecutor.lambda$process$1(SolrZkClient.java:1099)
at app//org.apache.solr.common.util.ExecutorUtil$MDCAwareThreadPoolExecutor.lambda$execute$0(ExecutorUtil.java:380)
at java.base@11.0.24/java.util.concurrent.ThreadPoolExecutor.runWorker(ThreadPoolExecutor.java:1128)
at java.base@11.0.24/java.util.concurrent.ThreadPoolExecutor$Worker.run(ThreadPoolExecutor.java:628)
at java.base@11.0.24/java.lang.Thread.run(Thread.java:829)
Caused by: org.apache.zookeeper.KeeperException$NoNodeException: KeeperErrorCode = NoNode for /collections/sameTargetReindexing_true_false/terms/shard2
at app//org.apache.zookeeper.KeeperException.create(KeeperException.java:117)
at app//org.apache.zookeeper.KeeperException.create(KeeperException.java:53)
at app//org.apache.zookeeper.ZooKeeper.getData(ZooKeeper.java:1972)
at app//org.apache.solr.common.cloud.SolrZkClient.lambda$getData$6(SolrZkClient.java:452)
at app//org.apache.solr.common.cloud.ZkCmdExecutor.retryOperation(ZkCmdExecutor.java:70)
at app//org.apache.solr.common.cloud.SolrZkClient.getData(SolrZkClient.java:452)
at app//org.apache.solr.cloud.ZkShardTerms.refreshTerms(ZkShardTerms.java:373)
... 6 more
FAILED: org.apache.solr.cloud.ReindexCollectionTest.testSameTargetReindexing
Error Message:
com.carrotsearch.randomizedtesting.UncaughtExceptionError: Captured an uncaught exception in thread: Thread[id=126, name=zkCallback-33-thread-2, state=RUNNABLE, group=TGRP-ReindexCollectionTest]
Stack Trace:
com.carrotsearch.randomizedtesting.UncaughtExceptionError: Captured an uncaught exception in thread: Thread[id=126, name=zkCallback-33-thread-2, state=RUNNABLE, group=TGRP-ReindexCollectionTest]
at __randomizedtesting.SeedInfo.seed([1A7BD75F7A7131DE:AF023C887D17A99A]:0)
Caused by: org.apache.solr.common.SolrException: Error updating shard term for collection: .rx_sameTargetReindexing_false_false_0
at __randomizedtesting.SeedInfo.seed([1A7BD75F7A7131DE]:0)
at app//org.apache.solr.cloud.ZkShardTerms.refreshTerms(ZkShardTerms.java:377)
at app//org.apache.solr.cloud.ZkShardTerms.lambda$registerWatcher$8(ZkShardTerms.java:430)
at app//org.apache.solr.common.cloud.SolrZkClient$ProcessWatchWithExecutor.lambda$process$1(SolrZkClient.java:1099)
at app//org.apache.solr.common.util.ExecutorUtil$MDCAwareThreadPoolExecutor.lambda$execute$0(ExecutorUtil.java:380)
at java.base@11.0.24/java.util.concurrent.ThreadPoolExecutor.runWorker(ThreadPoolExecutor.java:1128)
at java.base@11.0.24/java.util.concurrent.ThreadPoolExecutor$Worker.run(ThreadPoolExecutor.java:628)
at java.base@11.0.24/java.lang.Thread.run(Thread.java:829)
Caused by: org.apache.zookeeper.KeeperException$NoNodeException: KeeperErrorCode = NoNode for /collections/.rx_sameTargetReindexing_false_false_0/terms/shard1
at app//org.apache.zookeeper.KeeperException.create(KeeperException.java:117)
at app//org.apache.zookeeper.KeeperException.create(KeeperException.java:53)
at app//org.apache.zookeeper.ZooKeeper.getData(ZooKeeper.java:1972)
at app//org.apache.solr.common.cloud.SolrZkClient.lambda$getData$6(SolrZkClient.java:452)
at app//org.apache.solr.common.cloud.ZkCmdExecutor.retryOperation(ZkCmdExecutor.java:70)
at app//org.apache.solr.common.cloud.SolrZkClient.getData(SolrZkClient.java:452)
at app//org.apache.solr.cloud.ZkShardTerms.refreshTerms(ZkShardTerms.java:373)
... 6 more
FAILED: org.apache.solr.cloud.TestPullReplica.testCreateDelete {seed=[1A7BD75F7A7131DE:D8F9C8A8944F2BC3]}
Error Message:
com.carrotsearch.randomizedtesting.UncaughtExceptionError: Captured an uncaught exception in thread: Thread[id=12557, name=zkCallback-7528-thread-1, state=RUNNABLE, group=TGRP-TestPullReplica]
Stack Trace:
com.carrotsearch.randomizedtesting.UncaughtExceptionError: Captured an uncaught exception in thread: Thread[id=12557, name=zkCallback-7528-thread-1, state=RUNNABLE, group=TGRP-TestPullReplica]
at __randomizedtesting.SeedInfo.seed([1A7BD75F7A7131DE:D8F9C8A8944F2BC3]:0)
Caused by: org.apache.solr.common.SolrException: Error updating shard term for collection: pull_replica_test_create_delete
at __randomizedtesting.SeedInfo.seed([1A7BD75F7A7131DE]:0)
at app//org.apache.solr.cloud.ZkShardTerms.refreshTerms(ZkShardTerms.java:377)
at app//org.apache.solr.cloud.ZkShardTerms.lambda$registerWatcher$8(ZkShardTerms.java:430)
at app//org.apache.solr.common.cloud.SolrZkClient$ProcessWatchWithExecutor.lambda$process$1(SolrZkClient.java:1099)
at app//org.apache.solr.common.util.ExecutorUtil$MDCAwareThreadPoolExecutor.lambda$execute$0(ExecutorUtil.java:380)
at java.base@11.0.24/java.util.concurrent.ThreadPoolExecutor.runWorker(ThreadPoolExecutor.java:1128)
at java.base@11.0.24/java.util.concurrent.ThreadPoolExecutor$Worker.run(ThreadPoolExecutor.java:628)
at java.base@11.0.24/java.lang.Thread.run(Thread.java:829)
Caused by: org.apache.zookeeper.KeeperException$NoNodeException: KeeperErrorCode = NoNode for /collections/pull_replica_test_create_delete/terms/shard2
at app//org.apache.zookeeper.KeeperException.create(KeeperException.java:117)
at app//org.apache.zookeeper.KeeperException.create(KeeperException.java:53)
at app//org.apache.zookeeper.ZooKeeper.getData(ZooKeeper.java:1972)
at app//org.apache.solr.common.cloud.SolrZkClient.lambda$getData$6(SolrZkClient.java:452)
at app//org.apache.solr.common.cloud.ZkCmdExecutor.retryOperation(ZkCmdExecutor.java:70)
at app//org.apache.solr.common.cloud.SolrZkClient.getData(SolrZkClient.java:452)
at app//org.apache.solr.cloud.ZkShardTerms.refreshTerms(ZkShardTerms.java:373)
... 6 more
FAILED: org.apache.solr.cloud.TestTlogReplica.testBasicLeaderElection
Error Message:
org.apache.solr.client.solrj.impl.BaseHttpSolrClient$RemoteSolrException: Error from server at https://127.0.0.1:33925/solr: org.apache.solr.common.SolrException
at org.apache.solr.client.solrj.SolrResponse.getException(SolrResponse.java:56)
at org.apache.solr.handler.admin.api.CreateCollection.createCollection(CreateCollection.java:133)
at org.apache.solr.handler.admin.CollectionsHandler$CollectionOperation.lambda$static$0(CollectionsHandler.java:519)
at org.apache.solr.handler.admin.CollectionsHandler$CollectionOperation.execute(CollectionsHandler.java:1264)
at org.apache.solr.handler.admin.CollectionsHandler.invokeAction(CollectionsHandler.java:321)
at org.apache.solr.handler.admin.CollectionsHandler.handleRequestBody(CollectionsHandler.java:299)
at org.apache.solr.handler.RequestHandlerBase.handleRequest(RequestHandlerBase.java:228)
at org.apache.solr.servlet.HttpSolrCall.handleAdmin(HttpSolrCall.java:940)
at org.apache.solr.servlet.HttpSolrCall.handleAdminRequest(HttpSolrCall.java:894)
at org.apache.solr.servlet.HttpSolrCall.call(HttpSolrCall.java:555)
at org.apache.solr.servlet.SolrDispatchFilter.dispatch(SolrDispatchFilter.java:241)
at org.apache.solr.servlet.SolrDispatchFilter.lambda$doFilterRetry$0(SolrDispatchFilter.java:198)
at org.apache.solr.servlet.ServletUtils.traceHttpRequestExecution2(ServletUtils.java:227)
at org.apache.solr.servlet.ServletUtils.rateLimitRequest(ServletUtils.java:197)
at org.apache.solr.servlet.SolrDispatchFilter.doFilterRetry(SolrDispatchFilter.java:192)
at org.apache.solr.servlet.SolrDispatchFilter.doFilter(SolrDispatchFilter.java:181)
at javax.servlet.http.HttpFilter.doFilter(HttpFilter.java:97)
at org.eclipse.jetty.servlet.FilterHolder.doFilter(FilterHolder.java:202)
at org.eclipse.jetty.servlet.ServletHandler$Chain.doFilter(ServletHandler.java:1635)
at org.apache.solr.embedded.JettySolrRunner$DebugFilter.doFilter(JettySolrRunner.java:184)
at org.eclipse.jetty.servlet.FilterHolder.doFilter(FilterHolder.java:202)
at org.eclipse.jetty.servlet.ServletHandler$Chain.doFilter(ServletHandler.java:1635)
at org.eclipse.jetty.servlet.ServletHandler.doHandle(ServletHandler.java:527)
at org.eclipse.jetty.server.handler.ScopedHandler.nextHandle(ScopedHandler.java:221)
at org.eclipse.jetty.server.session.SessionHandler.doHandle(SessionHandler.java:1580)
at org.eclipse.jetty.server.handler.ScopedHandler.nextHandle(ScopedHandler.java:221)
at org.eclipse.jetty.server.handler.ContextHandler.doHandle(ContextHandler.java:1384)
at org.eclipse.jetty.server.handler.ScopedHandler.nextScope(ScopedHandler.java:176)
at org.eclipse.jetty.servlet.ServletHandler.doScope(ServletHandler.java:484)
at org.eclipse.jetty.server.session.SessionHandler.doScope(SessionHandler.java:1553)
at org.eclipse.jetty.server.handler.ScopedHandler.nextScope(ScopedHandler.java:174)
at org.eclipse.jetty.server.handler.ContextHandler.doScope(ContextHandler.java:1306)
at org.eclipse.jetty.server.handler.ScopedHandler.handle(ScopedHandler.java:129)
at org.eclipse.jetty.server.handler.HandlerWrapper.handle(HandlerWrapper.java:122)
at org.eclipse.jetty.rewrite.handler.RewriteHandler.handle(RewriteHandler.java:301)
at org.eclipse.jetty.server.handler.HandlerWrapper.handle(HandlerWrapper.java:122)
at org.eclipse.jetty.server.handler.gzip.GzipHandler.handle(GzipHandler.java:822)
at org.eclipse.jetty.server.handler.HandlerWrapper.handle(HandlerWrapper.java:122)
at org.eclipse.jetty.server.Server.handle(Server.java:563)
at org.eclipse.jetty.server.HttpChannel$RequestDispatchable.dispatch(HttpChannel.java:1598)
at org.eclipse.jetty.server.HttpChannel.dispatch(HttpChannel.java:753)
at org.eclipse.jetty.server.HttpChannel.handle(HttpChannel.java:501)
at org.eclipse.jetty.server.HttpConnection.onFillable(HttpConnection.java:287)
at org.eclipse.jetty.io.AbstractConnection$ReadCallback.succeeded(AbstractConnection.java:314)
at org.eclipse.jetty.io.FillInterest.fillable(FillInterest.java:100)
at org.eclipse.jetty.io.ssl.SslConnection$DecryptedEndPoint.onFillable(SslConnection.java:558)
at org.eclipse.jetty.io.ssl.SslConnection.onFillable(SslConnection.java:379)
at org.eclipse.jetty.io.ssl.SslConnection$2.succeeded(SslConnection.java:146)
at org.eclipse.jetty.io.FillInterest.fillable(FillInterest.java:100)
at org.eclipse.jetty.io.SelectableChannelEndPoint$1.run(SelectableChannelEndPoint.java:53)
at org.eclipse.jetty.util.thread.QueuedThreadPool.runJob(QueuedThreadPool.java:969)
at org.eclipse.jetty.util.thread.QueuedThreadPool$Runner.doRunJob(QueuedThreadPool.java:1194)
at org.eclipse.jetty.util.thread.QueuedThreadPool$Runner.run(QueuedThreadPool.java:1149)
at java.base/java.lang.Thread.run(Thread.java:829)
Stack Trace:
org.apache.solr.client.solrj.impl.BaseHttpSolrClient$RemoteSolrException: Error from server at https://127.0.0.1:33925/solr: org.apache.solr.common.SolrException
at org.apache.solr.client.solrj.SolrResponse.getException(SolrResponse.java:56)
at org.apache.solr.handler.admin.api.CreateCollection.createCollection(CreateCollection.java:133)
at org.apache.solr.handler.admin.CollectionsHandler$CollectionOperation.lambda$static$0(CollectionsHandler.java:519)
at org.apache.solr.handler.admin.CollectionsHandler$CollectionOperation.execute(CollectionsHandler.java:1264)
at org.apache.solr.handler.admin.CollectionsHandler.invokeAction(CollectionsHandler.java:321)
at org.apache.solr.handler.admin.CollectionsHandler.handleRequestBody(CollectionsHandler.java:299)
at org.apache.solr.handler.RequestHandlerBase.handleRequest(RequestHandlerBase.java:228)
at org.apache.solr.servlet.HttpSolrCall.handleAdmin(HttpSolrCall.java:940)
at org.apache.solr.servlet.HttpSolrCall.handleAdminRequest(HttpSolrCall.java:894)
at org.apache.solr.servlet.HttpSolrCall.call(HttpSolrCall.java:555)
at org.apache.solr.servlet.SolrDispatchFilter.dispatch(SolrDispatchFilter.java:241)
at org.apache.solr.servlet.SolrDispatchFilter.lambda$doFilterRetry$0(SolrDispatchFilter.java:198)
at org.apache.solr.servlet.ServletUtils.traceHttpRequestExecution2(ServletUtils.java:227)
at org.apache.solr.servlet.ServletUtils.rateLimitRequest(ServletUtils.java:197)
at org.apache.solr.servlet.SolrDispatchFilter.doFilterRetry(SolrDispatchFilter.java:192)
at org.apache.solr.servlet.SolrDispatchFilter.doFilter(SolrDispatchFilter.java:181)
at javax.servlet.http.HttpFilter.doFilter(HttpFilter.java:97)
at org.eclipse.jetty.servlet.FilterHolder.doFilter(FilterHolder.java:202)
at org.eclipse.jetty.servlet.ServletHandler$Chain.doFilter(ServletHandler.java:1635)
at org.apache.solr.embedded.JettySolrRunner$DebugFilter.doFilter(JettySolrRunner.java:184)
at org.eclipse.jetty.servlet.FilterHolder.doFilter(FilterHolder.java:202)
at org.eclipse.jetty.servlet.ServletHandler$Chain.doFilter(ServletHandler.java:1635)
at org.eclipse.jetty.servlet.ServletHandler.doHandle(ServletHandler.java:527)
at org.eclipse.jetty.server.handler.ScopedHandler.nextHandle(ScopedHandler.java:221)
at org.eclipse.jetty.server.session.SessionHandler.doHandle(SessionHandler.java:1580)
at org.eclipse.jetty.server.handler.ScopedHandler.nextHandle(ScopedHandler.java:221)
at org.eclipse.jetty.server.handler.ContextHandler.doHandle(ContextHandler.java:1384)
at org.eclipse.jetty.server.handler.ScopedHandler.nextScope(ScopedHandler.java:176)
at org.eclipse.jetty.servlet.ServletHandler.doScope(ServletHandler.java:484)
at org.eclipse.jetty.server.session.SessionHandler.doScope(SessionHandler.java:1553)
at org.eclipse.jetty.server.handler.ScopedHandler.nextScope(ScopedHandler.java:174)
at org.eclipse.jetty.server.handler.ContextHandler.doScope(ContextHandler.java:1306)
at org.eclipse.jetty.server.handler.ScopedHandler.handle(ScopedHandler.java:129)
at org.eclipse.jetty.server.handler.HandlerWrapper.handle(HandlerWrapper.java:122)
at org.eclipse.jetty.rewrite.handler.RewriteHandler.handle(RewriteHandler.java:301)
at org.eclipse.jetty.server.handler.HandlerWrapper.handle(HandlerWrapper.java:122)
at org.eclipse.jetty.server.handler.gzip.GzipHandler.handle(GzipHandler.java:822)
at org.eclipse.jetty.server.handler.HandlerWrapper.handle(HandlerWrapper.java:122)
at org.eclipse.jetty.server.Server.handle(Server.java:563)
at org.eclipse.jetty.server.HttpChannel$RequestDispatchable.dispatch(HttpChannel.java:1598)
at org.eclipse.jetty.server.HttpChannel.dispatch(HttpChannel.java:753)
at org.eclipse.jetty.server.HttpChannel.handle(HttpChannel.java:501)
at org.eclipse.jetty.server.HttpConnection.onFillable(HttpConnection.java:287)
at org.eclipse.jetty.io.AbstractConnection$ReadCallback.succeeded(AbstractConnection.java:314)
at org.eclipse.jetty.io.FillInterest.fillable(FillInterest.java:100)
at org.eclipse.jetty.io.ssl.SslConnection$DecryptedEndPoint.onFillable(SslConnection.java:558)
at org.eclipse.jetty.io.ssl.SslConnection.onFillable(SslConnection.java:379)
at org.eclipse.jetty.io.ssl.SslConnection$2.succeeded(SslConnection.java:146)
at org.eclipse.jetty.io.FillInterest.fillable(FillInterest.java:100)
at org.eclipse.jetty.io.SelectableChannelEndPoint$1.run(SelectableChannelEndPoint.java:53)
at org.eclipse.jetty.util.thread.QueuedThreadPool.runJob(QueuedThreadPool.java:969)
at org.eclipse.jetty.util.thread.QueuedThreadPool$Runner.doRunJob(QueuedThreadPool.java:1194)
at org.eclipse.jetty.util.thread.QueuedThreadPool$Runner.run(QueuedThreadPool.java:1149)
at java.base/java.lang.Thread.run(Thread.java:829)
at __randomizedtesting.SeedInfo.seed([1A7BD75F7A7131DE:8CF3111792EB7624]:0)
at app//org.apache.solr.client.solrj.impl.HttpSolrClient.executeMethod(HttpSolrClient.java:729)
at app//org.apache.solr.client.solrj.impl.HttpSolrClient.request(HttpSolrClient.java:264)
at app//org.apache.solr.client.solrj.impl.HttpSolrClient.request(HttpSolrClient.java:243)
at app//org.apache.solr.client.solrj.impl.LBSolrClient.doRequest(LBSolrClient.java:576)
at app//org.apache.solr.client.solrj.impl.LBSolrClient.doRequest(LBSolrClient.java:513)
at app//org.apache.solr.client.solrj.impl.LBSolrClient.request(LBSolrClient.java:477)
at app//org.apache.solr.client.solrj.impl.CloudSolrClient.sendRequest(CloudSolrClient.java:1200)
at app//org.apache.solr.client.solrj.impl.CloudSolrClient.requestWithRetryOnStaleState(CloudSolrClient.java:898)
at app//org.apache.solr.client.solrj.impl.CloudSolrClient.request(CloudSolrClient.java:826)
at app//org.apache.solr.client.solrj.SolrRequest.process(SolrRequest.java:279)
at app//org.apache.solr.client.solrj.SolrRequest.process(SolrRequest.java:295)
at app//org.apache.solr.cloud.TestTlogReplica.createAndWaitForCollection(TestTlogReplica.java:962)
at app//org.apache.solr.cloud.TestTlogReplica.testBasicLeaderElection(TestTlogReplica.java:763)
at java.base@11.0.24/jdk.internal.reflect.NativeMethodAccessorImpl.invoke0(Native Method)
at java.base@11.0.24/jdk.internal.reflect.NativeMethodAccessorImpl.invoke(NativeMethodAccessorImpl.java:62)
at java.base@11.0.24/jdk.internal.reflect.DelegatingMethodAccessorImpl.invoke(DelegatingMethodAccessorImpl.java:43)
at java.base@11.0.24/java.lang.reflect.Method.invoke(Method.java:566)
at app//com.carrotsearch.randomizedtesting.RandomizedRunner.invoke(RandomizedRunner.java:1758)
at app//com.carrotsearch.randomizedtesting.RandomizedRunner$8.evaluate(RandomizedRunner.java:946)
at app//com.carrotsearch.randomizedtesting.RandomizedRunner$9.evaluate(RandomizedRunner.java:982)
at app//com.carrotsearch.randomizedtesting.RandomizedRunner$10.evaluate(RandomizedRunner.java:996)
at app//com.carrotsearch.randomizedtesting.rules.SystemPropertiesRestoreRule$1.evaluate(SystemPropertiesRestoreRule.java:80)
at app//org.junit.rules.RunRules.evaluate(RunRules.java:20)
at app//org.apache.lucene.tests.util.TestRuleSetupTeardownChained$1.evaluate(TestRuleSetupTeardownChained.java:48)
at app//org.apache.lucene.tests.util.AbstractBeforeAfterRule$1.evaluate(AbstractBeforeAfterRule.java:43)
at app//org.apache.lucene.tests.util.TestRuleThreadAndTestName$1.evaluate(TestRuleThreadAndTestName.java:45)
at app//org.apache.lucene.tests.util.TestRuleIgnoreAfterMaxFailures$1.evaluate(TestRuleIgnoreAfterMaxFailures.java:60)
at app//org.apache.lucene.tests.util.TestRuleMarkFailure$1.evaluate(TestRuleMarkFailure.java:44)
at app//org.junit.rules.RunRules.evaluate(RunRules.java:20)
at app//com.carrotsearch.randomizedtesting.rules.StatementAdapter.evaluate(StatementAdapter.java:36)
at app//com.carrotsearch.randomizedtesting.ThreadLeakControl$StatementRunner.run(ThreadLeakControl.java:390)
at app//com.carrotsearch.randomizedtesting.ThreadLeakControl.forkTimeoutingTask(ThreadLeakControl.java:843)
at app//com.carrotsearch.randomizedtesting.ThreadLeakControl$3.evaluate(ThreadLeakControl.java:490)
at app//com.carrotsearch.randomizedtesting.RandomizedRunner.runSingleTest(RandomizedRunner.java:955)
at app//com.carrotsearch.randomizedtesting.RandomizedRunner$5.evaluate(RandomizedRunner.java:840)
at app//com.carrotsearch.randomizedtesting.RandomizedRunner$6.evaluate(RandomizedRunner.java:891)
at app//com.carrotsearch.randomizedtesting.RandomizedRunner$7.evaluate(RandomizedRunner.java:902)
at app//com.carrotsearch.randomizedtesting.rules.StatementAdapter.evaluate(StatementAdapter.java:36)
at app//com.carrotsearch.randomizedtesting.rules.StatementAdapter.evaluate(StatementAdapter.java:36)
at app//org.apache.lucene.tests.util.AbstractBeforeAfterRule$1.evaluate(AbstractBeforeAfterRule.java:43)
at app//org.apache.lucene.tests.util.AbstractBeforeAfterRule$1.evaluate(AbstractBeforeAfterRule.java:43)
at app//com.carrotsearch.randomizedtesting.rules.SystemPropertiesRestoreRule$1.evaluate(SystemPropertiesRestoreRule.java:80)
at app//org.junit.rules.RunRules.evaluate(RunRules.java:20)
at app//org.apache.lucene.tests.util.AbstractBeforeAfterRule$1.evaluate(AbstractBeforeAfterRule.java:43)
at app//com.carrotsearch.randomizedtesting.rules.StatementAdapter.evaluate(StatementAdapter.java:36)
at app//org.apache.lucene.tests.util.TestRuleStoreClassName$1.evaluate(TestRuleStoreClassName.java:38)
at app//com.carrotsearch.randomizedtesting.rules.NoShadowingOrOverridesOnMethodsRule$1.evaluate(NoShadowingOrOverridesOnMethodsRule.java:40)
at app//com.carrotsearch.randomizedtesting.rules.NoShadowingOrOverridesOnMethodsRule$1.evaluate(NoShadowingOrOverridesOnMethodsRule.java:40)
at app//com.carrotsearch.randomizedtesting.rules.StatementAdapter.evaluate(StatementAdapter.java:36)
at app//com.carrotsearch.randomizedtesting.rules.StatementAdapter.evaluate(StatementAdapter.java:36)
at app//org.apache.lucene.tests.util.TestRuleAssertionsRequired$1.evaluate(TestRuleAssertionsRequired.java:53)
at app//org.apache.lucene.tests.util.AbstractBeforeAfterRule$1.evaluate(AbstractBeforeAfterRule.java:43)
at app//org.apache.lucene.tests.util.TestRuleMarkFailure$1.evaluate(TestRuleMarkFailure.java:44)
at app//org.apache.lucene.tests.util.TestRuleIgnoreAfterMaxFailures$1.evaluate(TestRuleIgnoreAfterMaxFailures.java:60)
at app//org.apache.lucene.tests.util.TestRuleIgnoreTestSuites$1.evaluate(TestRuleIgnoreTestSuites.java:47)
at app//org.junit.rules.RunRules.evaluate(RunRules.java:20)
at app//com.carrotsearch.randomizedtesting.rules.StatementAdapter.evaluate(StatementAdapter.java:36)
at app//com.carrotsearch.randomizedtesting.ThreadLeakControl$StatementRunner.run(ThreadLeakControl.java:390)
at app//com.carrotsearch.randomizedtesting.ThreadLeakControl.lambda$forkTimeoutingTask$0(ThreadLeakControl.java:850)
at java.base@11.0.24/java.lang.Thread.run(Thread.java:829)
FAILED: org.apache.solr.cloud.api.collections.CollectionReloadTest.testCreateReloadDeleteAllNrt {seed=[1A7BD75F7A7131DE:5F6B23F680BDB45]}
Error Message:
com.carrotsearch.randomizedtesting.UncaughtExceptionError: Captured an uncaught exception in thread: Thread[id=12619, name=zkCallback-6959-thread-2, state=RUNNABLE, group=TGRP-CollectionReloadTest]
Stack Trace:
com.carrotsearch.randomizedtesting.UncaughtExceptionError: Captured an uncaught exception in thread: Thread[id=12619, name=zkCallback-6959-thread-2, state=RUNNABLE, group=TGRP-CollectionReloadTest]
at __randomizedtesting.SeedInfo.seed([1A7BD75F7A7131DE:5F6B23F680BDB45]:0)
Caused by: org.apache.solr.common.SolrException: Error updating shard term for collection: testCreateReloadDeleteAllTlog
at __randomizedtesting.SeedInfo.seed([1A7BD75F7A7131DE]:0)
at app//org.apache.solr.cloud.ZkShardTerms.refreshTerms(ZkShardTerms.java:377)
at app//org.apache.solr.cloud.ZkShardTerms.lambda$registerWatcher$8(ZkShardTerms.java:430)
at app//org.apache.solr.common.cloud.SolrZkClient$ProcessWatchWithExecutor.lambda$process$1(SolrZkClient.java:1099)
at app//org.apache.solr.common.util.ExecutorUtil$MDCAwareThreadPoolExecutor.lambda$execute$0(ExecutorUtil.java:380)
at java.base@11.0.24/java.util.concurrent.ThreadPoolExecutor.runWorker(ThreadPoolExecutor.java:1128)
at java.base@11.0.24/java.util.concurrent.ThreadPoolExecutor$Worker.run(ThreadPoolExecutor.java:628)
at java.base@11.0.24/java.lang.Thread.run(Thread.java:829)
Caused by: org.apache.zookeeper.KeeperException$NoNodeException: KeeperErrorCode = NoNode for /collections/testCreateReloadDeleteAllTlog/terms/shard2
at app//org.apache.zookeeper.KeeperException.create(KeeperException.java:117)
at app//org.apache.zookeeper.KeeperException.create(KeeperException.java:53)
at app//org.apache.zookeeper.ZooKeeper.getData(ZooKeeper.java:1972)
at app//org.apache.solr.common.cloud.SolrZkClient.lambda$getData$6(SolrZkClient.java:452)
at app//org.apache.solr.common.cloud.ZkCmdExecutor.retryOperation(ZkCmdExecutor.java:70)
at app//org.apache.solr.common.cloud.SolrZkClient.getData(SolrZkClient.java:452)
at app//org.apache.solr.cloud.ZkShardTerms.refreshTerms(ZkShardTerms.java:373)
... 6 more
FAILED: org.apache.solr.cloud.api.collections.TestCollectionsAPIViaSolrCloudCluster.testCollectionCreateSearchDelete
Error Message:
com.carrotsearch.randomizedtesting.UncaughtExceptionError: Captured an uncaught exception in thread: Thread[id=12670, name=zkCallback-7634-thread-2, state=RUNNABLE, group=TGRP-TestCollectionsAPIViaSolrCloudCluster]
Stack Trace:
com.carrotsearch.randomizedtesting.UncaughtExceptionError: Captured an uncaught exception in thread: Thread[id=12670, name=zkCallback-7634-thread-2, state=RUNNABLE, group=TGRP-TestCollectionsAPIViaSolrCloudCluster]
at __randomizedtesting.SeedInfo.seed([1A7BD75F7A7131DE:B98179FAFD99DB7B]:0)
Caused by: org.apache.solr.common.SolrException: Error updating shard term for collection: testcollection
at __randomizedtesting.SeedInfo.seed([1A7BD75F7A7131DE]:0)
at app//org.apache.solr.cloud.ZkShardTerms.refreshTerms(ZkShardTerms.java:377)
at app//org.apache.solr.cloud.ZkShardTerms.lambda$registerWatcher$8(ZkShardTerms.java:430)
at app//org.apache.solr.common.cloud.SolrZkClient$ProcessWatchWithExecutor.lambda$process$1(SolrZkClient.java:1099)
at app//org.apache.solr.common.util.ExecutorUtil$MDCAwareThreadPoolExecutor.lambda$execute$0(ExecutorUtil.java:380)
at java.base@11.0.24/java.util.concurrent.ThreadPoolExecutor.runWorker(ThreadPoolExecutor.java:1128)
at java.base@11.0.24/java.util.concurrent.ThreadPoolExecutor$Worker.run(ThreadPoolExecutor.java:628)
at java.base@11.0.24/java.lang.Thread.run(Thread.java:829)
Caused by: org.apache.zookeeper.KeeperException$NoNodeException: KeeperErrorCode = NoNode for /collections/testcollection/terms/shard1
at app//org.apache.zookeeper.KeeperException.create(KeeperException.java:117)
at app//org.apache.zookeeper.KeeperException.create(KeeperException.java:53)
at app//org.apache.zookeeper.ZooKeeper.getData(ZooKeeper.java:1972)
at app//org.apache.solr.common.cloud.SolrZkClient.lambda$getData$6(SolrZkClient.java:452)
at app//org.apache.solr.common.cloud.ZkCmdExecutor.retryOperation(ZkCmdExecutor.java:70)
at app//org.apache.solr.common.cloud.SolrZkClient.getData(SolrZkClient.java:452)
at app//org.apache.solr.cloud.ZkShardTerms.refreshTerms(ZkShardTerms.java:373)
... 6 more
FAILED: org.apache.solr.client.solrj.io.stream.JDBCStreamTest.testJDBCSolrInnerJoinRollupExpression
Error Message:
org.apache.solr.common.SolrException: Collection not found: jdbc
Stack Trace:
org.apache.solr.common.SolrException: Collection not found: jdbc
at __randomizedtesting.SeedInfo.seed([1A7BD75F7A7131DE:8209FF504335803B]:0)
at app//org.apache.solr.client.solrj.impl.CloudSolrClient.requestWithRetryOnStaleState(CloudSolrClient.java:864)
at app//org.apache.solr.client.solrj.impl.CloudSolrClient.request(CloudSolrClient.java:826)
at app//org.apache.solr.client.solrj.SolrRequest.process(SolrRequest.java:279)
at app//org.apache.solr.client.solrj.request.UpdateRequest.commit(UpdateRequest.java:228)
at app//org.apache.solr.client.solrj.io.stream.JDBCStreamTest.cleanIndex(JDBCStreamTest.java:130)
at java.base@11.0.24/jdk.internal.reflect.NativeMethodAccessorImpl.invoke0(Native Method)
at java.base@11.0.24/jdk.internal.reflect.NativeMethodAccessorImpl.invoke(NativeMethodAccessorImpl.java:62)
at java.base@11.0.24/jdk.internal.reflect.DelegatingMethodAccessorImpl.invoke(DelegatingMethodAccessorImpl.java:43)
at java.base@11.0.24/java.lang.reflect.Method.invoke(Method.java:566)
at app//com.carrotsearch.randomizedtesting.RandomizedRunner.invoke(RandomizedRunner.java:1758)
at app//com.carrotsearch.randomizedtesting.RandomizedRunner$9.evaluate(RandomizedRunner.java:980)
at app//com.carrotsearch.randomizedtesting.RandomizedRunner$10.evaluate(RandomizedRunner.java:996)
at app//com.carrotsearch.randomizedtesting.rules.SystemPropertiesRestoreRule$1.evaluate(SystemPropertiesRestoreRule.java:80)
at app//org.junit.rules.RunRules.evaluate(RunRules.java:20)
at app//org.apache.lucene.tests.util.TestRuleSetupTeardownChained$1.evaluate(TestRuleSetupTeardownChained.java:48)
at app//org.apache.lucene.tests.util.AbstractBeforeAfterRule$1.evaluate(AbstractBeforeAfterRule.java:43)
at app//org.apache.lucene.tests.util.TestRuleThreadAndTestName$1.evaluate(TestRuleThreadAndTestName.java:45)
at app//org.apache.lucene.tests.util.TestRuleIgnoreAfterMaxFailures$1.evaluate(TestRuleIgnoreAfterMaxFailures.java:60)
at app//org.apache.lucene.tests.util.TestRuleMarkFailure$1.evaluate(TestRuleMarkFailure.java:44)
at app//org.junit.rules.RunRules.evaluate(RunRules.java:20)
at app//com.carrotsearch.randomizedtesting.rules.StatementAdapter.evaluate(StatementAdapter.java:36)
at app//com.carrotsearch.randomizedtesting.ThreadLeakControl$StatementRunner.run(ThreadLeakControl.java:390)
at app//com.carrotsearch.randomizedtesting.ThreadLeakControl.forkTimeoutingTask(ThreadLeakControl.java:843)
at app//com.carrotsearch.randomizedtesting.ThreadLeakControl$3.evaluate(ThreadLeakControl.java:490)
at app//com.carrotsearch.randomizedtesting.RandomizedRunner.runSingleTest(RandomizedRunner.java:955)
at app//com.carrotsearch.randomizedtesting.RandomizedRunner$5.evaluate(RandomizedRunner.java:840)
at app//com.carrotsearch.randomizedtesting.RandomizedRunner$6.evaluate(RandomizedRunner.java:891)
at app//com.carrotsearch.randomizedtesting.RandomizedRunner$7.evaluate(RandomizedRunner.java:902)
at app//com.carrotsearch.randomizedtesting.rules.StatementAdapter.evaluate(StatementAdapter.java:36)
at app//com.carrotsearch.randomizedtesting.rules.StatementAdapter.evaluate(StatementAdapter.java:36)
at app//org.apache.lucene.tests.util.AbstractBeforeAfterRule$1.evaluate(AbstractBeforeAfterRule.java:43)
at app//org.apache.lucene.tests.util.AbstractBeforeAfterRule$1.evaluate(AbstractBeforeAfterRule.java:43)
at app//com.carrotsearch.randomizedtesting.rules.SystemPropertiesRestoreRule$1.evaluate(SystemPropertiesRestoreRule.java:80)
at app//org.junit.rules.RunRules.evaluate(RunRules.java:20)
at app//org.apache.lucene.tests.util.AbstractBeforeAfterRule$1.evaluate(AbstractBeforeAfterRule.java:43)
at app//com.carrotsearch.randomizedtesting.rules.StatementAdapter.evaluate(StatementAdapter.java:36)
at app//org.apache.lucene.tests.util.TestRuleStoreClassName$1.evaluate(TestRuleStoreClassName.java:38)
at app//com.carrotsearch.randomizedtesting.rules.NoShadowingOrOverridesOnMethodsRule$1.evaluate(NoShadowingOrOverridesOnMethodsRule.java:40)
at app//com.carrotsearch.randomizedtesting.rules.NoShadowingOrOverridesOnMethodsRule$1.evaluate(NoShadowingOrOverridesOnMethodsRule.java:40)
at app//com.carrotsearch.randomizedtesting.rules.StatementAdapter.evaluate(StatementAdapter.java:36)
at app//com.carrotsearch.randomizedtesting.rules.StatementAdapter.evaluate(StatementAdapter.java:36)
at app//org.apache.lucene.tests.util.TestRuleAssertionsRequired$1.evaluate(TestRuleAssertionsRequired.java:53)
at app//org.apache.lucene.tests.util.AbstractBeforeAfterRule$1.evaluate(AbstractBeforeAfterRule.java:43)
at app//org.apache.lucene.tests.util.TestRuleMarkFailure$1.evaluate(TestRuleMarkFailure.java:44)
at app//org.apache.lucene.tests.util.TestRuleIgnoreAfterMaxFailures$1.evaluate(TestRuleIgnoreAfterMaxFailures.java:60)
at app//org.apache.lucene.tests.util.TestRuleIgnoreTestSuites$1.evaluate(TestRuleIgnoreTestSuites.java:47)
at app//org.junit.rules.RunRules.evaluate(RunRules.java:20)
at app//com.carrotsearch.randomizedtesting.rules.StatementAdapter.evaluate(StatementAdapter.java:36)
at app//com.carrotsearch.randomizedtesting.ThreadLeakControl$StatementRunner.run(ThreadLeakControl.java:390)
at app//com.carrotsearch.randomizedtesting.ThreadLeakControl.lambda$forkTimeoutingTask$0(ThreadLeakControl.java:850)
at java.base@11.0.24/java.lang.Thread.run(Thread.java:829)
FAILED: org.apache.solr.client.solrj.io.stream.JDBCStreamTest.testJDBCSelect
Error Message:
org.apache.solr.common.SolrException: Collection not found: jdbc
Stack Trace:
org.apache.solr.common.SolrException: Collection not found: jdbc
at __randomizedtesting.SeedInfo.seed([1A7BD75F7A7131DE:855B6505395704]:0)
at app//org.apache.solr.client.solrj.impl.CloudSolrClient.requestWithRetryOnStaleState(CloudSolrClient.java:864)
at app//org.apache.solr.client.solrj.impl.CloudSolrClient.request(CloudSolrClient.java:826)
at app//org.apache.solr.client.solrj.SolrRequest.process(SolrRequest.java:279)
at app//org.apache.solr.client.solrj.request.UpdateRequest.commit(UpdateRequest.java:228)
at app//org.apache.solr.client.solrj.io.stream.JDBCStreamTest.cleanIndex(JDBCStreamTest.java:130)
at java.base@11.0.24/jdk.internal.reflect.NativeMethodAccessorImpl.invoke0(Native Method)
at java.base@11.0.24/jdk.internal.reflect.NativeMethodAccessorImpl.invoke(NativeMethodAccessorImpl.java:62)
at java.base@11.0.24/jdk.internal.reflect.DelegatingMethodAccessorImpl.invoke(DelegatingMethodAccessorImpl.java:43)
at java.base@11.0.24/java.lang.reflect.Method.invoke(Method.java:566)
at app//com.carrotsearch.randomizedtesting.RandomizedRunner.invoke(RandomizedRunner.java:1758)
at app//com.carrotsearch.randomizedtesting.RandomizedRunner$9.evaluate(RandomizedRunner.java:980)
at app//com.carrotsearch.randomizedtesting.RandomizedRunner$10.evaluate(RandomizedRunner.java:996)
at app//com.carrotsearch.randomizedtesting.rules.SystemPropertiesRestoreRule$1.evaluate(SystemPropertiesRestoreRule.java:80)
at app//org.junit.rules.RunRules.evaluate(RunRules.java:20)
at app//org.apache.lucene.tests.util.TestRuleSetupTeardownChained$1.evaluate(TestRuleSetupTeardownChained.java:48)
at app//org.apache.lucene.tests.util.AbstractBeforeAfterRule$1.evaluate(AbstractBeforeAfterRule.java:43)
at app//org.apache.lucene.tests.util.TestRuleThreadAndTestName$1.evaluate(TestRuleThreadAndTestName.java:45)
at app//org.apache.lucene.tests.util.TestRuleIgnoreAfterMaxFailures$1.evaluate(TestRuleIgnoreAfterMaxFailures.java:60)
at app//org.apache.lucene.tests.util.TestRuleMarkFailure$1.evaluate(TestRuleMarkFailure.java:44)
at app//org.junit.rules.RunRules.evaluate(RunRules.java:20)
at app//com.carrotsearch.randomizedtesting.rules.StatementAdapter.evaluate(StatementAdapter.java:36)
at app//com.carrotsearch.randomizedtesting.ThreadLeakControl$StatementRunner.run(ThreadLeakControl.java:390)
at app//com.carrotsearch.randomizedtesting.ThreadLeakControl.forkTimeoutingTask(ThreadLeakControl.java:843)
at app//com.carrotsearch.randomizedtesting.ThreadLeakControl$3.evaluate(ThreadLeakControl.java:490)
at app//com.carrotsearch.randomizedtesting.RandomizedRunner.runSingleTest(RandomizedRunner.java:955)
at app//com.carrotsearch.randomizedtesting.RandomizedRunner$5.evaluate(RandomizedRunner.java:840)
at app//com.carrotsearch.randomizedtesting.RandomizedRunner$6.evaluate(RandomizedRunner.java:891)
at app//com.carrotsearch.randomizedtesting.RandomizedRunner$7.evaluate(RandomizedRunner.java:902)
at app//com.carrotsearch.randomizedtesting.rules.StatementAdapter.evaluate(StatementAdapter.java:36)
at app//com.carrotsearch.randomizedtesting.rules.StatementAdapter.evaluate(StatementAdapter.java:36)
at app//org.apache.lucene.tests.util.AbstractBeforeAfterRule$1.evaluate(AbstractBeforeAfterRule.java:43)
at app//org.apache.lucene.tests.util.AbstractBeforeAfterRule$1.evaluate(AbstractBeforeAfterRule.java:43)
at app//com.carrotsearch.randomizedtesting.rules.SystemPropertiesRestoreRule$1.evaluate(SystemPropertiesRestoreRule.java:80)
at app//org.junit.rules.RunRules.evaluate(RunRules.java:20)
at app//org.apache.lucene.tests.util.AbstractBeforeAfterRule$1.evaluate(AbstractBeforeAfterRule.java:43)
at app//com.carrotsearch.randomizedtesting.rules.StatementAdapter.evaluate(StatementAdapter.java:36)
at app//org.apache.lucene.tests.util.TestRuleStoreClassName$1.evaluate(TestRuleStoreClassName.java:38)
at app//com.carrotsearch.randomizedtesting.rules.NoShadowingOrOverridesOnMethodsRule$1.evaluate(NoShadowingOrOverridesOnMethodsRule.java:40)
at app//com.carrotsearch.randomizedtesting.rules.NoShadowingOrOverridesOnMethodsRule$1.evaluate(NoShadowingOrOverridesOnMethodsRule.java:40)
at app//com.carrotsearch.randomizedtesting.rules.StatementAdapter.evaluate(StatementAdapter.java:36)
at app//com.carrotsearch.randomizedtesting.rules.StatementAdapter.evaluate(StatementAdapter.java:36)
at app//org.apache.lucene.tests.util.TestRuleAssertionsRequired$1.evaluate(TestRuleAssertionsRequired.java:53)
at app//org.apache.lucene.tests.util.AbstractBeforeAfterRule$1.evaluate(AbstractBeforeAfterRule.java:43)
at app//org.apache.lucene.tests.util.TestRuleMarkFailure$1.evaluate(TestRuleMarkFailure.java:44)
at app//org.apache.lucene.tests.util.TestRuleIgnoreAfterMaxFailures$1.evaluate(TestRuleIgnoreAfterMaxFailures.java:60)
at app//org.apache.lucene.tests.util.TestRuleIgnoreTestSuites$1.evaluate(TestRuleIgnoreTestSuites.java:47)
at app//org.junit.rules.RunRules.evaluate(RunRules.java:20)
at app//com.carrotsearch.randomizedtesting.rules.StatementAdapter.evaluate(StatementAdapter.java:36)
at app//com.carrotsearch.randomizedtesting.ThreadLeakControl$StatementRunner.run(ThreadLeakControl.java:390)
at app//com.carrotsearch.randomizedtesting.ThreadLeakControl.lambda$forkTimeoutingTask$0(ThreadLeakControl.java:850)
at java.base@11.0.24/java.lang.Thread.run(Thread.java:829)
FAILED: org.apache.solr.client.solrj.io.stream.JDBCStreamTest.classMethod
Error Message:
com.carrotsearch.randomizedtesting.ThreadLeakError: 1 thread leaked from SUITE scope at org.apache.solr.client.solrj.io.stream.JDBCStreamTest:
1) Thread[id=33, name=NIOWorkerThread-3, state=RUNNABLE, group=TGRP-JDBCStreamTest]
at java.base@11.0.24/jdk.internal.misc.Unsafe.unpark(Native Method)
at java.base@11.0.24/java.util.concurrent.locks.LockSupport.unpark(LockSupport.java:160)
at java.base@11.0.24/java.util.concurrent.locks.AbstractQueuedSynchronizer.unparkSuccessor(AbstractQueuedSynchronizer.java:709)
at java.base@11.0.24/java.util.concurrent.locks.AbstractQueuedSynchronizer.release(AbstractQueuedSynchronizer.java:1305)
at java.base@11.0.24/java.util.concurrent.locks.ReentrantLock.unlock(ReentrantLock.java:439)
at java.base@11.0.24/java.util.concurrent.ThreadPoolExecutor.tryTerminate(ThreadPoolExecutor.java:726)
at java.base@11.0.24/java.util.concurrent.ThreadPoolExecutor.processWorkerExit(ThreadPoolExecutor.java:994)
at java.base@11.0.24/java.util.concurrent.ThreadPoolExecutor.runWorker(ThreadPoolExecutor.java:1142)
at java.base@11.0.24/java.util.concurrent.ThreadPoolExecutor$Worker.run(ThreadPoolExecutor.java:628)
at java.base@11.0.24/java.lang.Thread.run(Thread.java:829)
Stack Trace:
com.carrotsearch.randomizedtesting.ThreadLeakError: 1 thread leaked from SUITE scope at org.apache.solr.client.solrj.io.stream.JDBCStreamTest:
1) Thread[id=33, name=NIOWorkerThread-3, state=RUNNABLE, group=TGRP-JDBCStreamTest]
at java.base@11.0.24/jdk.internal.misc.Unsafe.unpark(Native Method)
at java.base@11.0.24/java.util.concurrent.locks.LockSupport.unpark(LockSupport.java:160)
at java.base@11.0.24/java.util.concurrent.locks.AbstractQueuedSynchronizer.unparkSuccessor(AbstractQueuedSynchronizer.java:709)
at java.base@11.0.24/java.util.concurrent.locks.AbstractQueuedSynchronizer.release(AbstractQueuedSynchronizer.java:1305)
at java.base@11.0.24/java.util.concurrent.locks.ReentrantLock.unlock(ReentrantLock.java:439)
at java.base@11.0.24/java.util.concurrent.ThreadPoolExecutor.tryTerminate(ThreadPoolExecutor.java:726)
at java.base@11.0.24/java.util.concurrent.ThreadPoolExecutor.processWorkerExit(ThreadPoolExecutor.java:994)
at java.base@11.0.24/java.util.concurrent.ThreadPoolExecutor.runWorker(ThreadPoolExecutor.java:1142)
at java.base@11.0.24/java.util.concurrent.ThreadPoolExecutor$Worker.run(ThreadPoolExecutor.java:628)
at java.base@11.0.24/java.lang.Thread.run(Thread.java:829)
at __randomizedtesting.SeedInfo.seed([1A7BD75F7A7131DE]:0)
FAILED: org.apache.solr.client.solrj.TestLBHttp2SolrClient.testSimple
Error Message:
java.lang.AssertionError: The alive check query was not logged within 10 seconds.
Stack Trace:
java.lang.AssertionError: The alive check query was not logged within 10 seconds.
at __randomizedtesting.SeedInfo.seed([1A7BD75F7A7131DE:22C8F3A15D82E50F]:0)
at org.junit.Assert.fail(Assert.java:89)
at org.apache.solr.client.solrj.TestLBHttp2SolrClient.startJettyAndWaitForAliveCheckQuery(TestLBHttp2SolrClient.java:215)
at org.apache.solr.client.solrj.TestLBHttp2SolrClient.testSimple(TestLBHttp2SolrClient.java:156)
at java.base/jdk.internal.reflect.NativeMethodAccessorImpl.invoke0(Native Method)
at java.base/jdk.internal.reflect.NativeMethodAccessorImpl.invoke(NativeMethodAccessorImpl.java:62)
at java.base/jdk.internal.reflect.DelegatingMethodAccessorImpl.invoke(DelegatingMethodAccessorImpl.java:43)
at java.base/java.lang.reflect.Method.invoke(Method.java:566)
at com.carrotsearch.randomizedtesting.RandomizedRunner.invoke(RandomizedRunner.java:1758)
at com.carrotsearch.randomizedtesting.RandomizedRunner$8.evaluate(RandomizedRunner.java:946)
at com.carrotsearch.randomizedtesting.RandomizedRunner$9.evaluate(RandomizedRunner.java:982)
at com.carrotsearch.randomizedtesting.RandomizedRunner$10.evaluate(RandomizedRunner.java:996)
at com.carrotsearch.randomizedtesting.rules.SystemPropertiesRestoreRule$1.evaluate(SystemPropertiesRestoreRule.java:80)
at org.junit.rules.RunRules.evaluate(RunRules.java:20)
at org.apache.lucene.tests.util.TestRuleSetupTeardownChained$1.evaluate(TestRuleSetupTeardownChained.java:48)
at org.apache.lucene.tests.util.AbstractBeforeAfterRule$1.evaluate(AbstractBeforeAfterRule.java:43)
at org.apache.lucene.tests.util.TestRuleThreadAndTestName$1.evaluate(TestRuleThreadAndTestName.java:45)
at org.apache.lucene.tests.util.TestRuleIgnoreAfterMaxFailures$1.evaluate(TestRuleIgnoreAfterMaxFailures.java:60)
at org.apache.lucene.tests.util.TestRuleMarkFailure$1.evaluate(TestRuleMarkFailure.java:44)
at org.junit.rules.RunRules.evaluate(RunRules.java:20)
at com.carrotsearch.randomizedtesting.rules.StatementAdapter.evaluate(StatementAdapter.java:36)
at com.carrotsearch.randomizedtesting.ThreadLeakControl$StatementRunner.run(ThreadLeakControl.java:390)
at com.carrotsearch.randomizedtesting.ThreadLeakControl.forkTimeoutingTask(ThreadLeakControl.java:843)
at com.carrotsearch.randomizedtesting.ThreadLeakControl$3.evaluate(ThreadLeakControl.java:490)
at com.carrotsearch.randomizedtesting.RandomizedRunner.runSingleTest(RandomizedRunner.java:955)
at com.carrotsearch.randomizedtesting.RandomizedRunner$5.evaluate(RandomizedRunner.java:840)
at com.carrotsearch.randomizedtesting.RandomizedRunner$6.evaluate(RandomizedRunner.java:891)
at com.carrotsearch.randomizedtesting.RandomizedRunner$7.evaluate(RandomizedRunner.java:902)
at com.carrotsearch.randomizedtesting.rules.StatementAdapter.evaluate(StatementAdapter.java:36)
at com.carrotsearch.randomizedtesting.rules.StatementAdapter.evaluate(StatementAdapter.java:36)
at org.apache.lucene.tests.util.AbstractBeforeAfterRule$1.evaluate(AbstractBeforeAfterRule.java:43)
at org.apache.lucene.tests.util.AbstractBeforeAfterRule$1.evaluate(AbstractBeforeAfterRule.java:43)
at com.carrotsearch.randomizedtesting.rules.SystemPropertiesRestoreRule$1.evaluate(SystemPropertiesRestoreRule.java:80)
at org.junit.rules.RunRules.evaluate(RunRules.java:20)
at org.apache.lucene.tests.util.AbstractBeforeAfterRule$1.evaluate(AbstractBeforeAfterRule.java:43)
at com.carrotsearch.randomizedtesting.rules.StatementAdapter.evaluate(StatementAdapter.java:36)
at org.apache.lucene.tests.util.TestRuleStoreClassName$1.evaluate(TestRuleStoreClassName.java:38)
at com.carrotsearch.randomizedtesting.rules.NoShadowingOrOverridesOnMethodsRule$1.evaluate(NoShadowingOrOverridesOnMethodsRule.java:40)
at com.carrotsearch.randomizedtesting.rules.NoShadowingOrOverridesOnMethodsRule$1.evaluate(NoShadowingOrOverridesOnMethodsRule.java:40)
at com.carrotsearch.randomizedtesting.rules.StatementAdapter.evaluate(StatementAdapter.java:36)
at com.carrotsearch.randomizedtesting.rules.StatementAdapter.evaluate(StatementAdapter.java:36)
at org.apache.lucene.tests.util.TestRuleAssertionsRequired$1.evaluate(TestRuleAssertionsRequired.java:53)
at org.apache.lucene.tests.util.AbstractBeforeAfterRule$1.evaluate(AbstractBeforeAfterRule.java:43)
at org.apache.lucene.tests.util.TestRuleMarkFailure$1.evaluate(TestRuleMarkFailure.java:44)
at org.apache.lucene.tests.util.TestRuleIgnoreAfterMaxFailures$1.evaluate(TestRuleIgnoreAfterMaxFailures.java:60)
at org.apache.lucene.tests.util.TestRuleIgnoreTestSuites$1.evaluate(TestRuleIgnoreTestSuites.java:47)
at org.junit.rules.RunRules.evaluate(RunRules.java:20)
at com.carrotsearch.randomizedtesting.rules.StatementAdapter.evaluate(StatementAdapter.java:36)
at com.carrotsearch.randomizedtesting.ThreadLeakControl$StatementRunner.run(ThreadLeakControl.java:390)
at com.carrotsearch.randomizedtesting.ThreadLeakControl.lambda$forkTimeoutingTask$0(ThreadLeakControl.java:850)
at java.base/java.lang.Thread.run(Thread.java:829)
FAILED: org.apache.solr.client.solrj.TestLBHttp2SolrClient.testTwoServers
Error Message:
java.lang.AssertionError: The alive check query was not logged within 10 seconds.
Stack Trace:
java.lang.AssertionError: The alive check query was not logged within 10 seconds.
at __randomizedtesting.SeedInfo.seed([1A7BD75F7A7131DE:BA9179D2A13A1FFE]:0)
at org.junit.Assert.fail(Assert.java:89)
at org.apache.solr.client.solrj.TestLBHttp2SolrClient.startJettyAndWaitForAliveCheckQuery(TestLBHttp2SolrClient.java:215)
at org.apache.solr.client.solrj.TestLBHttp2SolrClient.testTwoServers(TestLBHttp2SolrClient.java:194)
at java.base/jdk.internal.reflect.NativeMethodAccessorImpl.invoke0(Native Method)
at java.base/jdk.internal.reflect.NativeMethodAccessorImpl.invoke(NativeMethodAccessorImpl.java:62)
at java.base/jdk.internal.reflect.DelegatingMethodAccessorImpl.invoke(DelegatingMethodAccessorImpl.java:43)
at java.base/java.lang.reflect.Method.invoke(Method.java:566)
at com.carrotsearch.randomizedtesting.RandomizedRunner.invoke(RandomizedRunner.java:1758)
at com.carrotsearch.randomizedtesting.RandomizedRunner$8.evaluate(RandomizedRunner.java:946)
at com.carrotsearch.randomizedtesting.RandomizedRunner$9.evaluate(RandomizedRunner.java:982)
at com.carrotsearch.randomizedtesting.RandomizedRunner$10.evaluate(RandomizedRunner.java:996)
at com.carrotsearch.randomizedtesting.rules.SystemPropertiesRestoreRule$1.evaluate(SystemPropertiesRestoreRule.java:80)
at org.junit.rules.RunRules.evaluate(RunRules.java:20)
at org.apache.lucene.tests.util.TestRuleSetupTeardownChained$1.evaluate(TestRuleSetupTeardownChained.java:48)
at org.apache.lucene.tests.util.AbstractBeforeAfterRule$1.evaluate(AbstractBeforeAfterRule.java:43)
at org.apache.lucene.tests.util.TestRuleThreadAndTestName$1.evaluate(TestRuleThreadAndTestName.java:45)
at org.apache.lucene.tests.util.TestRuleIgnoreAfterMaxFailures$1.evaluate(TestRuleIgnoreAfterMaxFailures.java:60)
at org.apache.lucene.tests.util.TestRuleMarkFailure$1.evaluate(TestRuleMarkFailure.java:44)
at org.junit.rules.RunRules.evaluate(RunRules.java:20)
at com.carrotsearch.randomizedtesting.rules.StatementAdapter.evaluate(StatementAdapter.java:36)
at com.carrotsearch.randomizedtesting.ThreadLeakControl$StatementRunner.run(ThreadLeakControl.java:390)
at com.carrotsearch.randomizedtesting.ThreadLeakControl.forkTimeoutingTask(ThreadLeakControl.java:843)
at com.carrotsearch.randomizedtesting.ThreadLeakControl$3.evaluate(ThreadLeakControl.java:490)
at com.carrotsearch.randomizedtesting.RandomizedRunner.runSingleTest(RandomizedRunner.java:955)
at com.carrotsearch.randomizedtesting.RandomizedRunner$5.evaluate(RandomizedRunner.java:840)
at com.carrotsearch.randomizedtesting.RandomizedRunner$6.evaluate(RandomizedRunner.java:891)
at com.carrotsearch.randomizedtesting.RandomizedRunner$7.evaluate(RandomizedRunner.java:902)
at com.carrotsearch.randomizedtesting.rules.StatementAdapter.evaluate(StatementAdapter.java:36)
at com.carrotsearch.randomizedtesting.rules.StatementAdapter.evaluate(StatementAdapter.java:36)
at org.apache.lucene.tests.util.AbstractBeforeAfterRule$1.evaluate(AbstractBeforeAfterRule.java:43)
at org.apache.lucene.tests.util.AbstractBeforeAfterRule$1.evaluate(AbstractBeforeAfterRule.java:43)
at com.carrotsearch.randomizedtesting.rules.SystemPropertiesRestoreRule$1.evaluate(SystemPropertiesRestoreRule.java:80)
at org.junit.rules.RunRules.evaluate(RunRules.java:20)
at org.apache.lucene.tests.util.AbstractBeforeAfterRule$1.evaluate(AbstractBeforeAfterRule.java:43)
at com.carrotsearch.randomizedtesting.rules.StatementAdapter.evaluate(StatementAdapter.java:36)
at org.apache.lucene.tests.util.TestRuleStoreClassName$1.evaluate(TestRuleStoreClassName.java:38)
at com.carrotsearch.randomizedtesting.rules.NoShadowingOrOverridesOnMethodsRule$1.evaluate(NoShadowingOrOverridesOnMethodsRule.java:40)
at com.carrotsearch.randomizedtesting.rules.NoShadowingOrOverridesOnMethodsRule$1.evaluate(NoShadowingOrOverridesOnMethodsRule.java:40)
at com.carrotsearch.randomizedtesting.rules.StatementAdapter.evaluate(StatementAdapter.java:36)
at com.carrotsearch.randomizedtesting.rules.StatementAdapter.evaluate(StatementAdapter.java:36)
at org.apache.lucene.tests.util.TestRuleAssertionsRequired$1.evaluate(TestRuleAssertionsRequired.java:53)
at org.apache.lucene.tests.util.AbstractBeforeAfterRule$1.evaluate(AbstractBeforeAfterRule.java:43)
at org.apache.lucene.tests.util.TestRuleMarkFailure$1.evaluate(TestRuleMarkFailure.java:44)
at org.apache.lucene.tests.util.TestRuleIgnoreAfterMaxFailures$1.evaluate(TestRuleIgnoreAfterMaxFailures.java:60)
at org.apache.lucene.tests.util.TestRuleIgnoreTestSuites$1.evaluate(TestRuleIgnoreTestSuites.java:47)
at org.junit.rules.RunRules.evaluate(RunRules.java:20)
at com.carrotsearch.randomizedtesting.rules.StatementAdapter.evaluate(StatementAdapter.java:36)
at com.carrotsearch.randomizedtesting.ThreadLeakControl$StatementRunner.run(ThreadLeakControl.java:390)
at com.carrotsearch.randomizedtesting.ThreadLeakControl.lambda$forkTimeoutingTask$0(ThreadLeakControl.java:850)
at java.base/java.lang.Thread.run(Thread.java:829)
Build Log:
[...truncated 51421 lines...]
ERROR: The following test(s) have failed:
- org.apache.solr.client.solrj.io.stream.JDBCStreamTest.testJDBCSolrInnerJoinRollupExpression (:solr:solrj-streaming)
Test history: https://ge.apache.org/scans/tests?search.rootProjectNames=solr-root&tests.container=org.apache.solr.client.solrj.io.stream.JDBCStreamTest&tests.test=testJDBCSolrInnerJoinRollupExpression http://fucit.org/solr-jenkins-reports/history-trend-of-recent-failures.html#series/org.apache.solr.client.solrj.io.stream.JDBCStreamTest.testJDBCSolrInnerJoinRollupExpression
Test output: /home/jenkins/jenkins-slave/workspace/Solr/Solr-Test-9.8/solr/solrj-streaming/build/test-results/test/outputs/OUTPUT-org.apache.solr.client.solrj.io.stream.JDBCStreamTest.txt
Reproduce with: ./gradlew :solr:solrj-streaming:test --tests "org.apache.solr.client.solrj.io.stream.JDBCStreamTest.testJDBCSolrInnerJoinRollupExpression" -Ptests.jvms=4 -Ptests.haltonfailure=false "-Ptests.jvmargs=-XX:TieredStopAtLevel=1 -XX:+UseParallelGC -XX:ActiveProcessorCount=1 -XX:ReservedCodeCacheSize=120m" -Ptests.seed=1A7BD75F7A7131DE -Ptests.multiplier=2 -Ptests.badapples=false -Ptests.file.encoding=UTF-8
- org.apache.solr.client.solrj.io.stream.JDBCStreamTest.testJDBCSelect (:solr:solrj-streaming)
Test history: https://ge.apache.org/scans/tests?search.rootProjectNames=solr-root&tests.container=org.apache.solr.client.solrj.io.stream.JDBCStreamTest&tests.test=testJDBCSelect http://fucit.org/solr-jenkins-reports/history-trend-of-recent-failures.html#series/org.apache.solr.client.solrj.io.stream.JDBCStreamTest.testJDBCSelect
Test output: /home/jenkins/jenkins-slave/workspace/Solr/Solr-Test-9.8/solr/solrj-streaming/build/test-results/test/outputs/OUTPUT-org.apache.solr.client.solrj.io.stream.JDBCStreamTest.txt
Reproduce with: ./gradlew :solr:solrj-streaming:test --tests "org.apache.solr.client.solrj.io.stream.JDBCStreamTest.testJDBCSelect" -Ptests.jvms=4 -Ptests.haltonfailure=false "-Ptests.jvmargs=-XX:TieredStopAtLevel=1 -XX:+UseParallelGC -XX:ActiveProcessorCount=1 -XX:ReservedCodeCacheSize=120m" -Ptests.seed=1A7BD75F7A7131DE -Ptests.multiplier=2 -Ptests.badapples=false -Ptests.file.encoding=UTF-8
- org.apache.solr.client.solrj.io.stream.JDBCStreamTest (:solr:solrj-streaming)
Test history: https://ge.apache.org/scans/tests?search.rootProjectNames=solr-root&tests.container=org.apache.solr.client.solrj.io.stream.JDBCStreamTest
Test output: /home/jenkins/jenkins-slave/workspace/Solr/Solr-Test-9.8/solr/solrj-streaming/build/test-results/test/outputs/OUTPUT-org.apache.solr.client.solrj.io.stream.JDBCStreamTest.txt
Reproduce with: ./gradlew :solr:solrj-streaming:test --tests "org.apache.solr.client.solrj.io.stream.JDBCStreamTest" -Ptests.jvms=4 -Ptests.haltonfailure=false "-Ptests.jvmargs=-XX:TieredStopAtLevel=1 -XX:+UseParallelGC -XX:ActiveProcessorCount=1 -XX:ReservedCodeCacheSize=120m" -Ptests.seed=1A7BD75F7A7131DE -Ptests.multiplier=2 -Ptests.badapples=false -Ptests.file.encoding=UTF-8
- org.apache.solr.client.solrj.TestLBHttp2SolrClient.testSimple (:solr:solrj)
Test history: https://ge.apache.org/scans/tests?search.rootProjectNames=solr-root&tests.container=org.apache.solr.client.solrj.TestLBHttp2SolrClient&tests.test=testSimple http://fucit.org/solr-jenkins-reports/history-trend-of-recent-failures.html#series/org.apache.solr.client.solrj.TestLBHttp2SolrClient.testSimple
Test output: /home/jenkins/jenkins-slave/workspace/Solr/Solr-Test-9.8/solr/solrj/build/test-results/test/outputs/OUTPUT-org.apache.solr.client.solrj.TestLBHttp2SolrClient.txt
Reproduce with: ./gradlew :solr:solrj:test --tests "org.apache.solr.client.solrj.TestLBHttp2SolrClient.testSimple" -Ptests.jvms=4 -Ptests.haltonfailure=false "-Ptests.jvmargs=-XX:TieredStopAtLevel=1 -XX:+UseParallelGC -XX:ActiveProcessorCount=1 -XX:ReservedCodeCacheSize=120m" -Ptests.seed=1A7BD75F7A7131DE -Ptests.multiplier=2 -Ptests.badapples=false -Ptests.file.encoding=UTF-8
- org.apache.solr.client.solrj.TestLBHttp2SolrClient.testTwoServers (:solr:solrj)
Test history: https://ge.apache.org/scans/tests?search.rootProjectNames=solr-root&tests.container=org.apache.solr.client.solrj.TestLBHttp2SolrClient&tests.test=testTwoServers http://fucit.org/solr-jenkins-reports/history-trend-of-recent-failures.html#series/org.apache.solr.client.solrj.TestLBHttp2SolrClient.testTwoServers
Test output: /home/jenkins/jenkins-slave/workspace/Solr/Solr-Test-9.8/solr/solrj/build/test-results/test/outputs/OUTPUT-org.apache.solr.client.solrj.TestLBHttp2SolrClient.txt
Reproduce with: ./gradlew :solr:solrj:test --tests "org.apache.solr.client.solrj.TestLBHttp2SolrClient.testTwoServers" -Ptests.jvms=4 -Ptests.haltonfailure=false "-Ptests.jvmargs=-XX:TieredStopAtLevel=1 -XX:+UseParallelGC -XX:ActiveProcessorCount=1 -XX:ReservedCodeCacheSize=120m" -Ptests.seed=1A7BD75F7A7131DE -Ptests.multiplier=2 -Ptests.badapples=false -Ptests.file.encoding=UTF-8
- org.apache.solr.cloud.MissingSegmentRecoveryTest.testLeaderRecovery (:solr:core)
Test history: https://ge.apache.org/scans/tests?search.rootProjectNames=solr-root&tests.container=org.apache.solr.cloud.MissingSegmentRecoveryTest&tests.test=testLeaderRecovery http://fucit.org/solr-jenkins-reports/history-trend-of-recent-failures.html#series/org.apache.solr.cloud.MissingSegmentRecoveryTest.testLeaderRecovery
Test output: /home/jenkins/jenkins-slave/workspace/Solr/Solr-Test-9.8/solr/core/build/test-results/test/outputs/OUTPUT-org.apache.solr.cloud.MissingSegmentRecoveryTest.txt
Reproduce with: ./gradlew :solr:core:test --tests "org.apache.solr.cloud.MissingSegmentRecoveryTest.testLeaderRecovery" -Ptests.jvms=4 -Ptests.haltonfailure=false "-Ptests.jvmargs=-XX:TieredStopAtLevel=1 -XX:+UseParallelGC -XX:ActiveProcessorCount=1 -XX:ReservedCodeCacheSize=120m" -Ptests.seed=1A7BD75F7A7131DE -Ptests.multiplier=2 -Ptests.badapples=false -Ptests.file.encoding=UTF-8
- org.apache.solr.cloud.TestTlogReplica.testBasicLeaderElection (:solr:core)
Test history: https://ge.apache.org/scans/tests?search.rootProjectNames=solr-root&tests.container=org.apache.solr.cloud.TestTlogReplica&tests.test=testBasicLeaderElection http://fucit.org/solr-jenkins-reports/history-trend-of-recent-failures.html#series/org.apache.solr.cloud.TestTlogReplica.testBasicLeaderElection
Test output: /home/jenkins/jenkins-slave/workspace/Solr/Solr-Test-9.8/solr/core/build/test-results/test/outputs/OUTPUT-org.apache.solr.cloud.TestTlogReplica.txt
Reproduce with: ./gradlew :solr:core:test --tests "org.apache.solr.cloud.TestTlogReplica.testBasicLeaderElection" -Ptests.jvms=4 -Ptests.haltonfailure=false "-Ptests.jvmargs=-XX:TieredStopAtLevel=1 -XX:+UseParallelGC -XX:ActiveProcessorCount=1 -XX:ReservedCodeCacheSize=120m" -Ptests.seed=1A7BD75F7A7131DE -Ptests.multiplier=2 -Ptests.badapples=false -Ptests.file.encoding=UTF-8
- org.apache.solr.cloud.ReindexCollectionTest.testSameTargetReindexing (:solr:core)
Test history: https://ge.apache.org/scans/tests?search.rootProjectNames=solr-root&tests.container=org.apache.solr.cloud.ReindexCollectionTest&tests.test=testSameTargetReindexing http://fucit.org/solr-jenkins-reports/history-trend-of-recent-failures.html#series/org.apache.solr.cloud.ReindexCollectionTest.testSameTargetReindexing
Test output: /home/jenkins/jenkins-slave/workspace/Solr/Solr-Test-9.8/solr/core/build/test-results/test/outputs/OUTPUT-org.apache.solr.cloud.ReindexCollectionTest.txt
Reproduce with: ./gradlew :solr:core:test --tests "org.apache.solr.cloud.ReindexCollectionTest.testSameTargetReindexing" -Ptests.jvms=4 -Ptests.haltonfailure=false "-Ptests.jvmargs=-XX:TieredStopAtLevel=1 -XX:+UseParallelGC -XX:ActiveProcessorCount=1 -XX:ReservedCodeCacheSize=120m" -Ptests.seed=1A7BD75F7A7131DE -Ptests.multiplier=2 -Ptests.badapples=false -Ptests.file.encoding=UTF-8
- org.apache.solr.cloud.api.collections.TestCollectionsAPIViaSolrCloudCluster.testCollectionCreateSearchDelete (:solr:core)
Test history: https://ge.apache.org/scans/tests?search.rootProjectNames=solr-root&tests.container=org.apache.solr.cloud.api.collections.TestCollectionsAPIViaSolrCloudCluster&tests.test=testCollectionCreateSearchDelete http://fucit.org/solr-jenkins-reports/history-trend-of-recent-failures.html#series/org.apache.solr.cloud.api.collections.TestCollectionsAPIViaSolrCloudCluster.testCollectionCreateSearchDelete
Test output: /home/jenkins/jenkins-slave/workspace/Solr/Solr-Test-9.8/solr/core/build/test-results/test/outputs/OUTPUT-org.apache.solr.cloud.api.collections.TestCollectionsAPIViaSolrCloudCluster.txt
Reproduce with: ./gradlew :solr:core:test --tests "org.apache.solr.cloud.api.collections.TestCollectionsAPIViaSolrCloudCluster.testCollectionCreateSearchDelete" -Ptests.jvms=4 -Ptests.haltonfailure=false "-Ptests.jvmargs=-XX:TieredStopAtLevel=1 -XX:+UseParallelGC -XX:ActiveProcessorCount=1 -XX:ReservedCodeCacheSize=120m" -Ptests.seed=1A7BD75F7A7131DE -Ptests.multiplier=2 -Ptests.badapples=false -Ptests.file.encoding=UTF-8
- org.apache.solr.cloud.api.collections.CollectionReloadTest.testCreateReloadDeleteAllNrt {seed=[1A7BD75F7A7131DE:5F6B23F680BDB45]} (:solr:core)
Test history: https://ge.apache.org/scans/tests?search.rootProjectNames=solr-root&tests.container=org.apache.solr.cloud.api.collections.CollectionReloadTest&tests.test=testCreateReloadDeleteAllNrt {seed=[1A7BD75F7A7131DE:5F6B23F680BDB45]} http://fucit.org/solr-jenkins-reports/history-trend-of-recent-failures.html#series/org.apache.solr.cloud.api.collections.CollectionReloadTest.testCreateReloadDeleteAllNrt {seed=[1A7BD75F7A7131DE:5F6B23F680BDB45]}
Test output: /home/jenkins/jenkins-slave/workspace/Solr/Solr-Test-9.8/solr/core/build/test-results/test/outputs/OUTPUT-org.apache.solr.cloud.api.collections.CollectionReloadTest.txt
Reproduce with: ./gradlew :solr:core:test --tests "org.apache.solr.cloud.api.collections.CollectionReloadTest.testCreateReloadDeleteAllNrt {seed=[1A7BD75F7A7131DE:5F6B23F680BDB45]}" -Ptests.jvms=4 -Ptests.haltonfailure=false "-Ptests.jvmargs=-XX:TieredStopAtLevel=1 -XX:+UseParallelGC -XX:ActiveProcessorCount=1 -XX:ReservedCodeCacheSize=120m" -Ptests.seed=1A7BD75F7A7131DE -Ptests.multiplier=2 -Ptests.badapples=false -Ptests.file.encoding=UTF-8
- org.apache.solr.cloud.TestPullReplica.testCreateDelete {seed=[1A7BD75F7A7131DE:D8F9C8A8944F2BC3]} (:solr:core)
Test history: https://ge.apache.org/scans/tests?search.rootProjectNames=solr-root&tests.container=org.apache.solr.cloud.TestPullReplica&tests.test=testCreateDelete {seed=[1A7BD75F7A7131DE:D8F9C8A8944F2BC3]} http://fucit.org/solr-jenkins-reports/history-trend-of-recent-failures.html#series/org.apache.solr.cloud.TestPullReplica.testCreateDelete {seed=[1A7BD75F7A7131DE:D8F9C8A8944F2BC3]}
Test output: /home/jenkins/jenkins-slave/workspace/Solr/Solr-Test-9.8/solr/core/build/test-results/test/outputs/OUTPUT-org.apache.solr.cloud.TestPullReplica.txt
Reproduce with: ./gradlew :solr:core:test --tests "org.apache.solr.cloud.TestPullReplica.testCreateDelete {seed=[1A7BD75F7A7131DE:D8F9C8A8944F2BC3]}" -Ptests.jvms=4 -Ptests.haltonfailure=false "-Ptests.jvmargs=-XX:TieredStopAtLevel=1 -XX:+UseParallelGC -XX:ActiveProcessorCount=1 -XX:ReservedCodeCacheSize=120m" -Ptests.seed=1A7BD75F7A7131DE -Ptests.multiplier=2 -Ptests.badapples=false -Ptests.file.encoding=UTF-8
Deprecated Gradle features were used in this build, making it incompatible with Gradle 9.0.
You can use '--warning-mode all' to show the individual deprecation warnings and determine if they come from your own scripts or plugins.
For more on this, please refer to https://docs.gradle.org/8.10/userguide/command_line_interface.html#sec:command_line_warnings in the Gradle documentation.
BUILD SUCCESSFUL in 1h 58m 26s
167 actionable tasks: 167 executed
Build step 'Invoke Gradle script' changed build result to SUCCESS
Archiving artifacts
‘**/*.events’ doesn’t match anything: ‘**’ exists but not ‘**/*.events’
No artifacts found that match the file pattern "**/*.events,heapdumps/**,**/hs_err_pid*". Configuration error?
Recording test results
[Checks API] No suitable checks publisher found.
Build step 'Publish JUnit test result report' changed build result to UNSTABLE
Email was triggered for: Unstable (Test Failures)
Sending email for trigger: Unstable (Test Failures)