You are viewing a plain text version of this content. The canonical link for it is here.
Posted to builds@solr.apache.org by Apache Jenkins Server <je...@builds.apache.org> on 2024/10/16 04:37:18 UTC

[JENKINS] Solr » Solr-Check-9.x - Build # 6208 - Still Failing!

Build: https://ci-builds.apache.org/job/Solr/job/Solr-Check-9.x/6208/

All tests passed

Build Log:
[...truncated 1409 lines...]
# ERROR: Solr is not running in cloud mode on http://localhost:36855
# 
# Please find the SOLR_HOME snapshot for failed test #1 at: /home/jenkins/jenkins-slave/workspace/Solr/Solr-Check-9.x/solr/packaging/build/test-output/failure-snapshots/57-1
# WARN  - 2024-10-16 04:28:00.134; org.apache.solr.common.cloud.SolrZkClient; Using default ZkCredentialsInjector. ZkCredentialsInjector is not secure, it creates an empty list of credentials which leads to 'OPEN_ACL_UNSAFE' ACLs to Zookeeper nodes
# WARN  - 2024-10-16 04:28:00.697; org.apache.solr.common.cloud.SolrZkClient; Using default ZkACLProvider. DefaultZkACLProvider is not secure, it creates 'OPEN_ACL_UNSAFE' ACLs to Zookeeper nodes
# Last output:
# 
# Solr will start in SolrCloud mode by default in version 10, even if no -c or --cloud flag is specified.
# 
# Waiting up to 180 seconds to see Solr running on port 36855 [|]   [/]   [-]   [\]   [|]
# Started Solr server on port 36855 (pid=23250). Happy searching!
# 
#     
not ok 58 Random placement plugin using ENV # in 10479 ms
# (in test file test/test_placement_plugin.bats, line 43)
#   `solr assert --cloud http://localhost:${SOLR_PORT} --timeout 3000' failed with status 100
# 
# ERROR: Solr is not running in cloud mode on http://localhost:36855
# 
# Please find the SOLR_HOME snapshot for failed test #2 at: /home/jenkins/jenkins-slave/workspace/Solr/Solr-Check-9.x/solr/packaging/build/test-output/failure-snapshots/58-2
# WARN  - 2024-10-16 04:28:10.521; org.apache.solr.common.cloud.SolrZkClient; Using default ZkCredentialsInjector. ZkCredentialsInjector is not secure, it creates an empty list of credentials which leads to 'OPEN_ACL_UNSAFE' ACLs to Zookeeper nodes
# WARN  - 2024-10-16 04:28:10.692; org.apache.solr.common.cloud.SolrZkClient; Using default ZkACLProvider. DefaultZkACLProvider is not secure, it creates 'OPEN_ACL_UNSAFE' ACLs to Zookeeper nodes
# Last output:
# 
# Solr will start in SolrCloud mode by default in version 10, even if no -c or --cloud flag is specified.
# 
# Waiting up to 180 seconds to see Solr running on port 36855 [|]   [/]   [-]   [\]   [|]
# Started Solr server on port 36855 (pid=23726). Happy searching!
# 
#     
ok 59 Check help command # in 5012 ms
ok 60 basic post with a type specified # in 6344 ms
ok 61 basic post with collection instead of url parameter # in 4306 ms
ok 62 basic post WITHOUT a type specified # in 12676 ms
ok 63 crawling a directory as a dry-run # in 951 ms
ok 64 crawling a directory # in 4653 ms
ok 65 crawling a web site # in 4804 ms
ok 66 skipcommit and optimize and delete # in 4257 ms
ok 67 args mode # in 8096 ms
ok 68 stdin mode # in 3697 ms
ok 69 post solr log into solr via script # in 13864 ms
ok 70 post solr log into solr via cli # in 8217 ms
# starting solr-exporter on 36955
ok 71 should start solr prometheus exporter that scrapes solr for metrics # in 14670 ms
ok 72 allowPaths - backup # in 20270 ms
ok 73 snapshot lifecycle # in 6387 ms
ok 74 snapshot list # in 4203 ms
ok 75 snapshot describe # in 3712 ms
ok 76 start solr with ssl # in 19936 ms
ok 77 use different hostname when not checking peer-name # in 32183 ms
ok 78 start solr with ssl and auth # in 17668 ms
ok 79 start solr with client truststore and security manager # in 20531 ms
ok 80 start solr with mTLS needed # in 65289 ms
ok 81 start solr with mTLS wanted # in 49917 ms
ok 82 test keystore reload # in 73499 ms
ok 83 SOLR-11740 check 'solr stop' connection # in 15376 ms
ok 84 stop command for single port # in 18056 ms
not ok 85 start provides warning about SolrCloud mode # in 7161 ms
# (from function `assert_output' in file /home/jenkins/jenkins-slave/workspace/Solr/Solr-Check-9.x/.gradle/node/packaging/node_modules/bats-assert/src/assert.bash, line 247,
#  in test file test/test_start_solr.bats, line 56)
#   `assert_output --partial 'Solr will start in SolrCloud mode by default in version 10.  You will need to pass in --standalone flag to run in Standalone mode.'' failed
# 
# -- output does not contain substring --
# substring (1 lines):
#   Solr will start in SolrCloud mode by default in version 10.  You will need to pass in --standalone flag to run in Standalone mode.
# output (7 lines):
# 
#   Solr will start in SolrCloud mode by default in version 10.  You will need to pass in --user-managed flag to run in User Managed (aka Standalone) mode.
# 
#   Waiting up to 180 seconds to see Solr running on port 36855 [|]   [/]   [-]   [\]   [|]
#   Started Solr server on port 36855 (pid=9239). Happy searching!
# 
#       
# --
# 
# Please find the SOLR_HOME snapshot for failed test #3 at: /home/jenkins/jenkins-slave/workspace/Solr/Solr-Check-9.x/solr/packaging/build/test-output/failure-snapshots/85-3
# Last output:
# 
# Solr will start in SolrCloud mode by default in version 10.  You will need to pass in --user-managed flag to run in User Managed (aka Standalone) mode.
# 
# Waiting up to 180 seconds to see Solr running on port 36855 [|]   [/]   [-]   [\]   [|]
# Started Solr server on port 36855 (pid=9239). Happy searching!
# 
#     
ok 86 check stop command doesn't hang # in 285 ms
ok 87 status detects locally running solr # in 7928 ms
ok 88 --version and -v both return Solr version # in 1751 ms
ok 89 -version and version both return Solr version and deprecation # in 1764 ms
ok 90 short help # in 1510 ms
ok 91 short help is inferred # in 2700 ms
ok 92 long help # in 896 ms
ok 93 running subcommands with zk is prevented # in 899 ms
ok 94 listing out files # in 3347 ms
ok 95 connecting to solr via various solr urls and zk hosts # in 11322 ms
ok 96 copying files around # in 16876 ms
ok 97 upconfig # in 3997 ms
ok 98 downconfig # in 1232 ms
ok 99 zkcli.sh gets 'solrhome' from 'solr.home' system property # in 1771 ms
ok 100 zkcli.sh gets 'solrhome' from 'solrhome' command line option # in 1814 ms
ok 101 bin/solr zk cp gets 'solrhome' from '--solr-home' command line option # in 2603 ms
ok 102 Cleanup # in 1262 ms

> Task :solr:packaging:integrationTests FAILED

FAILURE: Build failed with an exception.

* Where:
Build file '/home/jenkins/jenkins-slave/workspace/Solr/Solr-Check-9.x/solr/packaging/build.gradle' line: 314

* What went wrong:
Execution failed for task ':solr:packaging:integrationTests'.
> Process 'command '/home/jenkins/jenkins-slave/workspace/Solr/Solr-Check-9.x/.gradle/node/packaging/node_modules/bats/bin/bats'' finished with non-zero exit value 1

* Try:
> Run with --stacktrace option to get the stack trace.
> Run with --info or --debug option to get more log output.
> Get more help at https://help.gradle.org.

Deprecated Gradle features were used in this build, making it incompatible with Gradle 9.0.

You can use '--warning-mode all' to show the individual deprecation warnings and determine if they come from your own scripts or plugins.

For more on this, please refer to https://docs.gradle.org/8.4/userguide/command_line_interface.html#sec:command_line_warnings in the Gradle documentation.

BUILD FAILED in 1h 14m 5s
742 actionable tasks: 742 executed

Publishing build scan...
https://ge.apache.org/s/x5jlp4nozvxo6

Build step 'Invoke Gradle script' changed build result to FAILURE
Build step 'Invoke Gradle script' marked build as failure
Archiving artifacts
Recording test results
[Checks API] No suitable checks publisher found.
Email was triggered for: Failure - Any
Sending email for trigger: Failure - Any

[JENKINS] Solr » Solr-Check-9.x - Build # 6210 - Still Failing!

Posted by Apache Jenkins Server <je...@builds.apache.org>.
Build: https://ci-builds.apache.org/job/Solr/job/Solr-Check-9.x/6210/

4 tests failed.
FAILED:  org.apache.solr.handler.designer.TestSchemaDesignerAPI.classMethod

Error Message:
java.util.concurrent.TimeoutException: Timed out waiting for all collections to be fully removed.

Stack Trace:
java.util.concurrent.TimeoutException: Timed out waiting for all collections to be fully removed.
	at __randomizedtesting.SeedInfo.seed([FF0EA49BA55D75D7]:0)
	at org.apache.solr.cloud.MiniSolrCloudCluster.deleteAllCollections(MiniSolrCloudCluster.java:678)
	at org.apache.solr.handler.designer.TestSchemaDesignerAPI.tearDownCluster(TestSchemaDesignerAPI.java:81)
	at java.base/jdk.internal.reflect.NativeMethodAccessorImpl.invoke0(Native Method)
	at java.base/jdk.internal.reflect.NativeMethodAccessorImpl.invoke(NativeMethodAccessorImpl.java:62)
	at java.base/jdk.internal.reflect.DelegatingMethodAccessorImpl.invoke(DelegatingMethodAccessorImpl.java:43)
	at java.base/java.lang.reflect.Method.invoke(Method.java:566)
	at com.carrotsearch.randomizedtesting.RandomizedRunner.invoke(RandomizedRunner.java:1758)
	at com.carrotsearch.randomizedtesting.RandomizedRunner$7.evaluate(RandomizedRunner.java:909)
	at com.carrotsearch.randomizedtesting.rules.StatementAdapter.evaluate(StatementAdapter.java:36)
	at com.carrotsearch.randomizedtesting.rules.StatementAdapter.evaluate(StatementAdapter.java:36)
	at org.apache.lucene.tests.util.AbstractBeforeAfterRule$1.evaluate(AbstractBeforeAfterRule.java:43)
	at org.apache.lucene.tests.util.AbstractBeforeAfterRule$1.evaluate(AbstractBeforeAfterRule.java:43)
	at com.carrotsearch.randomizedtesting.rules.SystemPropertiesRestoreRule$1.evaluate(SystemPropertiesRestoreRule.java:80)
	at org.junit.rules.RunRules.evaluate(RunRules.java:20)
	at org.apache.lucene.tests.util.AbstractBeforeAfterRule$1.evaluate(AbstractBeforeAfterRule.java:43)
	at com.carrotsearch.randomizedtesting.rules.StatementAdapter.evaluate(StatementAdapter.java:36)
	at org.apache.lucene.tests.util.TestRuleStoreClassName$1.evaluate(TestRuleStoreClassName.java:38)
	at com.carrotsearch.randomizedtesting.rules.NoShadowingOrOverridesOnMethodsRule$1.evaluate(NoShadowingOrOverridesOnMethodsRule.java:40)
	at com.carrotsearch.randomizedtesting.rules.NoShadowingOrOverridesOnMethodsRule$1.evaluate(NoShadowingOrOverridesOnMethodsRule.java:40)
	at com.carrotsearch.randomizedtesting.rules.StatementAdapter.evaluate(StatementAdapter.java:36)
	at com.carrotsearch.randomizedtesting.rules.StatementAdapter.evaluate(StatementAdapter.java:36)
	at org.apache.lucene.tests.util.TestRuleAssertionsRequired$1.evaluate(TestRuleAssertionsRequired.java:53)
	at org.apache.lucene.tests.util.AbstractBeforeAfterRule$1.evaluate(AbstractBeforeAfterRule.java:43)
	at org.apache.lucene.tests.util.TestRuleMarkFailure$1.evaluate(TestRuleMarkFailure.java:44)
	at org.apache.lucene.tests.util.TestRuleIgnoreAfterMaxFailures$1.evaluate(TestRuleIgnoreAfterMaxFailures.java:60)
	at org.apache.lucene.tests.util.TestRuleIgnoreTestSuites$1.evaluate(TestRuleIgnoreTestSuites.java:47)
	at org.junit.rules.RunRules.evaluate(RunRules.java:20)
	at com.carrotsearch.randomizedtesting.rules.StatementAdapter.evaluate(StatementAdapter.java:36)
	at com.carrotsearch.randomizedtesting.ThreadLeakControl$StatementRunner.run(ThreadLeakControl.java:390)
	at com.carrotsearch.randomizedtesting.ThreadLeakControl.lambda$forkTimeoutingTask$0(ThreadLeakControl.java:850)
	at java.base/java.lang.Thread.run(Thread.java:829)


FAILED:  org.apache.solr.handler.designer.TestSchemaDesignerAPI.classMethod

Error Message:
java.lang.AssertionError: core_node2 had no replica

Stack Trace:
java.lang.AssertionError: core_node2 had no replica
	at __randomizedtesting.SeedInfo.seed([FF0EA49BA55D75D7]:0)
	at org.apache.solr.core.CoreContainer.reload(CoreContainer.java:2084)
	at org.apache.solr.core.SolrCore.lambda$getConfListener$22(SolrCore.java:3456)
	at org.apache.solr.cloud.ZkController.lambda$fireEventListeners$26(ZkController.java:2768)
	at org.apache.solr.common.util.ExecutorUtil$MDCAwareThreadPoolExecutor.lambda$execute$0(ExecutorUtil.java:380)
	at java.base/java.util.concurrent.ThreadPoolExecutor.runWorker(ThreadPoolExecutor.java:1128)
	at java.base/java.util.concurrent.ThreadPoolExecutor$Worker.run(ThreadPoolExecutor.java:628)
	at java.base/java.lang.Thread.run(Thread.java:829)


FAILED:  org.apache.solr.handler.designer.TestSchemaDesignerAPI.classMethod

Error Message:
java.lang.AssertionError: Too many closes on SolrCore

Stack Trace:
java.lang.AssertionError: Too many closes on SolrCore
	at __randomizedtesting.SeedInfo.seed([FF0EA49BA55D75D7]:0)
	at org.apache.solr.core.SolrCore.close(SolrCore.java:1722)
	at org.apache.solr.core.SolrCores.lambda$close$0(SolrCores.java:128)
	at org.apache.solr.common.util.ExecutorUtil$MDCAwareThreadPoolExecutor.lambda$execute$0(ExecutorUtil.java:380)
	at java.base/java.util.concurrent.ThreadPoolExecutor.runWorker(ThreadPoolExecutor.java:1128)
	at java.base/java.util.concurrent.ThreadPoolExecutor$Worker.run(ThreadPoolExecutor.java:628)
	at java.base/java.lang.Thread.run(Thread.java:829)


FAILED:  org.apache.solr.handler.designer.TestSchemaDesignerAPI.classMethod

Error Message:
java.util.concurrent.TimeoutException: Timed out waiting for all collections to be fully removed.

Stack Trace:
java.util.concurrent.TimeoutException: Timed out waiting for all collections to be fully removed.
	at __randomizedtesting.SeedInfo.seed([FF0EA49BA55D75D7]:0)
	at org.apache.solr.cloud.MiniSolrCloudCluster.deleteAllCollections(MiniSolrCloudCluster.java:678)
	at org.apache.solr.handler.designer.TestSchemaDesignerAPI.tearDownCluster(TestSchemaDesignerAPI.java:81)
	at java.base/jdk.internal.reflect.NativeMethodAccessorImpl.invoke0(Native Method)
	at java.base/jdk.internal.reflect.NativeMethodAccessorImpl.invoke(NativeMethodAccessorImpl.java:62)
	at java.base/jdk.internal.reflect.DelegatingMethodAccessorImpl.invoke(DelegatingMethodAccessorImpl.java:43)
	at java.base/java.lang.reflect.Method.invoke(Method.java:566)
	at com.carrotsearch.randomizedtesting.RandomizedRunner.invoke(RandomizedRunner.java:1758)
	at com.carrotsearch.randomizedtesting.RandomizedRunner$7.evaluate(RandomizedRunner.java:909)
	at com.carrotsearch.randomizedtesting.rules.StatementAdapter.evaluate(StatementAdapter.java:36)
	at com.carrotsearch.randomizedtesting.rules.StatementAdapter.evaluate(StatementAdapter.java:36)
	at org.apache.lucene.tests.util.AbstractBeforeAfterRule$1.evaluate(AbstractBeforeAfterRule.java:43)
	at org.apache.lucene.tests.util.AbstractBeforeAfterRule$1.evaluate(AbstractBeforeAfterRule.java:43)
	at com.carrotsearch.randomizedtesting.rules.SystemPropertiesRestoreRule$1.evaluate(SystemPropertiesRestoreRule.java:80)
	at org.junit.rules.RunRules.evaluate(RunRules.java:20)
	at org.apache.lucene.tests.util.AbstractBeforeAfterRule$1.evaluate(AbstractBeforeAfterRule.java:43)
	at com.carrotsearch.randomizedtesting.rules.StatementAdapter.evaluate(StatementAdapter.java:36)
	at org.apache.lucene.tests.util.TestRuleStoreClassName$1.evaluate(TestRuleStoreClassName.java:38)
	at com.carrotsearch.randomizedtesting.rules.NoShadowingOrOverridesOnMethodsRule$1.evaluate(NoShadowingOrOverridesOnMethodsRule.java:40)
	at com.carrotsearch.randomizedtesting.rules.NoShadowingOrOverridesOnMethodsRule$1.evaluate(NoShadowingOrOverridesOnMethodsRule.java:40)
	at com.carrotsearch.randomizedtesting.rules.StatementAdapter.evaluate(StatementAdapter.java:36)
	at com.carrotsearch.randomizedtesting.rules.StatementAdapter.evaluate(StatementAdapter.java:36)
	at org.apache.lucene.tests.util.TestRuleAssertionsRequired$1.evaluate(TestRuleAssertionsRequired.java:53)
	at org.apache.lucene.tests.util.AbstractBeforeAfterRule$1.evaluate(AbstractBeforeAfterRule.java:43)
	at org.apache.lucene.tests.util.TestRuleMarkFailure$1.evaluate(TestRuleMarkFailure.java:44)
	at org.apache.lucene.tests.util.TestRuleIgnoreAfterMaxFailures$1.evaluate(TestRuleIgnoreAfterMaxFailures.java:60)
	at org.apache.lucene.tests.util.TestRuleIgnoreTestSuites$1.evaluate(TestRuleIgnoreTestSuites.java:47)
	at org.junit.rules.RunRules.evaluate(RunRules.java:20)
	at com.carrotsearch.randomizedtesting.rules.StatementAdapter.evaluate(StatementAdapter.java:36)
	at com.carrotsearch.randomizedtesting.ThreadLeakControl$StatementRunner.run(ThreadLeakControl.java:390)
	at com.carrotsearch.randomizedtesting.ThreadLeakControl.lambda$forkTimeoutingTask$0(ThreadLeakControl.java:850)
	at java.base/java.lang.Thread.run(Thread.java:829)




Build Log:
[...truncated 12648 lines...]
# ERROR: Solr is not running in cloud mode on http://localhost:38231
# 
# Please find the SOLR_HOME snapshot for failed test #1 at: /home/jenkins/jenkins-slave/workspace/Solr/Solr-Check-9.x/solr/packaging/build/test-output/failure-snapshots/57-1
# WARN  - 2024-10-16 15:47:42.398; org.apache.solr.common.cloud.SolrZkClient; Using default ZkCredentialsInjector. ZkCredentialsInjector is not secure, it creates an empty list of credentials which leads to 'OPEN_ACL_UNSAFE' ACLs to Zookeeper nodes
# WARN  - 2024-10-16 15:47:42.665; org.apache.solr.common.cloud.SolrZkClient; Using default ZkACLProvider. DefaultZkACLProvider is not secure, it creates 'OPEN_ACL_UNSAFE' ACLs to Zookeeper nodes
# Last output:
# 
# Solr will start in SolrCloud mode by default in version 10, even if no -c or --cloud flag is specified.
# 
# Waiting up to 180 seconds to see Solr running on port 38231 [|]   [/]   [-]   [\]   [|]
# Started Solr server on port 38231 (pid=1349803). Happy searching!
# 
#     
not ok 58 Random placement plugin using ENV # in 10832 ms
# (in test file test/test_placement_plugin.bats, line 43)
#   `solr assert --cloud http://localhost:${SOLR_PORT} --timeout 3000' failed with status 100
# 
# ERROR: Solr is not running in cloud mode on http://localhost:38231
# 
# Please find the SOLR_HOME snapshot for failed test #2 at: /home/jenkins/jenkins-slave/workspace/Solr/Solr-Check-9.x/solr/packaging/build/test-output/failure-snapshots/58-2
# WARN  - 2024-10-16 15:47:53.336; org.apache.solr.common.cloud.SolrZkClient; Using default ZkCredentialsInjector. ZkCredentialsInjector is not secure, it creates an empty list of credentials which leads to 'OPEN_ACL_UNSAFE' ACLs to Zookeeper nodes
# WARN  - 2024-10-16 15:47:53.571; org.apache.solr.common.cloud.SolrZkClient; Using default ZkACLProvider. DefaultZkACLProvider is not secure, it creates 'OPEN_ACL_UNSAFE' ACLs to Zookeeper nodes
# Last output:
# 
# Solr will start in SolrCloud mode by default in version 10, even if no -c or --cloud flag is specified.
# 
# Waiting up to 180 seconds to see Solr running on port 38231 [|]   [/]   [-]   [\]   [|]
# Started Solr server on port 38231 (pid=1350234). Happy searching!
# 
#     
ok 59 Check help command # in 5673 ms
ok 60 basic post with a type specified # in 6588 ms
ok 61 basic post with collection instead of url parameter # in 4254 ms
ok 62 basic post WITHOUT a type specified # in 12499 ms
ok 63 crawling a directory as a dry-run # in 902 ms
ok 64 crawling a directory # in 4598 ms
ok 65 crawling a web site # in 5009 ms
ok 66 skipcommit and optimize and delete # in 3965 ms
ok 67 args mode # in 8717 ms
ok 68 stdin mode # in 3470 ms
ok 69 post solr log into solr via script # in 11345 ms
ok 70 post solr log into solr via cli # in 7243 ms
# starting solr-exporter on 38331
ok 71 should start solr prometheus exporter that scrapes solr for metrics # in 15482 ms
ok 72 allowPaths - backup # in 17491 ms
ok 73 snapshot lifecycle # in 6624 ms
ok 74 snapshot list # in 4308 ms
ok 75 snapshot describe # in 4216 ms
ok 76 start solr with ssl # in 19138 ms
ok 77 use different hostname when not checking peer-name # in 31976 ms
ok 78 start solr with ssl and auth # in 17452 ms
ok 79 start solr with client truststore and security manager # in 19396 ms
ok 80 start solr with mTLS needed # in 63263 ms
ok 81 start solr with mTLS wanted # in 47578 ms
ok 82 test keystore reload # in 83601 ms
ok 83 SOLR-11740 check 'solr stop' connection # in 16327 ms
ok 84 stop command for single port # in 18952 ms
not ok 85 start provides warning about SolrCloud mode # in 7645 ms
# (from function `assert_output' in file /home/jenkins/jenkins-slave/workspace/Solr/Solr-Check-9.x/.gradle/node/packaging/node_modules/bats-assert/src/assert.bash, line 247,
#  in test file test/test_start_solr.bats, line 56)
#   `assert_output --partial 'Solr will start in SolrCloud mode by default in version 10.  You will need to pass in --standalone flag to run in Standalone mode.'' failed
# 
# -- output does not contain substring --
# substring (1 lines):
#   Solr will start in SolrCloud mode by default in version 10.  You will need to pass in --standalone flag to run in Standalone mode.
# output (7 lines):
# 
#   Solr will start in SolrCloud mode by default in version 10.  You will need to pass in --user-managed flag to run in User Managed (aka Standalone) mode.
# 
#   Waiting up to 180 seconds to see Solr running on port 38231 [|]   [/]   [-]   [\]   [|]
#   Started Solr server on port 38231 (pid=1371565). Happy searching!
# 
#       
# --
# 
# Please find the SOLR_HOME snapshot for failed test #3 at: /home/jenkins/jenkins-slave/workspace/Solr/Solr-Check-9.x/solr/packaging/build/test-output/failure-snapshots/85-3
# Last output:
# 
# Solr will start in SolrCloud mode by default in version 10.  You will need to pass in --user-managed flag to run in User Managed (aka Standalone) mode.
# 
# Waiting up to 180 seconds to see Solr running on port 38231 [|]   [/]   [-]   [\]   [|]
# Started Solr server on port 38231 (pid=1371565). Happy searching!
# 
#     
ok 86 check stop command doesn't hang # in 253 ms
ok 87 status detects locally running solr # in 8171 ms
ok 88 --version and -v both return Solr version # in 1720 ms
ok 89 -version and version both return Solr version and deprecation # in 1769 ms
ok 90 short help # in 2456 ms
ok 91 short help is inferred # in 2609 ms
ok 92 long help # in 930 ms
ok 93 running subcommands with zk is prevented # in 883 ms
ok 94 listing out files # in 2246 ms
ok 95 connecting to solr via various solr urls and zk hosts # in 10475 ms
ok 96 copying files around # in 11795 ms
ok 97 upconfig # in 2577 ms
ok 98 downconfig # in 1294 ms
ok 99 zkcli.sh gets 'solrhome' from 'solr.home' system property # in 1807 ms
ok 100 zkcli.sh gets 'solrhome' from 'solrhome' command line option # in 1793 ms
ok 101 bin/solr zk cp gets 'solrhome' from '--solr-home' command line option # in 1536 ms
ok 102 Cleanup # in 1266 ms

> Task :solr:packaging:integrationTests FAILED
ERROR: The following test(s) have failed:
  - org.apache.solr.handler.designer.TestSchemaDesignerAPI (:solr:core)
    Test history: https://ge.apache.org/scans/tests?search.rootProjectNames=solr-root&tests.container=org.apache.solr.handler.designer.TestSchemaDesignerAPI
    Test output: /home/jenkins/jenkins-slave/workspace/Solr/Solr-Check-9.x/solr/core/build/test-results/test/outputs/OUTPUT-org.apache.solr.handler.designer.TestSchemaDesignerAPI.txt
    Reproduce with: ./gradlew :solr:core:test --tests "org.apache.solr.handler.designer.TestSchemaDesignerAPI" -Ptests.jvms=4 -Ptests.haltonfailure=false "-Ptests.jvmargs=-XX:TieredStopAtLevel=1 -XX:+UseParallelGC -XX:ActiveProcessorCount=1 -XX:ReservedCodeCacheSize=120m" -Ptests.seed=FF0EA49BA55D75D7 -Ptests.multiplier=2 -Ptests.badapples=false -Ptests.file.encoding=UTF-8


FAILURE: Build failed with an exception.

* Where:
Build file '/home/jenkins/jenkins-slave/workspace/Solr/Solr-Check-9.x/solr/packaging/build.gradle' line: 314

* What went wrong:
Execution failed for task ':solr:packaging:integrationTests'.
> Process 'command '/home/jenkins/jenkins-slave/workspace/Solr/Solr-Check-9.x/.gradle/node/packaging/node_modules/bats/bin/bats'' finished with non-zero exit value 1

* Try:
> Run with --stacktrace option to get the stack trace.
> Run with --info or --debug option to get more log output.
> Get more help at https://help.gradle.org.

Deprecated Gradle features were used in this build, making it incompatible with Gradle 9.0.

You can use '--warning-mode all' to show the individual deprecation warnings and determine if they come from your own scripts or plugins.

For more on this, please refer to https://docs.gradle.org/8.4/userguide/command_line_interface.html#sec:command_line_warnings in the Gradle documentation.

BUILD FAILED in 1h 13m 52s
742 actionable tasks: 742 executed

Publishing build scan...
https://ge.apache.org/s/3ylrqqtdafsyu

Build step 'Invoke Gradle script' changed build result to FAILURE
Build step 'Invoke Gradle script' marked build as failure
Archiving artifacts
Recording test results
[Checks API] No suitable checks publisher found.
Email was triggered for: Failure - Any
Sending email for trigger: Failure - Any

[JENKINS] Solr » Solr-Check-9.x - Build # 6209 - Still Failing!

Posted by Apache Jenkins Server <je...@builds.apache.org>.
Build: https://ci-builds.apache.org/job/Solr/job/Solr-Check-9.x/6209/

All tests passed

Build Log:
[...truncated 1409 lines...]
# ERROR: Solr is not running in cloud mode on http://localhost:40573
# 
# Please find the SOLR_HOME snapshot for failed test #1 at: /home/jenkins/jenkins-slave/workspace/Solr/Solr-Check-9.x/solr/packaging/build/test-output/failure-snapshots/57-1
# WARN  - 2024-10-16 10:48:38.333; org.apache.solr.common.cloud.SolrZkClient; Using default ZkCredentialsInjector. ZkCredentialsInjector is not secure, it creates an empty list of credentials which leads to 'OPEN_ACL_UNSAFE' ACLs to Zookeeper nodes
# WARN  - 2024-10-16 10:48:38.510; org.apache.solr.common.cloud.SolrZkClient; Using default ZkACLProvider. DefaultZkACLProvider is not secure, it creates 'OPEN_ACL_UNSAFE' ACLs to Zookeeper nodes
# Last output:
# 
# Solr will start in SolrCloud mode by default in version 10, even if no -c or --cloud flag is specified.
# 
# Waiting up to 180 seconds to see Solr running on port 40573 [|]   [/]   [-]   [\]   [|]
# Started Solr server on port 40573 (pid=12855). Happy searching!
# 
#     
not ok 58 Random placement plugin using ENV # in 9542 ms
# (in test file test/test_placement_plugin.bats, line 43)
#   `solr assert --cloud http://localhost:${SOLR_PORT} --timeout 3000' failed with status 100
# 
# ERROR: Solr is not running in cloud mode on http://localhost:40573
# 
# Please find the SOLR_HOME snapshot for failed test #2 at: /home/jenkins/jenkins-slave/workspace/Solr/Solr-Check-9.x/solr/packaging/build/test-output/failure-snapshots/58-2
# WARN  - 2024-10-16 10:48:48.398; org.apache.solr.common.cloud.SolrZkClient; Using default ZkCredentialsInjector. ZkCredentialsInjector is not secure, it creates an empty list of credentials which leads to 'OPEN_ACL_UNSAFE' ACLs to Zookeeper nodes
# WARN  - 2024-10-16 10:48:48.571; org.apache.solr.common.cloud.SolrZkClient; Using default ZkACLProvider. DefaultZkACLProvider is not secure, it creates 'OPEN_ACL_UNSAFE' ACLs to Zookeeper nodes
# Last output:
# 
# Solr will start in SolrCloud mode by default in version 10, even if no -c or --cloud flag is specified.
# 
# Waiting up to 180 seconds to see Solr running on port 40573 [|]   [/]   [-]   [\]   [|]
# Started Solr server on port 40573 (pid=13334). Happy searching!
# 
#     
ok 59 Check help command # in 4857 ms
ok 60 basic post with a type specified # in 6912 ms
ok 61 basic post with collection instead of url parameter # in 4486 ms
ok 62 basic post WITHOUT a type specified # in 13091 ms
ok 63 crawling a directory as a dry-run # in 980 ms
ok 64 crawling a directory # in 4879 ms
ok 65 crawling a web site # in 5242 ms
ok 66 skipcommit and optimize and delete # in 4420 ms
ok 67 args mode # in 8060 ms
ok 68 stdin mode # in 3733 ms
ok 69 post solr log into solr via script # in 11798 ms
ok 70 post solr log into solr via cli # in 7245 ms
# starting solr-exporter on 40673
ok 71 should start solr prometheus exporter that scrapes solr for metrics # in 15535 ms
ok 72 allowPaths - backup # in 16935 ms
ok 73 snapshot lifecycle # in 6522 ms
ok 74 snapshot list # in 4125 ms
ok 75 snapshot describe # in 4145 ms
ok 76 start solr with ssl # in 20966 ms
ok 77 use different hostname when not checking peer-name # in 33020 ms
ok 78 start solr with ssl and auth # in 18665 ms
ok 79 start solr with client truststore and security manager # in 20719 ms
ok 80 start solr with mTLS needed # in 65538 ms
ok 81 start solr with mTLS wanted # in 52559 ms
ok 82 test keystore reload # in 79233 ms
ok 83 SOLR-11740 check 'solr stop' connection # in 14073 ms
ok 84 stop command for single port # in 18105 ms
not ok 85 start provides warning about SolrCloud mode # in 7216 ms
# (from function `assert_output' in file /home/jenkins/jenkins-slave/workspace/Solr/Solr-Check-9.x/.gradle/node/packaging/node_modules/bats-assert/src/assert.bash, line 247,
#  in test file test/test_start_solr.bats, line 56)
#   `assert_output --partial 'Solr will start in SolrCloud mode by default in version 10.  You will need to pass in --standalone flag to run in Standalone mode.'' failed
# 
# -- output does not contain substring --
# substring (1 lines):
#   Solr will start in SolrCloud mode by default in version 10.  You will need to pass in --standalone flag to run in Standalone mode.
# output (7 lines):
# 
#   Solr will start in SolrCloud mode by default in version 10.  You will need to pass in --user-managed flag to run in User Managed (aka Standalone) mode.
# 
#   Waiting up to 180 seconds to see Solr running on port 40573 [|]   [/]   [-]   [\]   [|]
#   Started Solr server on port 40573 (pid=31217). Happy searching!
# 
#       
# --
# 
# Please find the SOLR_HOME snapshot for failed test #3 at: /home/jenkins/jenkins-slave/workspace/Solr/Solr-Check-9.x/solr/packaging/build/test-output/failure-snapshots/85-3
# Last output:
# 
# Solr will start in SolrCloud mode by default in version 10.  You will need to pass in --user-managed flag to run in User Managed (aka Standalone) mode.
# 
# Waiting up to 180 seconds to see Solr running on port 40573 [|]   [/]   [-]   [\]   [|]
# Started Solr server on port 40573 (pid=31217). Happy searching!
# 
#     
ok 86 check stop command doesn't hang # in 279 ms
ok 87 status detects locally running solr # in 7856 ms
ok 88 --version and -v both return Solr version # in 1712 ms
ok 89 -version and version both return Solr version and deprecation # in 1811 ms
ok 90 short help # in 1576 ms
ok 91 short help is inferred # in 2144 ms
ok 92 long help # in 1501 ms
ok 93 running subcommands with zk is prevented # in 883 ms
ok 94 listing out files # in 2249 ms
ok 95 connecting to solr via various solr urls and zk hosts # in 18064 ms
ok 96 copying files around # in 18160 ms
ok 97 upconfig # in 4034 ms
ok 98 downconfig # in 1279 ms
ok 99 zkcli.sh gets 'solrhome' from 'solr.home' system property # in 1798 ms
ok 100 zkcli.sh gets 'solrhome' from 'solrhome' command line option # in 1799 ms
ok 101 bin/solr zk cp gets 'solrhome' from '--solr-home' command line option # in 3723 ms
ok 102 Cleanup # in 1300 ms

> Task :solr:packaging:integrationTests FAILED

FAILURE: Build failed with an exception.

* Where:
Build file '/home/jenkins/jenkins-slave/workspace/Solr/Solr-Check-9.x/solr/packaging/build.gradle' line: 314

* What went wrong:
Execution failed for task ':solr:packaging:integrationTests'.
> Process 'command '/home/jenkins/jenkins-slave/workspace/Solr/Solr-Check-9.x/.gradle/node/packaging/node_modules/bats/bin/bats'' finished with non-zero exit value 1

* Try:
> Run with --stacktrace option to get the stack trace.
> Run with --info or --debug option to get more log output.
> Get more help at https://help.gradle.org.

Deprecated Gradle features were used in this build, making it incompatible with Gradle 9.0.

You can use '--warning-mode all' to show the individual deprecation warnings and determine if they come from your own scripts or plugins.

For more on this, please refer to https://docs.gradle.org/8.4/userguide/command_line_interface.html#sec:command_line_warnings in the Gradle documentation.

BUILD FAILED in 1h 14m 36s
742 actionable tasks: 742 executed

Publishing build scan...
https://ge.apache.org/s/gscplm54icpfw

Build step 'Invoke Gradle script' changed build result to FAILURE
Build step 'Invoke Gradle script' marked build as failure
Archiving artifacts
Recording test results
[Checks API] No suitable checks publisher found.
Email was triggered for: Failure - Any
Sending email for trigger: Failure - Any