You are viewing a plain text version of this content. The canonical link for it is here.
Posted to builds@solr.apache.org by Apache Jenkins Server <je...@builds.apache.org> on 2023/11/13 14:25:24 UTC
[JENKINS] Solr » Solr-check-9.4 - Build # 993 - Unstable!
Build: https://ci-builds.apache.org/job/Solr/job/Solr-check-9.4/993/
1 tests failed.
FAILED: org.apache.solr.search.TestFiltering.testRandomFiltering
Error Message:
java.lang.AssertionError: FAILURE: indexSize=55 iiter=3 qiter=119 request=[q, {!cache=false cost=74 tag=t} -val_i:0 -val_i:3 -val_i:4 -val_i:5 -val_i:7 -val_i:10 -val_i:11 -val_i:14 -val_i:17 -val_i:18 -val_i:21 -val_i:23 -val_i:24 -val_i:28 -val_i:29 -val_i:31 -val_i:33 -val_i:34 -val_i:35 -val_i:37 -val_i:38 -val_i:40 -val_i:43 -val_i:47 -val_i:48 -val_i:49 -val_i:50 -val_i:51 -val_i:52 -val_i:53, fq, {!cache=true tag=t} val_i:3 val_i:9 val_i:11 val_i:13 val_i:16 val_i:17 val_i:18 val_i:19 val_i:21 val_i:22 val_i:24 val_i:25 val_i:27 val_i:28 val_i:29 val_i:32 val_i:34 val_i:36 val_i:39 val_i:41 val_i:42 val_i:44 val_i:46 val_i:48 val_i:50 val_i:51 val_i:52, fq, {!cache=true} val_i:3 val_i:4 val_i:6 val_i:7 val_i:8 val_i:10 val_i:14 val_i:15 val_i:18 val_i:20 val_i:22 val_i:23 val_i:24 val_i:25 val_i:27 val_i:33 val_i:34 val_i:36 val_i:38 val_i:40 val_i:44 val_i:45 val_i:47 val_i:48 val_i:49 val_i:51, fq, val_s:[00004 TO 00058] OR val_s:{00003 TO 00059}, fq, -_query_:"val_s:{00033 TO 00054]"]
Stack Trace:
java.lang.AssertionError: FAILURE: indexSize=55 iiter=3 qiter=119 request=[q, {!cache=false cost=74 tag=t} -val_i:0 -val_i:3 -val_i:4 -val_i:5 -val_i:7 -val_i:10 -val_i:11 -val_i:14 -val_i:17 -val_i:18 -val_i:21 -val_i:23 -val_i:24 -val_i:28 -val_i:29 -val_i:31 -val_i:33 -val_i:34 -val_i:35 -val_i:37 -val_i:38 -val_i:40 -val_i:43 -val_i:47 -val_i:48 -val_i:49 -val_i:50 -val_i:51 -val_i:52 -val_i:53, fq, {!cache=true tag=t} val_i:3 val_i:9 val_i:11 val_i:13 val_i:16 val_i:17 val_i:18 val_i:19 val_i:21 val_i:22 val_i:24 val_i:25 val_i:27 val_i:28 val_i:29 val_i:32 val_i:34 val_i:36 val_i:39 val_i:41 val_i:42 val_i:44 val_i:46 val_i:48 val_i:50 val_i:51 val_i:52, fq, {!cache=true} val_i:3 val_i:4 val_i:6 val_i:7 val_i:8 val_i:10 val_i:14 val_i:15 val_i:18 val_i:20 val_i:22 val_i:23 val_i:24 val_i:25 val_i:27 val_i:33 val_i:34 val_i:36 val_i:38 val_i:40 val_i:44 val_i:45 val_i:47 val_i:48 val_i:49 val_i:51, fq, val_s:[00004 TO 00058] OR val_s:{00003 TO 00059}, fq, -_query_:"val_s:{00033 TO 00054]"]
at __randomizedtesting.SeedInfo.seed([B6D306CEBD235720:A9B0A50B58041729]:0)
at org.junit.Assert.fail(Assert.java:89)
at org.apache.solr.search.TestFiltering.testRandomFiltering(TestFiltering.java:576)
at java.base/jdk.internal.reflect.NativeMethodAccessorImpl.invoke0(Native Method)
at java.base/jdk.internal.reflect.NativeMethodAccessorImpl.invoke(NativeMethodAccessorImpl.java:62)
at java.base/jdk.internal.reflect.DelegatingMethodAccessorImpl.invoke(DelegatingMethodAccessorImpl.java:43)
at java.base/java.lang.reflect.Method.invoke(Method.java:566)
at com.carrotsearch.randomizedtesting.RandomizedRunner.invoke(RandomizedRunner.java:1758)
at com.carrotsearch.randomizedtesting.RandomizedRunner$8.evaluate(RandomizedRunner.java:946)
at com.carrotsearch.randomizedtesting.RandomizedRunner$9.evaluate(RandomizedRunner.java:982)
at com.carrotsearch.randomizedtesting.RandomizedRunner$10.evaluate(RandomizedRunner.java:996)
at com.carrotsearch.randomizedtesting.rules.SystemPropertiesRestoreRule$1.evaluate(SystemPropertiesRestoreRule.java:80)
at org.junit.rules.RunRules.evaluate(RunRules.java:20)
at org.apache.lucene.tests.util.TestRuleSetupTeardownChained$1.evaluate(TestRuleSetupTeardownChained.java:48)
at org.apache.lucene.tests.util.AbstractBeforeAfterRule$1.evaluate(AbstractBeforeAfterRule.java:43)
at org.apache.lucene.tests.util.TestRuleThreadAndTestName$1.evaluate(TestRuleThreadAndTestName.java:45)
at org.apache.lucene.tests.util.TestRuleIgnoreAfterMaxFailures$1.evaluate(TestRuleIgnoreAfterMaxFailures.java:60)
at org.apache.lucene.tests.util.TestRuleMarkFailure$1.evaluate(TestRuleMarkFailure.java:44)
at org.junit.rules.RunRules.evaluate(RunRules.java:20)
at com.carrotsearch.randomizedtesting.rules.StatementAdapter.evaluate(StatementAdapter.java:36)
at com.carrotsearch.randomizedtesting.ThreadLeakControl$StatementRunner.run(ThreadLeakControl.java:390)
at com.carrotsearch.randomizedtesting.ThreadLeakControl.forkTimeoutingTask(ThreadLeakControl.java:843)
at com.carrotsearch.randomizedtesting.ThreadLeakControl$3.evaluate(ThreadLeakControl.java:490)
at com.carrotsearch.randomizedtesting.RandomizedRunner.runSingleTest(RandomizedRunner.java:955)
at com.carrotsearch.randomizedtesting.RandomizedRunner$5.evaluate(RandomizedRunner.java:840)
at com.carrotsearch.randomizedtesting.RandomizedRunner$6.evaluate(RandomizedRunner.java:891)
at com.carrotsearch.randomizedtesting.RandomizedRunner$7.evaluate(RandomizedRunner.java:902)
at com.carrotsearch.randomizedtesting.rules.StatementAdapter.evaluate(StatementAdapter.java:36)
at com.carrotsearch.randomizedtesting.rules.StatementAdapter.evaluate(StatementAdapter.java:36)
at org.apache.lucene.tests.util.AbstractBeforeAfterRule$1.evaluate(AbstractBeforeAfterRule.java:43)
at org.apache.lucene.tests.util.AbstractBeforeAfterRule$1.evaluate(AbstractBeforeAfterRule.java:43)
at com.carrotsearch.randomizedtesting.rules.SystemPropertiesRestoreRule$1.evaluate(SystemPropertiesRestoreRule.java:80)
at org.junit.rules.RunRules.evaluate(RunRules.java:20)
at org.apache.lucene.tests.util.AbstractBeforeAfterRule$1.evaluate(AbstractBeforeAfterRule.java:43)
at com.carrotsearch.randomizedtesting.rules.StatementAdapter.evaluate(StatementAdapter.java:36)
at org.apache.lucene.tests.util.TestRuleStoreClassName$1.evaluate(TestRuleStoreClassName.java:38)
at com.carrotsearch.randomizedtesting.rules.NoShadowingOrOverridesOnMethodsRule$1.evaluate(NoShadowingOrOverridesOnMethodsRule.java:40)
at com.carrotsearch.randomizedtesting.rules.NoShadowingOrOverridesOnMethodsRule$1.evaluate(NoShadowingOrOverridesOnMethodsRule.java:40)
at com.carrotsearch.randomizedtesting.rules.StatementAdapter.evaluate(StatementAdapter.java:36)
at com.carrotsearch.randomizedtesting.rules.StatementAdapter.evaluate(StatementAdapter.java:36)
at org.apache.lucene.tests.util.TestRuleAssertionsRequired$1.evaluate(TestRuleAssertionsRequired.java:53)
at org.apache.lucene.tests.util.AbstractBeforeAfterRule$1.evaluate(AbstractBeforeAfterRule.java:43)
at org.apache.lucene.tests.util.TestRuleMarkFailure$1.evaluate(TestRuleMarkFailure.java:44)
at org.apache.lucene.tests.util.TestRuleIgnoreAfterMaxFailures$1.evaluate(TestRuleIgnoreAfterMaxFailures.java:60)
at org.apache.lucene.tests.util.TestRuleIgnoreTestSuites$1.evaluate(TestRuleIgnoreTestSuites.java:47)
at org.junit.rules.RunRules.evaluate(RunRules.java:20)
at com.carrotsearch.randomizedtesting.rules.StatementAdapter.evaluate(StatementAdapter.java:36)
at com.carrotsearch.randomizedtesting.ThreadLeakControl$StatementRunner.run(ThreadLeakControl.java:390)
at com.carrotsearch.randomizedtesting.ThreadLeakControl.lambda$forkTimeoutingTask$0(ThreadLeakControl.java:850)
at java.base/java.lang.Thread.run(Thread.java:829)
Build Log:
[...truncated 3560 lines...]
ERROR: The following test(s) have failed:
- org.apache.solr.search.TestFiltering.testRandomFiltering (:solr:core)
Test output: /home/jenkins/jenkins-slave/workspace/Solr/Solr-check-9.4/solr/core/build/test-results/test/outputs/OUTPUT-org.apache.solr.search.TestFiltering.txt
Reproduce with: gradlew :solr:core:test --tests "org.apache.solr.search.TestFiltering.testRandomFiltering" -Ptests.jvms=4 -Ptests.haltonfailure=false "-Ptests.jvmargs=-XX:TieredStopAtLevel=1 -XX:+UseParallelGC -XX:ActiveProcessorCount=1 -XX:ReservedCodeCacheSize=120m" -Ptests.seed=B6D306CEBD235720 -Ptests.multiplier=2 -Ptests.badapples=false -Ptests.file.encoding=UTF-8
Deprecated Gradle features were used in this build, making it incompatible with Gradle 8.0.
You can use '--warning-mode all' to show the individual deprecation warnings and determine if they come from your own scripts or plugins.
See https://docs.gradle.org/7.6/userguide/command_line_interface.html#sec:command_line_warnings
BUILD SUCCESSFUL in 1h 2m 18s
672 actionable tasks: 672 executed
Publishing build scan...
https://ge.apache.org/s/kb262p3drt2va
Build step 'Invoke Gradle script' changed build result to SUCCESS
Archiving artifacts
hudson.FilePath$ValidateAntFileMask$1Cancel
at hudson.FilePath$ValidateAntFileMask$1.isCaseSensitive(FilePath.java:3300)
at org.apache.tools.ant.DirectoryScanner.isIncluded(DirectoryScanner.java:1370)
at org.apache.tools.ant.DirectoryScanner.scandir(DirectoryScanner.java:1241)
at org.apache.tools.ant.DirectoryScanner.scandir(DirectoryScanner.java:1267)
at org.apache.tools.ant.DirectoryScanner.scandir(DirectoryScanner.java:1267)
at org.apache.tools.ant.DirectoryScanner.scandir(DirectoryScanner.java:1267)
at org.apache.tools.ant.DirectoryScanner.scandir(DirectoryScanner.java:1267)
at org.apache.tools.ant.DirectoryScanner.scandir(DirectoryScanner.java:1267)
at org.apache.tools.ant.DirectoryScanner.scandir(DirectoryScanner.java:1267)
at org.apache.tools.ant.DirectoryScanner.scandir(DirectoryScanner.java:1267)
at org.apache.tools.ant.DirectoryScanner.scandir(DirectoryScanner.java:1267)
at org.apache.tools.ant.DirectoryScanner.scandir(DirectoryScanner.java:1267)
at org.apache.tools.ant.DirectoryScanner.scandir(DirectoryScanner.java:1267)
at org.apache.tools.ant.DirectoryScanner.scandir(DirectoryScanner.java:1194)
at org.apache.tools.ant.DirectoryScanner.scandir(DirectoryScanner.java:1156)
at org.apache.tools.ant.DirectoryScanner.checkIncludePatterns(DirectoryScanner.java:954)
at org.apache.tools.ant.DirectoryScanner.scan(DirectoryScanner.java:912)
at hudson.FilePath$ValidateAntFileMask.hasMatch(FilePath.java:3313)
Caused: hudson.FilePath$FileMaskNoMatchesFoundException: no matches found within 10000
at hudson.FilePath$ValidateAntFileMask.hasMatch(FilePath.java:3318)
at hudson.FilePath$ValidateAntFileMask.invoke(FilePath.java:3196)
at hudson.FilePath$ValidateAntFileMask.invoke(FilePath.java:3174)
at hudson.FilePath$FileCallableWrapper.call(FilePath.java:3578)
Also: hudson.remoting.Channel$CallSiteStackTrace: Remote call to lucene-solr-2
at hudson.remoting.Channel.attachCallSiteStackTrace(Channel.java:1784)
at hudson.remoting.UserRequest$ExceptionResponse.retrieve(UserRequest.java:356)
at hudson.remoting.Channel.call(Channel.java:1000)
at hudson.FilePath.act(FilePath.java:1192)
at hudson.FilePath.act(FilePath.java:1181)
at hudson.FilePath.validateAntFileMask(FilePath.java:3171)
at hudson.tasks.ArtifactArchiver.perform(ArtifactArchiver.java:271)
at hudson.tasks.BuildStepCompatibilityLayer.perform(BuildStepCompatibilityLayer.java:80)
at hudson.tasks.BuildStepMonitor$1.perform(BuildStepMonitor.java:20)
at hudson.model.AbstractBuild$AbstractBuildExecution.perform(AbstractBuild.java:818)
at hudson.model.AbstractBuild$AbstractBuildExecution.performAllBuildSteps(AbstractBuild.java:767)
at hudson.model.Build$BuildExecution.post2(Build.java:179)
at hudson.model.AbstractBuild$AbstractBuildExecution.post(AbstractBuild.java:711)
at hudson.model.Run.execute(Run.java:1925)
at hudson.model.FreeStyleBuild.run(FreeStyleBuild.java:44)
at hudson.model.ResourceController.execute(ResourceController.java:101)
at hudson.model.Executor.run(Executor.java:442)
Caused: hudson.FilePath$TunneledInterruptedException
at hudson.FilePath$FileCallableWrapper.call(FilePath.java:3580)
at hudson.remoting.UserRequest.perform(UserRequest.java:211)
at hudson.remoting.UserRequest.perform(UserRequest.java:54)
at hudson.remoting.Request$2.run(Request.java:377)
at hudson.remoting.InterceptingExecutorService.lambda$wrap$0(InterceptingExecutorService.java:78)
at java.base/java.util.concurrent.FutureTask.run(FutureTask.java:264)
at java.base/java.util.concurrent.ThreadPoolExecutor.runWorker(ThreadPoolExecutor.java:1128)
at java.base/java.util.concurrent.ThreadPoolExecutor$Worker.run(ThreadPoolExecutor.java:628)
at java.base/java.lang.Thread.run(Thread.java:829)
Caused: java.lang.InterruptedException: hudson.FilePath$FileMaskNoMatchesFoundException: no matches found within 10000
at hudson.FilePath.act(FilePath.java:1194)
at hudson.FilePath.act(FilePath.java:1181)
at hudson.FilePath.validateAntFileMask(FilePath.java:3171)
at hudson.tasks.ArtifactArchiver.perform(ArtifactArchiver.java:271)
at hudson.tasks.BuildStepCompatibilityLayer.perform(BuildStepCompatibilityLayer.java:80)
at hudson.tasks.BuildStepMonitor$1.perform(BuildStepMonitor.java:20)
at hudson.model.AbstractBuild$AbstractBuildExecution.perform(AbstractBuild.java:818)
at hudson.model.AbstractBuild$AbstractBuildExecution.performAllBuildSteps(AbstractBuild.java:767)
at hudson.model.Build$BuildExecution.post2(Build.java:179)
at hudson.model.AbstractBuild$AbstractBuildExecution.post(AbstractBuild.java:711)
at hudson.model.Run.execute(Run.java:1925)
at hudson.model.FreeStyleBuild.run(FreeStyleBuild.java:44)
at hudson.model.ResourceController.execute(ResourceController.java:101)
at hudson.model.Executor.run(Executor.java:442)
No artifacts found that match the file pattern "**/*.events,heapdumps/**,**/hs_err_pid*". Configuration error?
Recording test results
[Checks API] No suitable checks publisher found.
Build step 'Publish JUnit test result report' changed build result to UNSTABLE
Email was triggered for: Unstable (Test Failures)
Sending email for trigger: Unstable (Test Failures)
[JENKINS] Solr » Solr-check-9.4 - Build # 994 - Failure!
Posted by Apache Jenkins Server <je...@builds.apache.org>.
Build: https://ci-builds.apache.org/job/Solr/job/Solr-check-9.4/994/
All tests passed
Build Log:
[...truncated 1192 lines...]
# ERROR: Did not see Solr at http://localhost:43378/solr come online within 30 seconds!
#
# Please find the SOLR_HOME snapshot for failed test #1 at: /home/jenkins/jenkins-slave/workspace/Solr/Solr-check-9.4/solr/packaging/build/test-output/failure-snapshots/18-1
ok 19 Check export command in 22634ms
ok 20 export fails on non cloud mode in 11218ms
ok 21 using curl to extract a single pdf file in 16933ms
ok 22 using the bin/solr post tool to extract content from pdf in 22604ms
ok 23 using the bin/solr post tool to crawl web site in 20613ms
ok 24 healthcheck on cloud solr in 30271ms
ok 25 start help flag prints help in 182ms
ok 26 stop help flag prints help in 169ms
ok 27 restart help flag prints help in 173ms
ok 28 status help flag prints help in 53ms # skip Currently the status -help flag doesn't return nice help text!
ok 29 healthcheck help flag prints help in 161ms
ok 30 create help flag prints help in 162ms
ok 31 createcore help flag prints help in 173ms
ok 32 createcollection help flag prints help in 165ms
ok 33 delete help flag prints help in 162ms
ok 34 version help flag prints help in 54ms # skip Currently the version -help flag doesn't return nice help text!
ok 35 zk help flag prints help in 169ms
ok 36 auth help flag prints help in 170ms
ok 37 assert help flag prints help in 975ms
ok 38 post help flag prints help in 941ms
ok 39 SQL Module in 17890ms
ok 40 Hadoop-Auth Module: KerberosPlugin Classloading in 20307ms
ok 41 icu collation in analysis-extras module in 13008ms
ok 42 package detects no running solr in 265ms
ok 43 lifecycle of package in 9973ms
ok 44 deploying and undeploying a collection level package in 13743ms
ok 45 Affinity placement plugin using sysprop in 18270ms
ok 46 Random placement plugin using ENV in 17046ms
ok 47 Check help command in 3972ms
ok 48 basic post with a type specified in 5530ms
ok 49 basic post WITHOUT a type specified in 12104ms
ok 50 crawling a directory in 4691ms
ok 51 crawling a web site in 4677ms
ok 52 commit and optimize and delete in 3996ms
ok 53 args mode in 6644ms
ok 54 stdin mode in 3531ms
ok 55 post solr log into solr via script in 12390ms
ok 56 post solr log into solr via cli in 7277ms
ok 57 allowPaths - backup in 16176ms
ok 58 start solr with ssl in 18788ms
ok 59 use different hostname when not checking peer-name in 31523ms
ok 60 start solr with ssl and auth in 16520ms
ok 61 start solr with client truststore and security manager in 19876ms
ok 62 start solr with mTLS needed in 66175ms
ok 63 start solr with mTLS wanted in 50070ms
ok 64 SOLR-11740 check 'solr stop' connection in 14061ms
ok 65 stop command for single port in 17318ms
ok 66 status detects locally running solr in 8054ms
ok 67 status does not expose cli parameters to end user in 247ms
ok 68 listing out files in 3724ms
ok 69 copying files around in 8645ms
ok 70 upconfig in 3860ms
ok 71 zkcli.sh gets 'solrhome' from 'solr.home' system property in 1226ms
ok 72 zkcli.sh gets 'solrhome' from 'solrhome' command line option in 1223ms
ok 73 Cleanup in 1254ms
> Task :solr:packaging:integrationTests FAILED
FAILURE: Build failed with an exception.
* Where:
Build file '/home/jenkins/jenkins-slave/workspace/Solr/Solr-check-9.4/solr/packaging/build.gradle' line: 301
* What went wrong:
Execution failed for task ':solr:packaging:integrationTests'.
> Process 'command '/home/jenkins/jenkins-slave/workspace/Solr/Solr-check-9.4/.gradle/node/packaging/node_modules/bats/bin/bats'' finished with non-zero exit value 1
* Try:
> Run with --stacktrace option to get the stack trace.
> Run with --info or --debug option to get more log output.
* Get more help at https://help.gradle.org
Deprecated Gradle features were used in this build, making it incompatible with Gradle 8.0.
You can use '--warning-mode all' to show the individual deprecation warnings and determine if they come from your own scripts or plugins.
See https://docs.gradle.org/7.6/userguide/command_line_interface.html#sec:command_line_warnings
BUILD FAILED in 1h 6m 35s
672 actionable tasks: 672 executed
Publishing build scan...
https://ge.apache.org/s/bkip4wac4ijrk
Build step 'Invoke Gradle script' changed build result to FAILURE
Build step 'Invoke Gradle script' marked build as failure
Archiving artifacts
Recording test results
[Checks API] No suitable checks publisher found.
Email was triggered for: Failure - Any
Sending email for trigger: Failure - Any