You are viewing a plain text version of this content. The canonical link for it is here.
Posted to builds@beam.apache.org by Apache Jenkins Server <je...@builds.apache.org> on 2023/04/14 04:58:30 UTC
Build failed in Jenkins: beam_PostCommit_Python38 #3974
See <https://ci-beam.apache.org/job/beam_PostCommit_Python38/3974/display/redirect>
Changes:
------------------------------------------
[...truncated 11.91 MB...]
apache_beam/io/gcp/big_query_query_to_table_it_test.py: 4 warnings
apache_beam/io/gcp/bigquery_read_it_test.py: 7 warnings
apache_beam/io/gcp/bigquery_io_read_it_test.py: 2 warnings
apache_beam/io/gcp/bigquery_json_it_test.py: 3 warnings
<https://ci-beam.apache.org/job/beam_PostCommit_Python38/ws/src/sdks/python/apache_beam/io/gcp/bigquery.py>:2691: BeamDeprecationWarning: options is deprecated since First stable release. References to <pipeline>.options will not be supported
pipeline_options=pcoll.pipeline.options,
apache_beam/dataframe/io_it_test.py: 2 warnings
apache_beam/io/gcp/bigquery_json_it_test.py: 1 warning
apache_beam/io/gcp/bigquery_read_it_test.py: 9 warnings
<https://ci-beam.apache.org/job/beam_PostCommit_Python38/ws/src/sdks/python/apache_beam/io/gcp/bigquery.py>:2709: BeamDeprecationWarning: options is deprecated since First stable release. References to <pipeline>.options will not be supported
project_id = pcoll.pipeline.options.view_as(GoogleCloudOptions).project
apache_beam/dataframe/io_it_test.py: 2 warnings
apache_beam/io/gcp/bigquery_json_it_test.py: 1 warning
apache_beam/io/gcp/bigquery_read_it_test.py: 9 warnings
<https://ci-beam.apache.org/job/beam_PostCommit_Python38/ws/src/sdks/python/apache_beam/io/gcp/bigquery.py>:2730: BeamDeprecationWarning: options is deprecated since First stable release. References to <pipeline>.options will not be supported
pipeline_options=pcoll.pipeline.options,
apache_beam/examples/cookbook/bigquery_tornadoes_it_test.py: 1 warning
apache_beam/io/gcp/big_query_query_to_table_it_test.py: 4 warnings
apache_beam/io/gcp/bigquery_write_it_test.py: 4 warnings
apache_beam/io/gcp/bigquery_test.py: 2 warnings
<https://ci-beam.apache.org/job/beam_PostCommit_Python38/ws/src/sdks/python/apache_beam/io/gcp/bigquery.py>:2026: BeamDeprecationWarning: options is deprecated since First stable release. References to <pipeline>.options will not be supported
self.table_reference.projectId = pcoll.pipeline.options.view_as(
apache_beam/examples/cookbook/bigquery_tornadoes_it_test.py: 1 warning
apache_beam/examples/complete/game/hourly_team_score_it_test.py: 1 warning
apache_beam/examples/complete/game/game_stats_it_test.py: 2 warnings
apache_beam/io/gcp/big_query_query_to_table_it_test.py: 4 warnings
apache_beam/examples/complete/game/leader_board_it_test.py: 2 warnings
apache_beam/io/gcp/bigquery_file_loads_test.py: 3 warnings
apache_beam/io/gcp/bigquery_write_it_test.py: 4 warnings
apache_beam/io/gcp/bigquery_json_it_test.py: 2 warnings
apache_beam/io/gcp/bigquery_test.py: 6 warnings
<https://ci-beam.apache.org/job/beam_PostCommit_Python38/ws/src/sdks/python/apache_beam/io/gcp/bigquery.py>:2030: BeamDeprecationWarning: options is deprecated since First stable release. References to <pipeline>.options will not be supported
is_streaming_pipeline = p.options.view_as(StandardOptions).streaming
apache_beam/examples/cookbook/bigquery_tornadoes_it_test.py: 1 warning
apache_beam/examples/complete/game/hourly_team_score_it_test.py: 1 warning
apache_beam/examples/complete/game/game_stats_it_test.py: 2 warnings
apache_beam/io/gcp/big_query_query_to_table_it_test.py: 4 warnings
apache_beam/examples/complete/game/leader_board_it_test.py: 2 warnings
apache_beam/io/gcp/bigquery_file_loads_test.py: 3 warnings
apache_beam/io/gcp/bigquery_write_it_test.py: 4 warnings
apache_beam/io/gcp/bigquery_json_it_test.py: 2 warnings
apache_beam/io/gcp/bigquery_test.py: 6 warnings
<https://ci-beam.apache.org/job/beam_PostCommit_Python38/ws/src/sdks/python/apache_beam/io/gcp/bigquery.py>:2036: BeamDeprecationWarning: options is deprecated since First stable release. References to <pipeline>.options will not be supported
experiments = p.options.view_as(DebugOptions).experiments or []
apache_beam/examples/cookbook/bigquery_tornadoes_it_test.py: 1 warning
apache_beam/io/gcp/big_query_query_to_table_it_test.py: 4 warnings
apache_beam/io/gcp/bigquery_file_loads_test.py: 3 warnings
apache_beam/io/gcp/bigquery_write_it_test.py: 3 warnings
apache_beam/io/gcp/bigquery_test.py: 3 warnings
<https://ci-beam.apache.org/job/beam_PostCommit_Python38/ws/src/sdks/python/apache_beam/io/gcp/bigquery_file_loads.py>:1166: BeamDeprecationWarning: options is deprecated since First stable release. References to <pipeline>.options will not be supported
self.project = self.project or p.options.view_as(GoogleCloudOptions).project
apache_beam/examples/cookbook/bigquery_tornadoes_it_test.py: 1 warning
apache_beam/examples/complete/game/hourly_team_score_it_test.py: 1 warning
apache_beam/io/gcp/big_query_query_to_table_it_test.py: 4 warnings
apache_beam/io/gcp/bigquery_file_loads_test.py: 3 warnings
apache_beam/io/gcp/bigquery_write_it_test.py: 3 warnings
apache_beam/io/gcp/bigquery_test.py: 3 warnings
<https://ci-beam.apache.org/job/beam_PostCommit_Python38/ws/src/sdks/python/apache_beam/io/gcp/bigquery_file_loads.py>:1173: BeamDeprecationWarning: options is deprecated since First stable release. References to <pipeline>.options will not be supported
temp_location = p.options.view_as(GoogleCloudOptions).temp_location
apache_beam/examples/cookbook/bigquery_tornadoes_it_test.py: 1 warning
apache_beam/examples/complete/game/hourly_team_score_it_test.py: 1 warning
apache_beam/io/gcp/big_query_query_to_table_it_test.py: 4 warnings
apache_beam/io/gcp/bigquery_file_loads_test.py: 3 warnings
apache_beam/io/gcp/bigquery_write_it_test.py: 3 warnings
apache_beam/io/gcp/bigquery_test.py: 3 warnings
<https://ci-beam.apache.org/job/beam_PostCommit_Python38/ws/src/sdks/python/apache_beam/io/gcp/bigquery_file_loads.py>:1175: BeamDeprecationWarning: options is deprecated since First stable release. References to <pipeline>.options will not be supported
p.options.view_as(GoogleCloudOptions).job_name or 'AUTOMATIC_JOB_NAME')
apache_beam/examples/cookbook/bigquery_tornadoes_it_test.py::BigqueryTornadoesIT::test_bigquery_tornadoes_it
<https://ci-beam.apache.org/job/beam_PostCommit_Python38/ws/src/sdks/python/apache_beam/io/gcp/tests/utils.py>:100: PendingDeprecationWarning: Client.dataset is deprecated and will be removed in a future version. Use a string like 'my_project.my_dataset' or a cloud.google.bigquery.DatasetReference object, instead.
table_ref = client.dataset(dataset_id).table(table_id)
apache_beam/examples/complete/game/hourly_team_score_it_test.py::HourlyTeamScoreIT::test_hourly_team_score_it
apache_beam/examples/complete/game/game_stats_it_test.py::GameStatsIT::test_game_stats_it
apache_beam/examples/complete/game/leader_board_it_test.py::LeaderBoardIT::test_leader_board_it
apache_beam/io/gcp/bigquery_test.py::PubSubBigQueryIT::test_file_loads
apache_beam/io/gcp/bigquery_test.py::PubSubBigQueryIT::test_streaming_inserts
<https://ci-beam.apache.org/job/beam_PostCommit_Python38/ws/src/sdks/python/apache_beam/io/gcp/tests/utils.py>:63: PendingDeprecationWarning: Client.dataset is deprecated and will be removed in a future version. Use a string like 'my_project.my_dataset' or a cloud.google.bigquery.DatasetReference object, instead.
dataset_ref = client.dataset(unique_dataset_name, project=project)
apache_beam/examples/dataframe/flight_delays_it_test.py::FlightDelaysTest::test_flight_delays
<https://ci-beam.apache.org/job/beam_PostCommit_Python38/ws/src/sdks/python/apache_beam/examples/dataframe/flight_delays.py>:47: FutureWarning: The default value of numeric_only in DataFrame.mean is deprecated. In a future version, it will default to False. In addition, specifying 'numeric_only=None' is deprecated. Select only valid columns or specify the value of numeric_only to silence this warning.
return airline_df[at_top_airports].mean()
apache_beam/examples/dataframe/flight_delays_it_test.py::FlightDelaysTest::test_flight_delays
apache_beam/examples/dataframe/taxiride_it_test.py::TaxirideIT::test_aggregation
apache_beam/examples/dataframe/taxiride_it_test.py::TaxirideIT::test_enrich
<https://ci-beam.apache.org/job/beam_PostCommit_Python38/ws/src/sdks/python/apache_beam/dataframe/io.py>:659: FutureWarning: WriteToFiles is experimental.
return pcoll | fileio.WriteToFiles(
apache_beam/examples/dataframe/flight_delays_it_test.py::FlightDelaysTest::test_flight_delays
apache_beam/examples/dataframe/taxiride_it_test.py::TaxirideIT::test_aggregation
apache_beam/examples/dataframe/taxiride_it_test.py::TaxirideIT::test_enrich
<https://ci-beam.apache.org/job/beam_PostCommit_Python38/ws/src/sdks/python/apache_beam/io/fileio.py>:596: BeamDeprecationWarning: options is deprecated since First stable release. References to <pipeline>.options will not be supported
p.options.view_as(GoogleCloudOptions).temp_location or
apache_beam/io/gcp/bigquery_read_it_test.py::ReadTests::test_native_source
<https://ci-beam.apache.org/job/beam_PostCommit_Python38/ws/src/sdks/python/apache_beam/io/gcp/bigquery_read_it_test.py>:170: BeamDeprecationWarning: BigQuerySource is deprecated since 2.25.0. Use ReadFromBigQuery instead.
beam.io.BigQuerySource(query=self.query, use_standard_sql=True)))
apache_beam/io/gcp/bigquery_test.py::BigQueryStreamingInsertTransformIntegrationTests::test_multiple_destinations_transform
<https://ci-beam.apache.org/job/beam_PostCommit_Python38/ws/src/sdks/python/apache_beam/io/gcp/bigquery_test.py>:1694: BeamDeprecationWarning: options is deprecated since First stable release. References to <pipeline>.options will not be supported
streaming = self.test_pipeline.options.view_as(StandardOptions).streaming
apache_beam/ml/gcp/cloud_dlp_it_test.py::CloudDLPIT::test_deidentification
<https://ci-beam.apache.org/job/beam_PostCommit_Python38/ws/src/sdks/python/apache_beam/ml/gcp/cloud_dlp_it_test.py>:74: FutureWarning: MaskDetectedDetails is experimental.
| MaskDetectedDetails(
apache_beam/ml/gcp/cloud_dlp_it_test.py::CloudDLPIT::test_inspection
<https://ci-beam.apache.org/job/beam_PostCommit_Python38/ws/src/sdks/python/apache_beam/ml/gcp/cloud_dlp_it_test.py>:85: FutureWarning: InspectForDetails is experimental.
| InspectForDetails(
apache_beam/ml/inference/sklearn_inference_it_test.py::SklearnInference::test_sklearn_regression
<https://ci-beam.apache.org/job/beam_PostCommit_Python38/ws/src/sdks/python/apache_beam/examples/inference/sklearn_japanese_housing_regression.py>:129: FutureWarning: SklearnModelHandlerPandas is experimental. No backwards-compatibility guarantees.
model_loader = SklearnModelHandlerPandas(
apache_beam/ml/inference/sklearn_inference_it_test.py::SklearnInference::test_sklearn_regression
<https://ci-beam.apache.org/job/beam_PostCommit_Python38/ws/src/build/gradleenv/-1734967051/lib/python3.8/site-packages/dill/_dill.py>:472: FutureWarning: SklearnModelHandlerPandas is experimental. No backwards-compatibility guarantees.
obj = StockUnpickler.load(self)
apache_beam/io/gcp/bigquery_read_it_test.py::ReadNewTypesTests::test_native_source
<https://ci-beam.apache.org/job/beam_PostCommit_Python38/ws/src/sdks/python/apache_beam/io/gcp/bigquery_read_it_test.py>:693: BeamDeprecationWarning: BigQuerySource is deprecated since 2.25.0. Use ReadFromBigQuery instead.
beam.io.BigQuerySource(query=self.query, use_standard_sql=True)))
apache_beam/io/gcp/bigquery_read_it_test.py::ReadAllBQTests::test_read_queries
<https://ci-beam.apache.org/job/beam_PostCommit_Python38/ws/src/sdks/python/apache_beam/io/gcp/bigquery_read_it_test.py>:808: FutureWarning: ReadAllFromBigQuery is experimental.
| beam.io.ReadAllFromBigQuery())
apache_beam/io/gcp/bigquery_read_it_test.py::ReadAllBQTests::test_read_queries
<https://ci-beam.apache.org/job/beam_PostCommit_Python38/ws/src/sdks/python/apache_beam/io/gcp/bigquery.py>:2838: BeamDeprecationWarning: options is deprecated since First stable release. References to <pipeline>.options will not be supported
job_name = pcoll.pipeline.options.view_as(GoogleCloudOptions).job_name
apache_beam/io/gcp/bigquery_read_it_test.py::ReadAllBQTests::test_read_queries
<https://ci-beam.apache.org/job/beam_PostCommit_Python38/ws/src/sdks/python/apache_beam/io/gcp/bigquery.py>:2839: BeamDeprecationWarning: options is deprecated since First stable release. References to <pipeline>.options will not be supported
project = pcoll.pipeline.options.view_as(GoogleCloudOptions).project
apache_beam/io/gcp/bigquery_read_it_test.py::ReadAllBQTests::test_read_queries
<https://ci-beam.apache.org/job/beam_PostCommit_Python38/ws/src/sdks/python/apache_beam/io/gcp/bigquery.py>:2852: BeamDeprecationWarning: options is deprecated since First stable release. References to <pipeline>.options will not be supported
options=pcoll.pipeline.options,
-- Docs: https://docs.pytest.org/en/stable/how-to/capture-warnings.html
- generated xml file: <https://ci-beam.apache.org/job/beam_PostCommit_Python38/ws/src/sdks/python/pytest_postCommitIT-df-py38.xml> -
[36m[1m=========================== short test summary info ============================[0m
[31mFAILED[0m apache_beam/examples/fastavro_it_test.py::[1mFastavroIT::test_avro_it[0m - apache_beam.runners.dataflow.dataflow_runner.DataflowRuntimeException: Dataflow pipeline failed. State: FAILED, Error:
Traceback (most recent call last):
File "apache_beam/runners/common.py", line 1418, in apache_beam.runners.common.DoFnRunner.process
File "apache_beam/runners/common.py", line 625, in apache_beam.runners.common.SimpleInvoker.invoke_process
File "<https://ci-beam.apache.org/job/beam_PostCommit_Python38/ws/src/sdks/python/apache_beam/transforms/core.py",> line 1962, in <lambda>
wrapper = lambda x: [fn(x)]
File "<https://ci-beam.apache.org/job/beam_PostCommit_Python38/ws/src/sdks/python/apache_beam/examples/fastavro_it_test.py",> line 167, in validate_record
assertEqual(record_pcoll_values, fastavro_values)
File "<https://ci-beam.apache.org/job/beam_PostCommit_Python38/ws/src/sdks/python/apache_beam/examples/fastavro_it_test.py",> line 162, in assertEqual
raise BeamAssertException('Assertion failed: %s == %s' % (l, r))
apache_beam.testing.util.BeamAssertException: Assertion failed: [{'label': 'vwx', 'number': 576663, 'number_str': '576663', 'color': 'GREEN'}] == []
During handling of the above exception, another exception occurred:
Traceback (most recent call last):
File "/usr/local/lib/python3.8/site-packages/apache_beam/runners/worker/sdk_worker.py", line 295, in _execute
response = task()
File "/usr/local/lib/python3.8/site-packages/apache_beam/runners/worker/sdk_worker.py", line 370, in <lambda>
lambda: self.create_worker().do_instruction(request), request)
File "/usr/local/lib/python3.8/site-packages/apache_beam/runners/worker/sdk_worker.py", line 629, in do_instruction
return getattr(self, request_type)(
File "/usr/local/lib/python3.8/site-packages/apache_beam/runners/worker/sdk_worker.py", line 667, in process_bundle
bundle_processor.process_bundle(instruction_id))
File "/usr/local/lib/python3.8/site-packages/apache_beam/runners/worker/bundle_processor.py", line 1062, in process_bundle
input_op_by_transform_id[element.transform_id].process_encoded(
File "/usr/local/lib/python3.8/site-packages/apache_beam/runners/worker/bundle_processor.py", line 232, in process_encoded
self.output(decoded_value)
File "apache_beam/runners/worker/operations.py", line 526, in apache_beam.runners.worker.operations.Operation.output
File "apache_beam/runners/worker/operations.py", line 528, in apache_beam.runners.worker.operations.Operation.output
File "apache_beam/runners/worker/operations.py", line 237, in apache_beam.runners.worker.operations.SingletonElementConsumerSet.receive
File "apache_beam/runners/worker/operations.py", line 240, in apache_beam.runners.worker.operations.SingletonElementConsumerSet.receive
File "apache_beam/runners/worker/operations.py", line 907, in apache_beam.runners.worker.operations.DoOperation.process
File "apache_beam/runners/worker/operations.py", line 908, in apache_beam.runners.worker.operations.DoOperation.process
File "apache_beam/runners/common.py", line 1420, in apache_beam.runners.common.DoFnRunner.process
File "apache_beam/runners/common.py", line 1492, in apache_beam.runners.common.DoFnRunner._reraise_augmented
File "apache_beam/runners/common.py", line 1418, in apache_beam.runners.common.DoFnRunner.process
File "apache_beam/runners/common.py", line 624, in apache_beam.runners.common.SimpleInvoker.invoke_process
File "apache_beam/runners/common.py", line 1582, in apache_beam.runners.common._OutputHandler.handle_process_outputs
File "apache_beam/runners/common.py", line 1695, in apache_beam.runners.common._OutputHandler._write_value_to_tag
File "apache_beam/runners/worker/operations.py", line 240, in apache_beam.runners.worker.operations.SingletonElementConsumerSet.receive
File "apache_beam/runners/worker/operations.py", line 907, in apache_beam.runners.worker.operations.DoOperation.process
File "apache_beam/runners/worker/operations.py", line 908, in apache_beam.runners.worker.operations.DoOperation.process
File "apache_beam/runners/common.py", line 1420, in apache_beam.runners.common.DoFnRunner.process
File "apache_beam/runners/common.py", line 1492, in apache_beam.runners.common.DoFnRunner._reraise_augmented
File "apache_beam/runners/common.py", line 1418, in apache_beam.runners.common.DoFnRunner.process
File "apache_beam/runners/common.py", line 624, in apache_beam.runners.common.SimpleInvoker.invoke_process
File "apache_beam/runners/common.py", line 1582, in apache_beam.runners.common._OutputHandler.handle_process_outputs
File "apache_beam/runners/common.py", line 1695, in apache_beam.runners.common._OutputHandler._write_value_to_tag
File "apache_beam/runners/worker/operations.py", line 240, in apache_beam.runners.worker.operations.SingletonElementConsumerSet.receive
File "apache_beam/runners/worker/operations.py", line 907, in apache_beam.runners.worker.operations.DoOperation.process
File "apache_beam/runners/worker/operations.py", line 908, in apache_beam.runners.worker.operations.DoOperation.process
File "apache_beam/runners/common.py", line 1420, in apache_beam.runners.common.DoFnRunner.process
File "apache_beam/runners/common.py", line 1508, in apache_beam.runners.common.DoFnRunner._reraise_augmented
File "apache_beam/runners/common.py", line 1418, in apache_beam.runners.common.DoFnRunner.process
File "apache_beam/runners/common.py", line 625, in apache_beam.runners.common.SimpleInvoker.invoke_process
File "<https://ci-beam.apache.org/job/beam_PostCommit_Python38/ws/src/sdks/python/apache_beam/transforms/core.py",> line 1962, in <lambda>
wrapper = lambda x: [fn(x)]
File "<https://ci-beam.apache.org/job/beam_PostCommit_Python38/ws/src/sdks/python/apache_beam/examples/fastavro_it_test.py",> line 167, in validate_record
assertEqual(record_pcoll_values, fastavro_values)
File "<https://ci-beam.apache.org/job/beam_PostCommit_Python38/ws/src/sdks/python/apache_beam/examples/fastavro_it_test.py",> line 162, in assertEqual
raise BeamAssertException('Assertion failed: %s == %s' % (l, r))
apache_beam.testing.util.BeamAssertException: Assertion failed: [{'label': 'vwx', 'number': 576663, 'number_str': '576663', 'color': 'GREEN'}] == [] [while running 'Map(validate_record)-ptransform-34']
[31m===== [31m[1m1 failed[0m, [32m82 passed[0m, [33m39 skipped[0m, [33m600 warnings[0m[31m in 7830.44s (2:10:30)[0m[31m ======[0m
> Task :sdks:python:test-suites:dataflow:py38:postCommitIT FAILED
FAILURE: Build failed with an exception.
* Where:
Script '<https://ci-beam.apache.org/job/beam_PostCommit_Python38/ws/src/sdks/python/test-suites/dataflow/common.gradle'> line: 141
* What went wrong:
Execution failed for task ':sdks:python:test-suites:dataflow:py38:postCommitIT'.
> Process 'command 'sh'' finished with non-zero exit value 1
* Try:
> Run with --stacktrace option to get the stack trace.
> Run with --info or --debug option to get more log output.
* Get more help at https://help.gradle.org
Deprecated Gradle features were used in this build, making it incompatible with Gradle 8.0.
You can use '--warning-mode all' to show the individual deprecation warnings and determine if they come from your own scripts or plugins.
See https://docs.gradle.org/7.5.1/userguide/command_line_interface.html#sec:command_line_warnings
Execution optimizations have been disabled for 1 invalid unit(s) of work during this build to ensure correctness.
Please consult deprecation warnings for more details.
BUILD FAILED in 2h 43m 1s
214 actionable tasks: 160 executed, 48 from cache, 6 up-to-date
Publishing build scan...
https://gradle.com/s/d6xy6aex3btge
Build step 'Invoke Gradle script' changed build result to FAILURE
Build step 'Invoke Gradle script' marked build as failure
---------------------------------------------------------------------
To unsubscribe, e-mail: builds-unsubscribe@beam.apache.org
For additional commands, e-mail: builds-help@beam.apache.org
Jenkins build is back to normal : beam_PostCommit_Python38 #3975
Posted by Apache Jenkins Server <je...@builds.apache.org>.
See <https://ci-beam.apache.org/job/beam_PostCommit_Python38/3975/display/redirect>
---------------------------------------------------------------------
To unsubscribe, e-mail: builds-unsubscribe@beam.apache.org
For additional commands, e-mail: builds-help@beam.apache.org