You are viewing a plain text version of this content. The canonical link for it is here.
Posted to commits@tomee.apache.org by Apache Jenkins Server <je...@builds.apache.org> on 2025/06/17 05:54:46 UTC

Build failed in Jenkins: TomEE » master-build-full-itests #417

See <https://ci-builds.apache.org/job/Tomee/job/master-build-full-itests/417/display/redirect?page=changes>

Changes:

[Richard Zowalla] [maven-release-plugin] prepare release tomee-project-10.1.0

[Richard Zowalla] [maven-release-plugin] prepare for next development iteration


------------------------------------------
[...truncated 739.21 KiB...]
[INFO] Downloaded from Apache Snapshots: https://repository.apache.org/content/repositories/snapshots/org/apache/tomee/openejb-javaagent/10.1.1-SNAPSHOT/openejb-javaagent-10.1.1-20250617.053311-1.jar (14 kB at 19 kB/s)
[INFO] Downloading from Apache Snapshots: https://repository.apache.org/content/repositories/snapshots/org/apache/tomee/commons-dbcp2-shade/10.1.1-SNAPSHOT/commons-dbcp2-shade-10.1.1-20250617.053311-1.jar
[INFO] Downloaded from Apache Snapshots: https://repository.apache.org/content/repositories/snapshots/org/apache/tomee/openejb-http/10.1.1-SNAPSHOT/openejb-http-10.1.1-20250617.053311-1.jar (134 kB at 126 kB/s)
[INFO] Downloading from Apache Snapshots: https://repository.apache.org/content/repositories/snapshots/org/apache/tomee/openejb-loader/10.1.1-SNAPSHOT/openejb-loader-10.1.1-20250617.053311-1.jar
[INFO] Downloaded from Apache Snapshots: https://repository.apache.org/content/repositories/snapshots/org/apache/tomee/openejb-loader/10.1.1-SNAPSHOT/openejb-loader-10.1.1-20250617.053311-1.jar (120 kB at 97 kB/s)
[INFO] Downloading from Apache Snapshots: https://repository.apache.org/content/repositories/snapshots/org/apache/tomee/openejb-server/10.1.1-SNAPSHOT/openejb-server-10.1.1-20250617.053311-1.jar
[INFO] Downloaded from Apache Snapshots: https://repository.apache.org/content/repositories/snapshots/org/apache/tomee/commons-dbcp2-shade/10.1.1-SNAPSHOT/commons-dbcp2-shade-10.1.1-20250617.053311-1.jar (230 kB at 163 kB/s)
[INFO] Downloading from Apache Snapshots: https://repository.apache.org/content/repositories/snapshots/org/apache/tomee/openejb-client/10.1.1-SNAPSHOT/openejb-client-10.1.1-20250617.053311-1.jar
[INFO] Downloaded from Apache Snapshots: https://repository.apache.org/content/repositories/snapshots/org/apache/tomee/openejb-server/10.1.1-SNAPSHOT/openejb-server-10.1.1-20250617.053311-1.jar (122 kB at 86 kB/s)
[INFO] Downloading from Apache Snapshots: https://repository.apache.org/content/repositories/snapshots/org/apache/tomee/openejb-ejbd/10.1.1-SNAPSHOT/openejb-ejbd-10.1.1-20250617.053311-1.jar
[INFO] Downloaded from Apache Snapshots: https://repository.apache.org/content/repositories/snapshots/org/apache/tomee/openejb-jee/10.1.1-SNAPSHOT/openejb-jee-10.1.1-20250617.053311-1.jar (1.3 MB at 909 kB/s)
[INFO] Downloading from Apache Snapshots: https://repository.apache.org/content/repositories/snapshots/org/apache/tomee/openejb-rest/10.1.1-SNAPSHOT/openejb-rest-10.1.1-20250617.053311-1.jar
[INFO] Downloaded from Apache Snapshots: https://repository.apache.org/content/repositories/snapshots/org/apache/tomee/openejb-jee-accessors/10.1.1-SNAPSHOT/openejb-jee-accessors-10.1.1-20250617.053311-1.jar (1.1 MB at 685 kB/s)
[INFO] Downloading from Apache Snapshots: https://repository.apache.org/content/repositories/snapshots/org/apache/tomee/openejb-cxf-transport/10.1.1-SNAPSHOT/openejb-cxf-transport-10.1.1-20250617.053311-1.jar
[INFO] Downloaded from Apache Snapshots: https://repository.apache.org/content/repositories/snapshots/org/apache/tomee/openejb-ejbd/10.1.1-SNAPSHOT/openejb-ejbd-10.1.1-20250617.053311-1.jar (78 kB at 49 kB/s)
[INFO] Downloaded from Apache Snapshots: https://repository.apache.org/content/repositories/snapshots/org/apache/tomee/openejb-rest/10.1.1-SNAPSHOT/openejb-rest-10.1.1-20250617.053311-1.jar (38 kB at 24 kB/s)
[INFO] Downloaded from Apache Snapshots: https://repository.apache.org/content/repositories/snapshots/org/apache/tomee/openejb-core/10.1.1-SNAPSHOT/openejb-core-10.1.1-20250617.053311-1.jar (3.4 MB at 2.0 MB/s)
[INFO] Downloaded from Apache Snapshots: https://repository.apache.org/content/repositories/snapshots/org/apache/tomee/openejb-cxf-transport/10.1.1-SNAPSHOT/openejb-cxf-transport-10.1.1-20250617.053311-1.jar (28 kB at 16 kB/s)
[INFO] Downloaded from Apache Snapshots: https://repository.apache.org/content/repositories/snapshots/org/apache/tomee/openejb-client/10.1.1-SNAPSHOT/openejb-client-10.1.1-20250617.053311-1.jar (360 kB at 204 kB/s)
[INFO] Downloading from apache-snapshots: https://repository.apache.org/content/groups/snapshots/org/apache/tomee/itest-common/10.1.1-SNAPSHOT/itest-common-10.1.1-SNAPSHOT.jar
[INFO] Downloading from apache-snapshots: https://repository.apache.org/content/groups/snapshots/org/apache/tomee/itest-util/10.1.1-SNAPSHOT/itest-util-10.1.1-SNAPSHOT.jar
[INFO] Downloading from sonatype-snapshots: https://oss.sonatype.org/content/repositories/snapshots/org/apache/tomee/itest-common/10.1.1-SNAPSHOT/itest-common-10.1.1-SNAPSHOT.jar
[INFO] Downloading from sonatype-snapshots: https://oss.sonatype.org/content/repositories/snapshots/org/apache/tomee/itest-util/10.1.1-SNAPSHOT/itest-util-10.1.1-SNAPSHOT.jar
[INFO] Downloading from JBoss Repository: https://repository.jboss.org/nexus/content/groups/public-jboss/org/apache/tomee/itest-common/10.1.1-SNAPSHOT/itest-common-10.1.1-SNAPSHOT.jar
[INFO] Downloading from JBoss Repository: https://repository.jboss.org/nexus/content/groups/public-jboss/org/apache/tomee/itest-util/10.1.1-SNAPSHOT/itest-util-10.1.1-SNAPSHOT.jar
[INFO] Downloading from B_shibboleth: https://build.shibboleth.net/nexus/content/groups/public/org/apache/tomee/itest-common/10.1.1-SNAPSHOT/itest-common-10.1.1-SNAPSHOT.jar
[INFO] Downloading from B_shibboleth: https://build.shibboleth.net/nexus/content/groups/public/org/apache/tomee/itest-util/10.1.1-SNAPSHOT/itest-util-10.1.1-SNAPSHOT.jar
[INFO] 
[INFO] -----------------< org.apache.openejb.itests:failover >-----------------
[INFO] Building TomEE :: iTests :: Failover 10.1.1-SNAPSHOT             [10/14]
[INFO]   from <https://ci-builds.apache.org/job/Tomee/job/master-build-full-itests/ws/itests/failover/pom.xml>
[INFO] --------------------------------[ jar ]---------------------------------
[INFO] Downloading from Apache Snapshots: https://repository.apache.org/content/repositories/snapshots/org/apache/tomee/openejb-standalone/10.1.1-SNAPSHOT/maven-metadata.xml
[INFO] Downloading from apache-snapshots: https://repository.apache.org/content/groups/snapshots/org/apache/tomee/openejb-standalone/10.1.1-SNAPSHOT/maven-metadata.xml
[INFO] Downloading from sonatype-snapshots: https://oss.sonatype.org/content/repositories/snapshots/org/apache/tomee/openejb-standalone/10.1.1-SNAPSHOT/maven-metadata.xml
[INFO] Downloading from JBoss Repository: https://repository.jboss.org/nexus/content/groups/public-jboss/org/apache/tomee/openejb-standalone/10.1.1-SNAPSHOT/maven-metadata.xml
[INFO] Downloading from B_shibboleth: https://build.shibboleth.net/nexus/content/groups/public/org/apache/tomee/openejb-standalone/10.1.1-SNAPSHOT/maven-metadata.xml
[INFO] Downloading from Apache Snapshots: https://repository.apache.org/content/repositories/snapshots/org/apache/tomee/openejb-standalone/10.1.1-SNAPSHOT/openejb-standalone-10.1.1-SNAPSHOT.pom
[INFO] Downloading from apache-snapshots: https://repository.apache.org/content/groups/snapshots/org/apache/tomee/openejb-standalone/10.1.1-SNAPSHOT/openejb-standalone-10.1.1-SNAPSHOT.pom
[INFO] Downloading from sonatype-snapshots: https://oss.sonatype.org/content/repositories/snapshots/org/apache/tomee/openejb-standalone/10.1.1-SNAPSHOT/openejb-standalone-10.1.1-SNAPSHOT.pom
[INFO] Downloading from JBoss Repository: https://repository.jboss.org/nexus/content/groups/public-jboss/org/apache/tomee/openejb-standalone/10.1.1-SNAPSHOT/openejb-standalone-10.1.1-SNAPSHOT.pom
[INFO] Downloading from B_shibboleth: https://build.shibboleth.net/nexus/content/groups/public/org/apache/tomee/openejb-standalone/10.1.1-SNAPSHOT/openejb-standalone-10.1.1-SNAPSHOT.pom
[WARNING] The POM for org.apache.tomee:openejb-standalone:zip:10.1.1-SNAPSHOT is missing, no dependency information available
[INFO] Downloading from Apache Snapshots: https://repository.apache.org/content/repositories/snapshots/org/apache/tomee/arquillian-tomee-common/10.1.1-SNAPSHOT/maven-metadata.xml
[INFO] Downloading from apache-snapshots: https://repository.apache.org/content/groups/snapshots/org/apache/tomee/arquillian-tomee-common/10.1.1-SNAPSHOT/maven-metadata.xml
[INFO] Downloading from sonatype-snapshots: https://oss.sonatype.org/content/repositories/snapshots/org/apache/tomee/arquillian-tomee-common/10.1.1-SNAPSHOT/maven-metadata.xml
[INFO] Downloading from JBoss Repository: https://repository.jboss.org/nexus/content/groups/public-jboss/org/apache/tomee/arquillian-tomee-common/10.1.1-SNAPSHOT/maven-metadata.xml
[INFO] Downloading from B_shibboleth: https://build.shibboleth.net/nexus/content/groups/public/org/apache/tomee/arquillian-tomee-common/10.1.1-SNAPSHOT/maven-metadata.xml
[INFO] Downloading from Apache Snapshots: https://repository.apache.org/content/repositories/snapshots/org/apache/tomee/arquillian-tomee-common/10.1.1-SNAPSHOT/arquillian-tomee-common-10.1.1-SNAPSHOT.pom
[INFO] Downloading from apache-snapshots: https://repository.apache.org/content/groups/snapshots/org/apache/tomee/arquillian-tomee-common/10.1.1-SNAPSHOT/arquillian-tomee-common-10.1.1-SNAPSHOT.pom
[INFO] Downloading from sonatype-snapshots: https://oss.sonatype.org/content/repositories/snapshots/org/apache/tomee/arquillian-tomee-common/10.1.1-SNAPSHOT/arquillian-tomee-common-10.1.1-SNAPSHOT.pom
[INFO] Downloading from JBoss Repository: https://repository.jboss.org/nexus/content/groups/public-jboss/org/apache/tomee/arquillian-tomee-common/10.1.1-SNAPSHOT/arquillian-tomee-common-10.1.1-SNAPSHOT.pom
[INFO] Downloading from B_shibboleth: https://build.shibboleth.net/nexus/content/groups/public/org/apache/tomee/arquillian-tomee-common/10.1.1-SNAPSHOT/arquillian-tomee-common-10.1.1-SNAPSHOT.pom
[WARNING] The POM for org.apache.tomee:arquillian-tomee-common:jar:10.1.1-SNAPSHOT is missing, no dependency information available
[INFO] Downloading from Apache Snapshots: https://repository.apache.org/content/repositories/snapshots/org/apache/tomee/openejb-standalone/10.1.1-SNAPSHOT/openejb-standalone-10.1.1-SNAPSHOT.zip
[INFO] Downloading from Apache Snapshots: https://repository.apache.org/content/repositories/snapshots/org/apache/tomee/arquillian-tomee-common/10.1.1-SNAPSHOT/arquillian-tomee-common-10.1.1-SNAPSHOT.jar
[INFO] Downloading from apache-snapshots: https://repository.apache.org/content/groups/snapshots/org/apache/tomee/openejb-standalone/10.1.1-SNAPSHOT/openejb-standalone-10.1.1-SNAPSHOT.zip
[INFO] Downloading from apache-snapshots: https://repository.apache.org/content/groups/snapshots/org/apache/tomee/arquillian-tomee-common/10.1.1-SNAPSHOT/arquillian-tomee-common-10.1.1-SNAPSHOT.jar
[INFO] Downloading from sonatype-snapshots: https://oss.sonatype.org/content/repositories/snapshots/org/apache/tomee/openejb-standalone/10.1.1-SNAPSHOT/openejb-standalone-10.1.1-SNAPSHOT.zip
[INFO] Downloading from sonatype-snapshots: https://oss.sonatype.org/content/repositories/snapshots/org/apache/tomee/arquillian-tomee-common/10.1.1-SNAPSHOT/arquillian-tomee-common-10.1.1-SNAPSHOT.jar
[INFO] Downloading from JBoss Repository: https://repository.jboss.org/nexus/content/groups/public-jboss/org/apache/tomee/openejb-standalone/10.1.1-SNAPSHOT/openejb-standalone-10.1.1-SNAPSHOT.zip
[INFO] Downloading from JBoss Repository: https://repository.jboss.org/nexus/content/groups/public-jboss/org/apache/tomee/arquillian-tomee-common/10.1.1-SNAPSHOT/arquillian-tomee-common-10.1.1-SNAPSHOT.jar
[INFO] Downloading from B_shibboleth: https://build.shibboleth.net/nexus/content/groups/public/org/apache/tomee/openejb-standalone/10.1.1-SNAPSHOT/openejb-standalone-10.1.1-SNAPSHOT.zip
[INFO] Downloading from B_shibboleth: https://build.shibboleth.net/nexus/content/groups/public/org/apache/tomee/arquillian-tomee-common/10.1.1-SNAPSHOT/arquillian-tomee-common-10.1.1-SNAPSHOT.jar
[INFO] 
[INFO] ------------------------------------------------------------------------
[INFO] Skipping TomEE :: iTests :: Legacy Client
[INFO] This project has been banned from the build due to previous failures.
[INFO] ------------------------------------------------------------------------
[INFO] 
[INFO] ------------------------------------------------------------------------
[INFO] Skipping TomEE :: iTests :: Legacy Server
[INFO] This project has been banned from the build due to previous failures.
[INFO] ------------------------------------------------------------------------
[INFO] 
[INFO] ----------------< org.apache.tomee:openejb-itests-web >-----------------
[INFO] Building TomEE :: iTests :: Web 10.1.1-SNAPSHOT                  [11/14]
[INFO]   from <https://ci-builds.apache.org/job/Tomee/job/master-build-full-itests/ws/itests/openejb-itests-web/pom.xml>
[INFO] --------------------------------[ war ]---------------------------------
[INFO] 
[INFO] --- clean:3.4.1:clean (default-clean) @ openejb-itests-web ---
[INFO] 
[INFO] --- enforcer:3.5.0:enforce (enforce-maven-version) @ openejb-itests-web ---
[INFO] 
[INFO] --- enforcer:3.5.0:enforce (enforce-java-version) @ openejb-itests-web ---
[INFO] 
[INFO] --- remote-resources:3.3.0:process (process-resource-bundles) @ openejb-itests-web ---
[INFO] Preparing remote bundle org.apache.apache.resources:apache-jar-resource-bundle:1.7
[INFO] Copying 3 resources from 1 bundle.
[INFO] 
[INFO] --- resources:3.3.1:resources (default-resources) @ openejb-itests-web ---
[INFO] Copying 0 resource from src/main/resources to target/classes
[INFO] Copying 3 resources from target/maven-shared-archive-resources to target/classes
[INFO] 
[INFO] --- compiler:3.14.0:compile (default-compile) @ openejb-itests-web ---
[INFO] No sources to compile
[INFO] 
[INFO] --- dependency-report:1.0.2:report (default) @ openejb-itests-web ---
[INFO] 
[INFO] --- bundle:6.0.0:manifest (bundle-manifest) @ openejb-itests-web ---
[WARNING] Ignoring project type war - supportedProjectTypes = [bundle, jar, maven-plugin]
[INFO] 
[INFO] --- resources:3.3.1:testResources (default-testResources) @ openejb-itests-web ---
[INFO] skip non existing resourceDirectory <https://ci-builds.apache.org/job/Tomee/job/master-build-full-itests/ws/itests/openejb-itests-web/src/test/resources>
[INFO] Copying 3 resources from target/maven-shared-archive-resources to target/test-classes
[INFO] 
[INFO] --- compiler:3.14.0:testCompile (default-testCompile) @ openejb-itests-web ---
[INFO] No sources to compile
[INFO] 
[INFO] --- surefire:3.5.3:test (default-test) @ openejb-itests-web ---
[JENKINS] Recording test results
[INFO] 
[INFO] --- war:3.4.0:war (default-war) @ openejb-itests-web ---
[INFO] Packaging webapp
[INFO] Assembling webapp [openejb-itests-web] in [<https://ci-builds.apache.org/job/Tomee/job/master-build-full-itests/ws/itests/openejb-itests-web/target/openejb-itests-web-10.1.1-SNAPSHOT]>
[INFO] Processing war project
[INFO] Copying webapp resources [<https://ci-builds.apache.org/job/Tomee/job/master-build-full-itests/ws/itests/openejb-itests-web/src/main/webapp]>
[INFO] Building war: <https://ci-builds.apache.org/job/Tomee/job/master-build-full-itests/ws/itests/openejb-itests-web/target/openejb-itests-web-10.1.1-SNAPSHOT.war>
[INFO] 
[INFO] --- install:3.0.0-M1:install (default-install) @ openejb-itests-web ---
[INFO] Installing <https://ci-builds.apache.org/job/Tomee/job/master-build-full-itests/ws/itests/openejb-itests-web/target/openejb-itests-web-10.1.1-SNAPSHOT.war> to /home/jenkins/.m2/repository/org/apache/tomee/openejb-itests-web/10.1.1-SNAPSHOT/openejb-itests-web-10.1.1-SNAPSHOT.war
[INFO] Installing <https://ci-builds.apache.org/job/Tomee/job/master-build-full-itests/ws/itests/openejb-itests-web/pom.xml> to /home/jenkins/.m2/repository/org/apache/tomee/openejb-itests-web/10.1.1-SNAPSHOT/openejb-itests-web-10.1.1-SNAPSHOT.pom
[INFO] 
[INFO] -------------------< org.apache.tomee.itests:jaxrs >--------------------
[INFO] Building TomEE :: iTests :: JAX-RS 10.1.1-SNAPSHOT               [12/14]
[INFO]   from <https://ci-builds.apache.org/job/Tomee/job/master-build-full-itests/ws/itests/jaxrs/pom.xml>
[INFO] --------------------------------[ jar ]---------------------------------
[INFO] Downloading from Apache Snapshots: https://repository.apache.org/content/repositories/snapshots/org/apache/tomee/bom/tomee-webprofile-api/10.1.1-SNAPSHOT/maven-metadata.xml
[INFO] Downloading from apache-snapshots: https://repository.apache.org/content/groups/snapshots/org/apache/tomee/bom/tomee-webprofile-api/10.1.1-SNAPSHOT/maven-metadata.xml
[INFO] Downloading from sonatype-snapshots: https://oss.sonatype.org/content/repositories/snapshots/org/apache/tomee/bom/tomee-webprofile-api/10.1.1-SNAPSHOT/maven-metadata.xml
[INFO] Downloading from JBoss Repository: https://repository.jboss.org/nexus/content/groups/public-jboss/org/apache/tomee/bom/tomee-webprofile-api/10.1.1-SNAPSHOT/maven-metadata.xml
[INFO] Downloading from B_shibboleth: https://build.shibboleth.net/nexus/content/groups/public/org/apache/tomee/bom/tomee-webprofile-api/10.1.1-SNAPSHOT/maven-metadata.xml
[INFO] Downloading from Apache Snapshots: https://repository.apache.org/content/repositories/snapshots/org/apache/tomee/bom/tomee-webprofile-api/10.1.1-SNAPSHOT/tomee-webprofile-api-10.1.1-SNAPSHOT.pom
[INFO] Downloading from apache-snapshots: https://repository.apache.org/content/groups/snapshots/org/apache/tomee/bom/tomee-webprofile-api/10.1.1-SNAPSHOT/tomee-webprofile-api-10.1.1-SNAPSHOT.pom
[INFO] Downloading from sonatype-snapshots: https://oss.sonatype.org/content/repositories/snapshots/org/apache/tomee/bom/tomee-webprofile-api/10.1.1-SNAPSHOT/tomee-webprofile-api-10.1.1-SNAPSHOT.pom
[INFO] Downloading from JBoss Repository: https://repository.jboss.org/nexus/content/groups/public-jboss/org/apache/tomee/bom/tomee-webprofile-api/10.1.1-SNAPSHOT/tomee-webprofile-api-10.1.1-SNAPSHOT.pom
[INFO] Downloading from B_shibboleth: https://build.shibboleth.net/nexus/content/groups/public/org/apache/tomee/bom/tomee-webprofile-api/10.1.1-SNAPSHOT/tomee-webprofile-api-10.1.1-SNAPSHOT.pom
[WARNING] The POM for org.apache.tomee.bom:tomee-webprofile-api:jar:10.1.1-SNAPSHOT is missing, no dependency information available
[INFO] Downloading from Apache Snapshots: https://repository.apache.org/content/repositories/snapshots/org/apache/tomee/bom/tomee-webprofile-api/10.1.1-SNAPSHOT/tomee-webprofile-api-10.1.1-SNAPSHOT.jar
[INFO] Downloading from apache-snapshots: https://repository.apache.org/content/groups/snapshots/org/apache/tomee/bom/tomee-webprofile-api/10.1.1-SNAPSHOT/tomee-webprofile-api-10.1.1-SNAPSHOT.jar
[INFO] Downloading from sonatype-snapshots: https://oss.sonatype.org/content/repositories/snapshots/org/apache/tomee/bom/tomee-webprofile-api/10.1.1-SNAPSHOT/tomee-webprofile-api-10.1.1-SNAPSHOT.jar
[INFO] Downloading from JBoss Repository: https://repository.jboss.org/nexus/content/groups/public-jboss/org/apache/tomee/bom/tomee-webprofile-api/10.1.1-SNAPSHOT/tomee-webprofile-api-10.1.1-SNAPSHOT.jar
[INFO] Downloading from B_shibboleth: https://build.shibboleth.net/nexus/content/groups/public/org/apache/tomee/bom/tomee-webprofile-api/10.1.1-SNAPSHOT/tomee-webprofile-api-10.1.1-SNAPSHOT.jar
[INFO] ------------------------------------------------------------------------
[INFO] Reactor Summary for TomEE :: iTests :: Beans 10.1.1-SNAPSHOT:
[INFO] 
[INFO] TomEE :: iTests :: Beans ........................... SUCCESS [ 21.388 s]
[INFO] TomEE :: iTests :: Interceptor Beans ............... SUCCESS [  5.229 s]
[INFO] TomEE :: iTests :: Servlets ........................ SUCCESS [  5.370 s]
[INFO] TomEE :: iTests :: Client .......................... SUCCESS [  7.544 s]
[INFO] TomEE :: iTests :: App ............................. SUCCESS [  6.187 s]
[INFO] TomEE :: iTests :: Failover EJB .................... SUCCESS [  5.140 s]
[INFO] TomEE :: iTests :: Server Version .................. SUCCESS [  5.820 s]
[INFO] TomEE :: iTests :: Server Composer ................. SUCCESS [  5.327 s]
[INFO] TomEE :: iTests :: MicroProfile JWT ................ FAILURE [ 28.977 s]
[INFO] TomEE :: iTests :: Failover ........................ FAILURE [  3.924 s]
[INFO] TomEE :: iTests :: Legacy Client ................... SKIPPED
[INFO] TomEE :: iTests :: Legacy Server ................... SKIPPED
[INFO] TomEE :: iTests :: Web ............................. SUCCESS [  5.465 s]
[INFO] TomEE :: iTests :: JAX-RS .......................... FAILURE [  2.310 s]
[INFO] ------------------------------------------------------------------------
[INFO] BUILD FAILURE
[INFO] ------------------------------------------------------------------------
[INFO] Total time:  11:52 min
[INFO] Finished at: 2025-06-17T05:49:19Z
[INFO] ------------------------------------------------------------------------
[WARNING] The requested profile "all-adapters" could not be activated because it does not exist.
Waiting for Jenkins to finish collecting data
[ERROR] Failed to execute goal on project microprofile-jwt-itests: Could not resolve dependencies for project org.apache.tomee:microprofile-jwt-itests:jar:10.1.1-SNAPSHOT
[ERROR] dependency: org.apache.tomee:itest-common:jar:10.1.1-SNAPSHOT (compile)
[ERROR] Could not find artifact org.apache.tomee:itest-common:jar:10.1.1-SNAPSHOT in Apache Snapshots (https://repository.apache.org/content/repositories/snapshots)
[ERROR] Could not find artifact org.apache.tomee:itest-common:jar:10.1.1-SNAPSHOT in apache-snapshots (https://repository.apache.org/content/groups/snapshots)
[ERROR] Could not find artifact org.apache.tomee:itest-common:jar:10.1.1-SNAPSHOT in sonatype-snapshots (https://oss.sonatype.org/content/repositories/snapshots)
[ERROR] Could not find artifact org.apache.tomee:itest-common:jar:10.1.1-SNAPSHOT in JBoss Repository (https://repository.jboss.org/nexus/content/groups/public-jboss)
[ERROR] Could not find artifact org.apache.tomee:itest-common:jar:10.1.1-SNAPSHOT in B_shibboleth (https://build.shibboleth.net/nexus/content/groups/public)
[ERROR] dependency: org.apache.tomee:itest-util:jar:10.1.1-SNAPSHOT (compile)
[ERROR] Could not find artifact org.apache.tomee:itest-util:jar:10.1.1-SNAPSHOT in Apache Snapshots (https://repository.apache.org/content/repositories/snapshots)
[ERROR] Could not find artifact org.apache.tomee:itest-util:jar:10.1.1-SNAPSHOT in apache-snapshots (https://repository.apache.org/content/groups/snapshots)
[ERROR] Could not find artifact org.apache.tomee:itest-util:jar:10.1.1-SNAPSHOT in sonatype-snapshots (https://oss.sonatype.org/content/repositories/snapshots)
[ERROR] Could not find artifact org.apache.tomee:itest-util:jar:10.1.1-SNAPSHOT in JBoss Repository (https://repository.jboss.org/nexus/content/groups/public-jboss)
[ERROR] Could not find artifact org.apache.tomee:itest-util:jar:10.1.1-SNAPSHOT in B_shibboleth (https://build.shibboleth.net/nexus/content/groups/public)
[ERROR] -> [Help 1]
[ERROR] Failed to execute goal on project failover: Could not resolve dependencies for project org.apache.openejb.itests:failover:jar:10.1.1-SNAPSHOT
[ERROR] dependency: org.apache.tomee:openejb-standalone:zip:10.1.1-SNAPSHOT (compile)
[ERROR] Could not find artifact org.apache.tomee:openejb-standalone:zip:10.1.1-SNAPSHOT in Apache Snapshots (https://repository.apache.org/content/repositories/snapshots)
[ERROR] Could not find artifact org.apache.tomee:openejb-standalone:zip:10.1.1-SNAPSHOT in apache-snapshots (https://repository.apache.org/content/groups/snapshots)
[ERROR] Could not find artifact org.apache.tomee:openejb-standalone:zip:10.1.1-SNAPSHOT in sonatype-snapshots (https://oss.sonatype.org/content/repositories/snapshots)
[ERROR] Could not find artifact org.apache.tomee:openejb-standalone:zip:10.1.1-SNAPSHOT in JBoss Repository (https://repository.jboss.org/nexus/content/groups/public-jboss)
[ERROR] Could not find artifact org.apache.tomee:openejb-standalone:zip:10.1.1-SNAPSHOT in B_shibboleth (https://build.shibboleth.net/nexus/content/groups/public)
[ERROR] dependency: org.apache.tomee:arquillian-tomee-common:jar:10.1.1-SNAPSHOT (compile)
[ERROR] Could not find artifact org.apache.tomee:arquillian-tomee-common:jar:10.1.1-SNAPSHOT in Apache Snapshots (https://repository.apache.org/content/repositories/snapshots)
[ERROR] Could not find artifact org.apache.tomee:arquillian-tomee-common:jar:10.1.1-SNAPSHOT in apache-snapshots (https://repository.apache.org/content/groups/snapshots)
[ERROR] Could not find artifact org.apache.tomee:arquillian-tomee-common:jar:10.1.1-SNAPSHOT in sonatype-snapshots (https://oss.sonatype.org/content/repositories/snapshots)
[ERROR] Could not find artifact org.apache.tomee:arquillian-tomee-common:jar:10.1.1-SNAPSHOT in JBoss Repository (https://repository.jboss.org/nexus/content/groups/public-jboss)
[ERROR] Could not find artifact org.apache.tomee:arquillian-tomee-common:jar:10.1.1-SNAPSHOT in B_shibboleth (https://build.shibboleth.net/nexus/content/groups/public)
[ERROR] -> [Help 1]
[ERROR] Failed to execute goal on project jaxrs: Could not resolve dependencies for project org.apache.tomee.itests:jaxrs:jar:10.1.1-SNAPSHOT
[ERROR] dependency: org.apache.tomee.bom:tomee-webprofile-api:jar:10.1.1-SNAPSHOT (provided)
[ERROR] Could not find artifact org.apache.tomee.bom:tomee-webprofile-api:jar:10.1.1-SNAPSHOT in Apache Snapshots (https://repository.apache.org/content/repositories/snapshots)
[ERROR] Could not find artifact org.apache.tomee.bom:tomee-webprofile-api:jar:10.1.1-SNAPSHOT in apache-snapshots (https://repository.apache.org/content/groups/snapshots)
[ERROR] Could not find artifact org.apache.tomee.bom:tomee-webprofile-api:jar:10.1.1-SNAPSHOT in sonatype-snapshots (https://oss.sonatype.org/content/repositories/snapshots)
[ERROR] Could not find artifact org.apache.tomee.bom:tomee-webprofile-api:jar:10.1.1-SNAPSHOT in JBoss Repository (https://repository.jboss.org/nexus/content/groups/public-jboss)
[ERROR] Could not find artifact org.apache.tomee.bom:tomee-webprofile-api:jar:10.1.1-SNAPSHOT in B_shibboleth (https://build.shibboleth.net/nexus/content/groups/public)
[ERROR] -> [Help 1]
[ERROR] 
[ERROR] To see the full stack trace of the errors, re-run Maven with the -e switch.
[ERROR] Re-run Maven using the -X switch to enable full debug logging.
[ERROR] 
[ERROR] For more information about the errors and possible solutions, please read the following articles:
[ERROR] [Help 1] http://cwiki.apache.org/confluence/display/MAVEN/DependencyResolutionException
[ERROR] 
[ERROR] After correcting the problems, you can resume the build with the command
[ERROR]   mvn <goals> -rf :microprofile-jwt-itests
[JENKINS] Archiving <https://ci-builds.apache.org/job/Tomee/job/master-build-full-itests/ws/itests/openejb-itests-interceptor-beans/pom.xml> to org.apache.tomee/openejb-itests-interceptor-beans/10.1.1-SNAPSHOT/openejb-itests-interceptor-beans-10.1.1-SNAPSHOT.pom
[JENKINS] Archiving <https://ci-builds.apache.org/job/Tomee/job/master-build-full-itests/ws/itests/openejb-itests-interceptor-beans/target/openejb-itests-interceptor-beans-10.1.1-SNAPSHOT.jar> to org.apache.tomee/openejb-itests-interceptor-beans/10.1.1-SNAPSHOT/openejb-itests-interceptor-beans-10.1.1-SNAPSHOT.jar
[JENKINS] Archiving <https://ci-builds.apache.org/job/Tomee/job/master-build-full-itests/ws/itests/openejb-itests-client/pom.xml> to org.apache.tomee/openejb-itests-client/10.1.1-SNAPSHOT/openejb-itests-client-10.1.1-SNAPSHOT.pom
[JENKINS] Archiving <https://ci-builds.apache.org/job/Tomee/job/master-build-full-itests/ws/itests/openejb-itests-client/target/openejb-itests-client-10.1.1-SNAPSHOT.jar> to org.apache.tomee/openejb-itests-client/10.1.1-SNAPSHOT/openejb-itests-client-10.1.1-SNAPSHOT.jar
[JENKINS] Archiving <https://ci-builds.apache.org/job/Tomee/job/master-build-full-itests/ws/itests/jaxrs/pom.xml> to org.apache.tomee.itests/jaxrs/10.1.1-SNAPSHOT/jaxrs-10.1.1-SNAPSHOT.pom
[JENKINS] Archiving <https://ci-builds.apache.org/job/Tomee/job/master-build-full-itests/ws/itests/microprofile-jwt-itests/pom.xml> to org.apache.tomee/microprofile-jwt-itests/10.1.1-SNAPSHOT/microprofile-jwt-itests-10.1.1-SNAPSHOT.pom
[JENKINS] Archiving <https://ci-builds.apache.org/job/Tomee/job/master-build-full-itests/ws/itests/openejb-itests-web/pom.xml> to org.apache.tomee/openejb-itests-web/10.1.1-SNAPSHOT/openejb-itests-web-10.1.1-SNAPSHOT.pom
[JENKINS] Archiving <https://ci-builds.apache.org/job/Tomee/job/master-build-full-itests/ws/itests/openejb-itests-web/target/openejb-itests-web-10.1.1-SNAPSHOT.war> to org.apache.tomee/openejb-itests-web/10.1.1-SNAPSHOT/openejb-itests-web-10.1.1-SNAPSHOT.war
[JENKINS] Archiving <https://ci-builds.apache.org/job/Tomee/job/master-build-full-itests/ws/itests/failover-ejb/pom.xml> to org.apache.openejb.itests/failover-ejb/10.1.1-SNAPSHOT/failover-ejb-10.1.1-SNAPSHOT.pom
[JENKINS] Archiving <https://ci-builds.apache.org/job/Tomee/job/master-build-full-itests/ws/itests/failover-ejb/target/failover-ejb-10.1.1-SNAPSHOT.jar> to org.apache.openejb.itests/failover-ejb/10.1.1-SNAPSHOT/failover-ejb-10.1.1-SNAPSHOT.jar
[JENKINS] Archiving <https://ci-builds.apache.org/job/Tomee/job/master-build-full-itests/ws/itests/legacy-server/pom.xml> to org.apache.openejb.itests/legacy-server/10.1.1-SNAPSHOT/legacy-server-10.1.1-SNAPSHOT.pom
[JENKINS] Archiving <https://ci-builds.apache.org/job/Tomee/job/master-build-full-itests/ws/itests/failover/pom.xml> to org.apache.openejb.itests/failover/10.1.1-SNAPSHOT/failover-10.1.1-SNAPSHOT.pom
[JENKINS] Archiving <https://ci-builds.apache.org/job/Tomee/job/master-build-full-itests/ws/itests/tomee-server-version/pom.xml> to org.apache.tomee/tomee-server-version/10.1.1-SNAPSHOT/tomee-server-version-10.1.1-SNAPSHOT.pom
[JENKINS] Archiving <https://ci-builds.apache.org/job/Tomee/job/master-build-full-itests/ws/itests/tomee-server-version/target/tomee-server-version-10.1.1-SNAPSHOT.jar> to org.apache.tomee/tomee-server-version/10.1.1-SNAPSHOT/tomee-server-version-10.1.1-SNAPSHOT.jar
[JENKINS] Archiving <https://ci-builds.apache.org/job/Tomee/job/master-build-full-itests/ws/itests/legacy-client/pom.xml> to org.apache.openejb.itests/legacy-client/10.1.1-SNAPSHOT/legacy-client-10.1.1-SNAPSHOT.pom
[JENKINS] Archiving <https://ci-builds.apache.org/job/Tomee/job/master-build-full-itests/ws/itests/openejb-itests-beans/pom.xml> to org.apache.tomee/openejb-itests-beans/10.1.1-SNAPSHOT/openejb-itests-beans-10.1.1-SNAPSHOT.pom
[JENKINS] Archiving <https://ci-builds.apache.org/job/Tomee/job/master-build-full-itests/ws/itests/openejb-itests-beans/target/openejb-itests-beans-10.1.1-SNAPSHOT.jar> to org.apache.tomee/openejb-itests-beans/10.1.1-SNAPSHOT/openejb-itests-beans-10.1.1-SNAPSHOT.jar
[JENKINS] Archiving <https://ci-builds.apache.org/job/Tomee/job/master-build-full-itests/ws/itests/tomee-server-composer/pom.xml> to org.apache.tomee/tomee-server-composer/10.1.1-SNAPSHOT/tomee-server-composer-10.1.1-SNAPSHOT.pom
[JENKINS] Archiving <https://ci-builds.apache.org/job/Tomee/job/master-build-full-itests/ws/itests/tomee-server-composer/target/tomee-server-composer-10.1.1-SNAPSHOT.jar> to org.apache.tomee/tomee-server-composer/10.1.1-SNAPSHOT/tomee-server-composer-10.1.1-SNAPSHOT.jar
[JENKINS] Archiving <https://ci-builds.apache.org/job/Tomee/job/master-build-full-itests/ws/itests/openejb-itests-app/pom.xml> to org.apache.tomee/openejb-itests-app/10.1.1-SNAPSHOT/openejb-itests-app-10.1.1-SNAPSHOT.pom
[JENKINS] Archiving <https://ci-builds.apache.org/job/Tomee/job/master-build-full-itests/ws/itests/openejb-itests-app/target/openejb-itests-app-10.1.1-SNAPSHOT.ear> to org.apache.tomee/openejb-itests-app/10.1.1-SNAPSHOT/openejb-itests-app-10.1.1-SNAPSHOT.jar
[JENKINS] Archiving <https://ci-builds.apache.org/job/Tomee/job/master-build-full-itests/ws/itests/openejb-itests-servlets/pom.xml> to org.apache.tomee/openejb-itests-servlets/10.1.1-SNAPSHOT/openejb-itests-servlets-10.1.1-SNAPSHOT.pom
[JENKINS] Archiving <https://ci-builds.apache.org/job/Tomee/job/master-build-full-itests/ws/itests/openejb-itests-servlets/target/openejb-itests-servlets-10.1.1-SNAPSHOT.jar> to org.apache.tomee/openejb-itests-servlets/10.1.1-SNAPSHOT/openejb-itests-servlets-10.1.1-SNAPSHOT.jar
Sending e-mails to: commits@tomee.apache.org
Sending e-mails to: commits@tomee.apache.org
No mail will be sent out, as 'TomEE » master-build-full-itests » TomEE :: iTests :: Legacy Server #417' does not have a result yet. Please make sure you set a proper result in case of pipeline/build scripts.
Sending e-mails to: commits@tomee.apache.org
No mail will be sent out, as 'TomEE » master-build-full-itests » TomEE :: iTests :: Legacy Client #417' does not have a result yet. Please make sure you set a proper result in case of pipeline/build scripts.
channel stopped
INFO: Processing JUnit
INFO: [JUnit] - No test report file(s) were found with the pattern '**/target/surefire-reports/TEST-*.xml' relative to '<https://ci-builds.apache.org/job/Tomee/job/master-build-full-itests/ws/'> for the testing framework 'JUnit'.
Did you enter a pattern relative to (and within) the workspace directory?
Did you generate the result report(s) for 'JUnit'?"
WARNING: All test reports are empty.
[Checks API] No suitable checks publisher found.
INFO: Setting the build status to SUCCESS