You are viewing a plain text version of this content. The canonical link for it is here.
Posted to builds@beam.apache.org by Apache Jenkins Server <je...@builds.apache.org> on 2022/09/04 15:49:05 UTC
Build failed in Jenkins: beam_PostCommit_Python_Examples_Flink #833
See <https://ci-beam.apache.org/job/beam_PostCommit_Python_Examples_Flink/833/display/redirect>
Changes:
------------------------------------------
[...truncated 108.89 MB...]
apache_beam/examples/complete/game/hourly_team_score_it_test.py::HourlyTeamScoreIT::test_hourly_team_score_output_checksum_on_small_input
<https://ci-beam.apache.org/job/beam_PostCommit_Python_Examples_Flink/ws/src/build/gradleenv/2022703443/lib/python3.9/site-packages/_pytest/threadexception.py>:73: PytestUnhandledThreadExceptionWarning: Exception in thread read_grpc_client_inputs
Traceback (most recent call last):
File "/usr/lib/python3.9/threading.py", line 973, in _bootstrap_inner
self.run()
File "/usr/lib/python3.9/threading.py", line 910, in run
self._target(*self._args, **self._kwargs)
File "<https://ci-beam.apache.org/job/beam_PostCommit_Python_Examples_Flink/ws/src/sdks/python/apache_beam/runners/worker/data_plane.py",> line 671, in <lambda>
target=lambda: self._read_inputs(elements_iterator),
File "<https://ci-beam.apache.org/job/beam_PostCommit_Python_Examples_Flink/ws/src/sdks/python/apache_beam/runners/worker/data_plane.py",> line 654, in _read_inputs
for elements in elements_iterator:
File "<https://ci-beam.apache.org/job/beam_PostCommit_Python_Examples_Flink/ws/src/build/gradleenv/2022703443/lib/python3.9/site-packages/grpc/_channel.py",> line 426, in __next__
return self._next()
File "<https://ci-beam.apache.org/job/beam_PostCommit_Python_Examples_Flink/ws/src/build/gradleenv/2022703443/lib/python3.9/site-packages/grpc/_channel.py",> line 826, in _next
raise self
grpc._channel._MultiThreadedRendezvous: <_MultiThreadedRendezvous of RPC that terminated with:
status = StatusCode.CANCELLED
details = "Multiplexer hanging up"
debug_error_string = "UNKNOWN:Error received from peer ipv4:127.0.0.1:41035 {grpc_message:"Multiplexer hanging up", grpc_status:1, created_time:"2022-09-04T15:43:08.559504981+00:00"}"
>
warnings.warn(pytest.PytestUnhandledThreadExceptionWarning(msg))
apache_beam/examples/complete/game/user_score_it_test.py::UserScoreIT::test_userscore_output_checksum_on_small_input
<https://ci-beam.apache.org/job/beam_PostCommit_Python_Examples_Flink/ws/src/build/gradleenv/2022703443/lib/python3.9/site-packages/_pytest/threadexception.py>:73: PytestUnhandledThreadExceptionWarning: Exception in thread read_grpc_client_inputs
Traceback (most recent call last):
File "/usr/lib/python3.9/threading.py", line 973, in _bootstrap_inner
self.run()
File "/usr/lib/python3.9/threading.py", line 910, in run
self._target(*self._args, **self._kwargs)
File "<https://ci-beam.apache.org/job/beam_PostCommit_Python_Examples_Flink/ws/src/sdks/python/apache_beam/runners/worker/data_plane.py",> line 671, in <lambda>
target=lambda: self._read_inputs(elements_iterator),
File "<https://ci-beam.apache.org/job/beam_PostCommit_Python_Examples_Flink/ws/src/sdks/python/apache_beam/runners/worker/data_plane.py",> line 654, in _read_inputs
for elements in elements_iterator:
File "<https://ci-beam.apache.org/job/beam_PostCommit_Python_Examples_Flink/ws/src/build/gradleenv/2022703443/lib/python3.9/site-packages/grpc/_channel.py",> line 426, in __next__
return self._next()
File "<https://ci-beam.apache.org/job/beam_PostCommit_Python_Examples_Flink/ws/src/build/gradleenv/2022703443/lib/python3.9/site-packages/grpc/_channel.py",> line 826, in _next
raise self
grpc._channel._MultiThreadedRendezvous: <_MultiThreadedRendezvous of RPC that terminated with:
status = StatusCode.CANCELLED
details = "Multiplexer hanging up"
debug_error_string = "UNKNOWN:Error received from peer ipv4:127.0.0.1:32969 {grpc_message:"Multiplexer hanging up", grpc_status:1, created_time:"2022-09-04T15:43:45.576681462+00:00"}"
>
warnings.warn(pytest.PytestUnhandledThreadExceptionWarning(msg))
apache_beam/examples/cookbook/bigquery_side_input_it_test.py::BigQuerySideInputIT::test_bigquery_side_input_it
apache_beam/examples/cookbook/bigquery_side_input_it_test.py::BigQuerySideInputIT::test_bigquery_side_input_it
apache_beam/examples/cookbook/bigquery_tornadoes_it_test.py::BigqueryTornadoesIT::test_bigquery_tornadoes_it
apache_beam/examples/cookbook/filters_test.py::FiltersTest::test_filters_output_bigquery_matcher
apache_beam/examples/dataframe/flight_delays_it_test.py::FlightDelaysTest::test_flight_delays
<https://ci-beam.apache.org/job/beam_PostCommit_Python_Examples_Flink/ws/src/sdks/python/apache_beam/io/gcp/bigquery.py>:2774: BeamDeprecationWarning: options is deprecated since First stable release. References to <pipeline>.options will not be supported
temp_location = pcoll.pipeline.options.view_as(
apache_beam/examples/cookbook/bigquery_side_input_it_test.py::BigQuerySideInputIT::test_bigquery_side_input_it
apache_beam/examples/cookbook/bigquery_side_input_it_test.py::BigQuerySideInputIT::test_bigquery_side_input_it
apache_beam/examples/cookbook/bigquery_tornadoes_it_test.py::BigqueryTornadoesIT::test_bigquery_tornadoes_it
apache_beam/examples/cookbook/filters_test.py::FiltersTest::test_filters_output_bigquery_matcher
apache_beam/examples/dataframe/flight_delays_it_test.py::FlightDelaysTest::test_flight_delays
<https://ci-beam.apache.org/job/beam_PostCommit_Python_Examples_Flink/ws/src/sdks/python/apache_beam/io/gcp/bigquery.py>:2776: BeamDeprecationWarning: options is deprecated since First stable release. References to <pipeline>.options will not be supported
job_name = pcoll.pipeline.options.view_as(GoogleCloudOptions).job_name
apache_beam/examples/cookbook/bigquery_side_input_it_test.py::BigQuerySideInputIT::test_bigquery_side_input_it
apache_beam/examples/cookbook/bigquery_side_input_it_test.py::BigQuerySideInputIT::test_bigquery_side_input_it
apache_beam/examples/cookbook/bigquery_tornadoes_it_test.py::BigqueryTornadoesIT::test_bigquery_tornadoes_it
apache_beam/examples/cookbook/filters_test.py::FiltersTest::test_filters_output_bigquery_matcher
apache_beam/examples/dataframe/flight_delays_it_test.py::FlightDelaysTest::test_flight_delays
<https://ci-beam.apache.org/job/beam_PostCommit_Python_Examples_Flink/ws/src/sdks/python/apache_beam/io/gcp/bigquery.py>:2800: BeamDeprecationWarning: options is deprecated since First stable release. References to <pipeline>.options will not be supported
pipeline_options=pcoll.pipeline.options,
apache_beam/examples/cookbook/bigquery_side_input_it_test.py::BigQuerySideInputIT::test_bigquery_side_input_it
<https://ci-beam.apache.org/job/beam_PostCommit_Python_Examples_Flink/ws/src/build/gradleenv/2022703443/lib/python3.9/site-packages/_pytest/threadexception.py>:73: PytestUnhandledThreadExceptionWarning: Exception in thread read_grpc_client_inputs
Traceback (most recent call last):
File "/usr/lib/python3.9/threading.py", line 973, in _bootstrap_inner
self.run()
File "/usr/lib/python3.9/threading.py", line 910, in run
self._target(*self._args, **self._kwargs)
File "<https://ci-beam.apache.org/job/beam_PostCommit_Python_Examples_Flink/ws/src/sdks/python/apache_beam/runners/worker/data_plane.py",> line 671, in <lambda>
target=lambda: self._read_inputs(elements_iterator),
File "<https://ci-beam.apache.org/job/beam_PostCommit_Python_Examples_Flink/ws/src/sdks/python/apache_beam/runners/worker/data_plane.py",> line 654, in _read_inputs
for elements in elements_iterator:
File "<https://ci-beam.apache.org/job/beam_PostCommit_Python_Examples_Flink/ws/src/build/gradleenv/2022703443/lib/python3.9/site-packages/grpc/_channel.py",> line 426, in __next__
return self._next()
File "<https://ci-beam.apache.org/job/beam_PostCommit_Python_Examples_Flink/ws/src/build/gradleenv/2022703443/lib/python3.9/site-packages/grpc/_channel.py",> line 809, in _next
raise self
grpc._channel._MultiThreadedRendezvous: <_MultiThreadedRendezvous of RPC that terminated with:
status = StatusCode.CANCELLED
details = "Multiplexer hanging up"
debug_error_string = "UNKNOWN:Error received from peer ipv4:127.0.0.1:46851 {created_time:"2022-09-04T15:44:10.649120363+00:00", grpc_status:1, grpc_message:"Multiplexer hanging up"}"
>
warnings.warn(pytest.PytestUnhandledThreadExceptionWarning(msg))
apache_beam/examples/cookbook/bigquery_tornadoes_it_test.py::BigqueryTornadoesIT::test_bigquery_tornadoes_it
apache_beam/examples/cookbook/filters_test.py::FiltersTest::test_filters_output_bigquery_matcher
<https://ci-beam.apache.org/job/beam_PostCommit_Python_Examples_Flink/ws/src/sdks/python/apache_beam/io/gcp/bigquery.py>:2281: BeamDeprecationWarning: options is deprecated since First stable release. References to <pipeline>.options will not be supported
self.table_reference.projectId = pcoll.pipeline.options.view_as(
apache_beam/examples/cookbook/bigquery_tornadoes_it_test.py::BigqueryTornadoesIT::test_bigquery_tornadoes_it
apache_beam/examples/cookbook/filters_test.py::FiltersTest::test_filters_output_bigquery_matcher
<https://ci-beam.apache.org/job/beam_PostCommit_Python_Examples_Flink/ws/src/sdks/python/apache_beam/io/gcp/tests/utils.py>:100: PendingDeprecationWarning: Client.dataset is deprecated and will be removed in a future version. Use a string like 'my_project.my_dataset' or a cloud.google.bigquery.DatasetReference object, instead.
table_ref = client.dataset(dataset_id).table(table_id)
apache_beam/examples/cookbook/bigquery_tornadoes_it_test.py::BigqueryTornadoesIT::test_bigquery_tornadoes_it
<https://ci-beam.apache.org/job/beam_PostCommit_Python_Examples_Flink/ws/src/build/gradleenv/2022703443/lib/python3.9/site-packages/_pytest/threadexception.py>:73: PytestUnhandledThreadExceptionWarning: Exception in thread read_grpc_client_inputs
Traceback (most recent call last):
File "/usr/lib/python3.9/threading.py", line 973, in _bootstrap_inner
self.run()
File "/usr/lib/python3.9/threading.py", line 910, in run
self._target(*self._args, **self._kwargs)
File "<https://ci-beam.apache.org/job/beam_PostCommit_Python_Examples_Flink/ws/src/sdks/python/apache_beam/runners/worker/data_plane.py",> line 671, in <lambda>
target=lambda: self._read_inputs(elements_iterator),
File "<https://ci-beam.apache.org/job/beam_PostCommit_Python_Examples_Flink/ws/src/sdks/python/apache_beam/runners/worker/data_plane.py",> line 654, in _read_inputs
for elements in elements_iterator:
File "<https://ci-beam.apache.org/job/beam_PostCommit_Python_Examples_Flink/ws/src/build/gradleenv/2022703443/lib/python3.9/site-packages/grpc/_channel.py",> line 426, in __next__
return self._next()
File "<https://ci-beam.apache.org/job/beam_PostCommit_Python_Examples_Flink/ws/src/build/gradleenv/2022703443/lib/python3.9/site-packages/grpc/_channel.py",> line 826, in _next
raise self
grpc._channel._MultiThreadedRendezvous: <_MultiThreadedRendezvous of RPC that terminated with:
status = StatusCode.CANCELLED
details = "Multiplexer hanging up"
debug_error_string = "UNKNOWN:Error received from peer ipv4:127.0.0.1:38895 {created_time:"2022-09-04T15:44:45.173795609+00:00", grpc_status:1, grpc_message:"Multiplexer hanging up"}"
>
warnings.warn(pytest.PytestUnhandledThreadExceptionWarning(msg))
apache_beam/examples/cookbook/coders_it_test.py::CodersIT::test_coders_output_files_on_small_input
<https://ci-beam.apache.org/job/beam_PostCommit_Python_Examples_Flink/ws/src/build/gradleenv/2022703443/lib/python3.9/site-packages/_pytest/threadexception.py>:73: PytestUnhandledThreadExceptionWarning: Exception in thread read_grpc_client_inputs
Traceback (most recent call last):
File "/usr/lib/python3.9/threading.py", line 973, in _bootstrap_inner
self.run()
File "/usr/lib/python3.9/threading.py", line 910, in run
self._target(*self._args, **self._kwargs)
File "<https://ci-beam.apache.org/job/beam_PostCommit_Python_Examples_Flink/ws/src/sdks/python/apache_beam/runners/worker/data_plane.py",> line 671, in <lambda>
target=lambda: self._read_inputs(elements_iterator),
File "<https://ci-beam.apache.org/job/beam_PostCommit_Python_Examples_Flink/ws/src/sdks/python/apache_beam/runners/worker/data_plane.py",> line 654, in _read_inputs
for elements in elements_iterator:
File "<https://ci-beam.apache.org/job/beam_PostCommit_Python_Examples_Flink/ws/src/build/gradleenv/2022703443/lib/python3.9/site-packages/grpc/_channel.py",> line 426, in __next__
return self._next()
File "<https://ci-beam.apache.org/job/beam_PostCommit_Python_Examples_Flink/ws/src/build/gradleenv/2022703443/lib/python3.9/site-packages/grpc/_channel.py",> line 826, in _next
raise self
grpc._channel._MultiThreadedRendezvous: <_MultiThreadedRendezvous of RPC that terminated with:
status = StatusCode.CANCELLED
details = "Multiplexer hanging up"
debug_error_string = "UNKNOWN:Error received from peer ipv4:127.0.0.1:45411 {created_time:"2022-09-04T15:45:16.069203069+00:00", grpc_status:1, grpc_message:"Multiplexer hanging up"}"
>
warnings.warn(pytest.PytestUnhandledThreadExceptionWarning(msg))
apache_beam/examples/cookbook/filters_test.py::FiltersTest::test_filters_output_bigquery_matcher
<https://ci-beam.apache.org/job/beam_PostCommit_Python_Examples_Flink/ws/src/build/gradleenv/2022703443/lib/python3.9/site-packages/_pytest/threadexception.py>:73: PytestUnhandledThreadExceptionWarning: Exception in thread read_grpc_client_inputs
Traceback (most recent call last):
File "/usr/lib/python3.9/threading.py", line 973, in _bootstrap_inner
self.run()
File "/usr/lib/python3.9/threading.py", line 910, in run
self._target(*self._args, **self._kwargs)
File "<https://ci-beam.apache.org/job/beam_PostCommit_Python_Examples_Flink/ws/src/sdks/python/apache_beam/runners/worker/data_plane.py",> line 671, in <lambda>
target=lambda: self._read_inputs(elements_iterator),
File "<https://ci-beam.apache.org/job/beam_PostCommit_Python_Examples_Flink/ws/src/sdks/python/apache_beam/runners/worker/data_plane.py",> line 654, in _read_inputs
for elements in elements_iterator:
File "<https://ci-beam.apache.org/job/beam_PostCommit_Python_Examples_Flink/ws/src/build/gradleenv/2022703443/lib/python3.9/site-packages/grpc/_channel.py",> line 426, in __next__
return self._next()
File "<https://ci-beam.apache.org/job/beam_PostCommit_Python_Examples_Flink/ws/src/build/gradleenv/2022703443/lib/python3.9/site-packages/grpc/_channel.py",> line 826, in _next
raise self
grpc._channel._MultiThreadedRendezvous: <_MultiThreadedRendezvous of RPC that terminated with:
status = StatusCode.CANCELLED
details = "Multiplexer hanging up"
debug_error_string = "UNKNOWN:Error received from peer ipv4:127.0.0.1:43871 {created_time:"2022-09-04T15:45:59.223042526+00:00", grpc_status:1, grpc_message:"Multiplexer hanging up"}"
>
warnings.warn(pytest.PytestUnhandledThreadExceptionWarning(msg))
apache_beam/examples/dataframe/flight_delays_it_test.py: 40 warnings
<https://ci-beam.apache.org/job/beam_PostCommit_Python_Examples_Flink/ws/src/sdks/python/apache_beam/examples/dataframe/flight_delays.py>:47: FutureWarning: Dropping of nuisance columns in DataFrame reductions (with 'numeric_only=None') is deprecated; in a future version this will raise TypeError. Select only valid columns before calling the reduction.
return airline_df[at_top_airports].mean()
apache_beam/examples/dataframe/flight_delays_it_test.py::FlightDelaysTest::test_flight_delays
apache_beam/examples/dataframe/wordcount_test.py::WordCountTest::test_basics
<https://ci-beam.apache.org/job/beam_PostCommit_Python_Examples_Flink/ws/src/sdks/python/apache_beam/dataframe/io.py>:659: FutureWarning: WriteToFiles is experimental.
return pcoll | fileio.WriteToFiles(
apache_beam/examples/dataframe/flight_delays_it_test.py::FlightDelaysTest::test_flight_delays
apache_beam/examples/dataframe/wordcount_test.py::WordCountTest::test_basics
<https://ci-beam.apache.org/job/beam_PostCommit_Python_Examples_Flink/ws/src/sdks/python/apache_beam/io/fileio.py>:590: BeamDeprecationWarning: options is deprecated since First stable release. References to <pipeline>.options will not be supported
p.options.view_as(GoogleCloudOptions).temp_location or
-- Docs: https://docs.pytest.org/en/stable/how-to/capture-warnings.html
- generated xml file: <https://ci-beam.apache.org/job/beam_PostCommit_Python_Examples_Flink/ws/src/sdks/python/pytest_postCommitExamples-flink-py39.xml> -
=========================== short test summary info ============================
FAILED apache_beam/examples/cookbook/bigquery_side_input_it_test.py::BigQuerySideInputIT::test_bigquery_side_input_it
= 1 failed, 21 passed, 3 skipped, 6634 deselected, 91 warnings in 518.37s (0:08:38) =
> Task :sdks:python:test-suites:portable:py37:flinkExamples FAILED
FAILURE: Build completed with 2 failures.
1: Task failed with an exception.
-----------
* Where:
Script '<https://ci-beam.apache.org/job/beam_PostCommit_Python_Examples_Flink/ws/src/sdks/python/test-suites/portable/common.gradle'> line: 240
* What went wrong:
Execution failed for task ':sdks:python:test-suites:portable:py39:flinkExamples'.
> Process 'command 'sh'' finished with non-zero exit value 1
* Try:
> Run with --stacktrace option to get the stack trace.
> Run with --info or --debug option to get more log output.
> Run with --scan to get full insights.
==============================================================================
2: Task failed with an exception.
-----------
* Where:
Script '<https://ci-beam.apache.org/job/beam_PostCommit_Python_Examples_Flink/ws/src/sdks/python/test-suites/portable/common.gradle'> line: 240
* What went wrong:
Execution failed for task ':sdks:python:test-suites:portable:py37:flinkExamples'.
> Process 'command 'sh'' finished with non-zero exit value 1
* Try:
> Run with --stacktrace option to get the stack trace.
> Run with --info or --debug option to get more log output.
> Run with --scan to get full insights.
==============================================================================
* Get more help at https://help.gradle.org
Deprecated Gradle features were used in this build, making it incompatible with Gradle 8.0.
You can use '--warning-mode all' to show the individual deprecation warnings and determine if they come from your own scripts or plugins.
See https://docs.gradle.org/7.4/userguide/command_line_interface.html#sec:command_line_warnings
BUILD FAILED in 10m 38s
133 actionable tasks: 87 executed, 44 from cache, 2 up-to-date
Publishing build scan...
https://gradle.com/s/23j2zxe22jitk
Build step 'Invoke Gradle script' changed build result to FAILURE
Build step 'Invoke Gradle script' marked build as failure
---------------------------------------------------------------------
To unsubscribe, e-mail: builds-unsubscribe@beam.apache.org
For additional commands, e-mail: builds-help@beam.apache.org
Jenkins build is back to normal : beam_PostCommit_Python_Examples_Flink #839
Posted by Apache Jenkins Server <je...@builds.apache.org>.
See <https://ci-beam.apache.org/job/beam_PostCommit_Python_Examples_Flink/839/display/redirect?page=changes>
---------------------------------------------------------------------
To unsubscribe, e-mail: builds-unsubscribe@beam.apache.org
For additional commands, e-mail: builds-help@beam.apache.org
Build failed in Jenkins: beam_PostCommit_Python_Examples_Flink #838
Posted by Apache Jenkins Server <je...@builds.apache.org>.
See <https://ci-beam.apache.org/job/beam_PostCommit_Python_Examples_Flink/838/display/redirect>
Changes:
------------------------------------------
[...truncated 109.26 MB...]
File "<https://ci-beam.apache.org/job/beam_PostCommit_Python_Examples_Flink/ws/src/build/gradleenv/2022703441/lib/python3.7/site-packages/grpc/_channel.py",> line 343, in result
raise self
File "<https://ci-beam.apache.org/job/beam_PostCommit_Python_Examples_Flink/ws/src/build/gradleenv/2022703441/lib/python3.7/site-packages/grpc/_interceptor.py",> line 247, in continuation
compression=new_compression)
File "<https://ci-beam.apache.org/job/beam_PostCommit_Python_Examples_Flink/ws/src/build/gradleenv/2022703441/lib/python3.7/site-packages/grpc/_channel.py",> line 957, in with_call
return _end_unary_response_blocking(state, call, True, None)
File "<https://ci-beam.apache.org/job/beam_PostCommit_Python_Examples_Flink/ws/src/build/gradleenv/2022703441/lib/python3.7/site-packages/grpc/_channel.py",> line 849, in _end_unary_response_blocking
raise _InactiveRpcError(state)
grpc._channel._InactiveRpcError: <_InactiveRpcError of RPC that terminated with:
status = StatusCode.UNAVAILABLE
details = "failed to connect to all addresses; last error: UNKNOWN: Failed to connect to remote host: Connection refused"
debug_error_string = "UNKNOWN:Failed to pick subchannel {created_time:"2022-09-05T21:44:24.75620744+00:00", children:[UNKNOWN:failed to connect to all addresses; last error: UNKNOWN: Failed to connect to remote host: Connection refused {created_time:"2022-09-05T21:44:24.756197298+00:00", grpc_status:14}]}"
>
Traceback (most recent call last):
File "<https://ci-beam.apache.org/job/beam_PostCommit_Python_Examples_Flink/ws/src/sdks/python/apache_beam/runners/worker/sdk_worker.py",> line 287, in _execute
response = task()
File "<https://ci-beam.apache.org/job/beam_PostCommit_Python_Examples_Flink/ws/src/sdks/python/apache_beam/runners/worker/sdk_worker.py",> line 360, in <lambda>
lambda: self.create_worker().do_instruction(request), request)
File "<https://ci-beam.apache.org/job/beam_PostCommit_Python_Examples_Flink/ws/src/sdks/python/apache_beam/runners/worker/sdk_worker.py",> line 597, in do_instruction
getattr(request, request_type), request.instruction_id)
File "<https://ci-beam.apache.org/job/beam_PostCommit_Python_Examples_Flink/ws/src/sdks/python/apache_beam/runners/worker/sdk_worker.py",> line 628, in process_bundle
instruction_id, request.process_bundle_descriptor_id)
File "<https://ci-beam.apache.org/job/beam_PostCommit_Python_Examples_Flink/ws/src/sdks/python/apache_beam/runners/worker/sdk_worker.py",> line 460, in get
self.fns[bundle_descriptor_id],
File "<https://ci-beam.apache.org/job/beam_PostCommit_Python_Examples_Flink/ws/src/sdks/python/apache_beam/runners/worker/sdk_worker.py",> line 1381, in __missing__
self[key] = self.default_factory(key) # type: ignore # pylint: disable=E1137
File "<https://ci-beam.apache.org/job/beam_PostCommit_Python_Examples_Flink/ws/src/sdks/python/apache_beam/runners/worker/sdk_worker.py",> line 204, in default_factory
process_bundle_descriptor_id=id))
File "<https://ci-beam.apache.org/job/beam_PostCommit_Python_Examples_Flink/ws/src/build/gradleenv/2022703441/lib/python3.7/site-packages/grpc/_interceptor.py",> line 221, in __call__
compression=compression)
File "<https://ci-beam.apache.org/job/beam_PostCommit_Python_Examples_Flink/ws/src/build/gradleenv/2022703441/lib/python3.7/site-packages/grpc/_interceptor.py",> line 257, in _with_call
return call.result(), call
File "<https://ci-beam.apache.org/job/beam_PostCommit_Python_Examples_Flink/ws/src/build/gradleenv/2022703441/lib/python3.7/site-packages/grpc/_channel.py",> line 343, in result
raise self
File "<https://ci-beam.apache.org/job/beam_PostCommit_Python_Examples_Flink/ws/src/build/gradleenv/2022703441/lib/python3.7/site-packages/grpc/_interceptor.py",> line 247, in continuation
compression=new_compression)
File "<https://ci-beam.apache.org/job/beam_PostCommit_Python_Examples_Flink/ws/src/build/gradleenv/2022703441/lib/python3.7/site-packages/grpc/_channel.py",> line 957, in with_call
return _end_unary_response_blocking(state, call, True, None)
File "<https://ci-beam.apache.org/job/beam_PostCommit_Python_Examples_Flink/ws/src/build/gradleenv/2022703441/lib/python3.7/site-packages/grpc/_channel.py",> line 849, in _end_unary_response_blocking
raise _InactiveRpcError(state)
grpc._channel._InactiveRpcError: <_InactiveRpcError of RPC that terminated with:
status = StatusCode.UNAVAILABLE
details = "failed to connect to all addresses; last error: UNKNOWN: Failed to connect to remote host: Connection refused"
debug_error_string = "UNKNOWN:Failed to pick subchannel {created_time:"2022-09-05T21:44:25.326328732+00:00", children:[UNKNOWN:failed to connect to all addresses; last error: UNKNOWN: Failed to connect to remote host: Connection refused {grpc_status:14, created_time:"2022-09-05T21:44:25.326315015+00:00"}]}"
>
Traceback (most recent call last):
File "<https://ci-beam.apache.org/job/beam_PostCommit_Python_Examples_Flink/ws/src/sdks/python/apache_beam/runners/worker/sdk_worker.py",> line 287, in _execute
response = task()
File "<https://ci-beam.apache.org/job/beam_PostCommit_Python_Examples_Flink/ws/src/sdks/python/apache_beam/runners/worker/sdk_worker.py",> line 360, in <lambda>
lambda: self.create_worker().do_instruction(request), request)
File "<https://ci-beam.apache.org/job/beam_PostCommit_Python_Examples_Flink/ws/src/sdks/python/apache_beam/runners/worker/sdk_worker.py",> line 597, in do_instruction
getattr(request, request_type), request.instruction_id)
File "<https://ci-beam.apache.org/job/beam_PostCommit_Python_Examples_Flink/ws/src/sdks/python/apache_beam/runners/worker/sdk_worker.py",> line 628, in process_bundle
instruction_id, request.process_bundle_descriptor_id)
File "<https://ci-beam.apache.org/job/beam_PostCommit_Python_Examples_Flink/ws/src/sdks/python/apache_beam/runners/worker/sdk_worker.py",> line 460, in get
self.fns[bundle_descriptor_id],
File "<https://ci-beam.apache.org/job/beam_PostCommit_Python_Examples_Flink/ws/src/sdks/python/apache_beam/runners/worker/sdk_worker.py",> line 1381, in __missing__
self[key] = self.default_factory(key) # type: ignore # pylint: disable=E1137
File "<https://ci-beam.apache.org/job/beam_PostCommit_Python_Examples_Flink/ws/src/sdks/python/apache_beam/runners/worker/sdk_worker.py",> line 204, in default_factory
process_bundle_descriptor_id=id))
File "<https://ci-beam.apache.org/job/beam_PostCommit_Python_Examples_Flink/ws/src/build/gradleenv/2022703441/lib/python3.7/site-packages/grpc/_interceptor.py",> line 221, in __call__
compression=compression)
File "<https://ci-beam.apache.org/job/beam_PostCommit_Python_Examples_Flink/ws/src/build/gradleenv/2022703441/lib/python3.7/site-packages/grpc/_interceptor.py",> line 257, in _with_call
return call.result(), call
File "<https://ci-beam.apache.org/job/beam_PostCommit_Python_Examples_Flink/ws/src/build/gradleenv/2022703441/lib/python3.7/site-packages/grpc/_channel.py",> line 343, in result
raise self
File "<https://ci-beam.apache.org/job/beam_PostCommit_Python_Examples_Flink/ws/src/build/gradleenv/2022703441/lib/python3.7/site-packages/grpc/_interceptor.py",> line 247, in continuation
compression=new_compression)
File "<https://ci-beam.apache.org/job/beam_PostCommit_Python_Examples_Flink/ws/src/build/gradleenv/2022703441/lib/python3.7/site-packages/grpc/_channel.py",> line 957, in with_call
return _end_unary_response_blocking(state, call, True, None)
File "<https://ci-beam.apache.org/job/beam_PostCommit_Python_Examples_Flink/ws/src/build/gradleenv/2022703441/lib/python3.7/site-packages/grpc/_channel.py",> line 849, in _end_unary_response_blocking
raise _InactiveRpcError(state)
grpc._channel._InactiveRpcError: <_InactiveRpcError of RPC that terminated with:
status = StatusCode.UNAVAILABLE
details = "failed to connect to all addresses; last error: UNKNOWN: Failed to connect to remote host: Connection refused"
debug_error_string = "UNKNOWN:Failed to pick subchannel {created_time:"2022-09-05T21:44:25.450873183+00:00", children:[UNKNOWN:failed to connect to all addresses; last error: UNKNOWN: Failed to connect to remote host: Connection refused {created_time:"2022-09-05T21:44:25.450857629+00:00", grpc_status:14}]}"
>
Exception in thread run_worker_2-1:
Traceback (most recent call last):
File "/usr/lib/python3.7/threading.py", line 926, in _bootstrap_inner
self.run()
File "/usr/lib/python3.7/threading.py", line 870, in run
self._target(*self._args, **self._kwargs)
File "<https://ci-beam.apache.org/job/beam_PostCommit_Python_Examples_Flink/ws/src/sdks/python/apache_beam/runners/worker/sdk_worker.py",> line 254, in run
for work_request in self._control_stub.Control(get_responses()):
File "<https://ci-beam.apache.org/job/beam_PostCommit_Python_Examples_Flink/ws/src/build/gradleenv/2022703441/lib/python3.7/site-packages/grpc/_channel.py",> line 426, in __next__
return self._next()
File "<https://ci-beam.apache.org/job/beam_PostCommit_Python_Examples_Flink/ws/src/build/gradleenv/2022703441/lib/python3.7/site-packages/grpc/_channel.py",> line 809, in _next
raise self
grpc._channel._MultiThreadedRendezvous: <_MultiThreadedRendezvous of RPC that terminated with:
status = StatusCode.CANCELLED
details = "Runner closed connection"
debug_error_string = "UNKNOWN:Error received from peer ipv4:127.0.0.1:38311 {grpc_message:"Runner closed connection", grpc_status:1, created_time:"2022-09-05T21:44:25.518261701+00:00"}"
>
---------------------------- Captured log teardown -----------------------------
INFO apache_beam.utils.subprocess_server:subprocess_server.py:132 Sep 05, 2022 9:44:22 PM org.apache.flink.runtime.metrics.groups.AbstractMetricGroup addMetric
INFO apache_beam.utils.subprocess_server:subprocess_server.py:132 WARNING: Name collision: Group already contains a Metric with the name 'numBytesInLocalPerSecond'. Metric will not be reported.[, taskmanager, ed1d17e7-4028-4a94-8c8e-4f3202fc0ae8, BeamApp-jenkins-0905214411-1fca9b32, CHAIN MapPartition (MapPartition at [2]{attach word, WriteToText}) -> FlatMap (FlatMap at ExtractOutput[0]), 2]
INFO apache_beam.utils.subprocess_server:subprocess_server.py:132 Sep 05, 2022 9:44:22 PM org.apache.flink.runtime.metrics.groups.AbstractMetricGroup addMetric
INFO apache_beam.utils.subprocess_server:subprocess_server.py:132 WARNING: Name collision: Group already contains a Metric with the name 'numBytesInRemote'. Metric will not be reported.[, taskmanager, ed1d17e7-4028-4a94-8c8e-4f3202fc0ae8, BeamApp-jenkins-0905214411-1fca9b32, CHAIN MapPartition (MapPartition at [2]{attach word, WriteToText}) -> FlatMap (FlatMap at ExtractOutput[0]), 2, Shuffle, Netty, Input]
=============================== warnings summary ===============================
../../build/gradleenv/2022703441/lib/python3.7/site-packages/hdfs/config.py:15
<https://ci-beam.apache.org/job/beam_PostCommit_Python_Examples_Flink/ws/src/build/gradleenv/2022703441/lib/python3.7/site-packages/hdfs/config.py>:15: DeprecationWarning: the imp module is deprecated in favour of importlib; see the module's documentation for alternative uses
from imp import load_source
../../build/gradleenv/2022703441/lib/python3.7/site-packages/google/api_core/grpc_helpers.py:42
<https://ci-beam.apache.org/job/beam_PostCommit_Python_Examples_Flink/ws/src/build/gradleenv/2022703441/lib/python3.7/site-packages/google/api_core/grpc_helpers.py>:42: DeprecationWarning: Support for grpcio-gcp is deprecated. This feature will be
removed from `google-api-core` after January 1, 2024. If you need to
continue to use this feature, please pin to a specific version of
`google-api-core`.
DeprecationWarning,
apache_beam/examples/complete/game/hourly_team_score_it_test.py::HourlyTeamScoreIT::test_hourly_team_score_output_checksum_on_small_input
<https://ci-beam.apache.org/job/beam_PostCommit_Python_Examples_Flink/ws/src/sdks/python/apache_beam/io/gcp/tests/utils.py>:63: PendingDeprecationWarning: Client.dataset is deprecated and will be removed in a future version. Use a string like 'my_project.my_dataset' or a cloud.google.bigquery.DatasetReference object, instead.
dataset_ref = client.dataset(unique_dataset_name, project=project)
apache_beam/examples/complete/game/hourly_team_score_it_test.py::HourlyTeamScoreIT::test_hourly_team_score_output_checksum_on_small_input
apache_beam/examples/cookbook/bigquery_tornadoes_it_test.py::BigqueryTornadoesIT::test_bigquery_tornadoes_it
apache_beam/examples/cookbook/filters_test.py::FiltersTest::test_filters_output_bigquery_matcher
<https://ci-beam.apache.org/job/beam_PostCommit_Python_Examples_Flink/ws/src/sdks/python/apache_beam/io/gcp/bigquery.py>:2285: BeamDeprecationWarning: options is deprecated since First stable release. References to <pipeline>.options will not be supported
is_streaming_pipeline = p.options.view_as(StandardOptions).streaming
apache_beam/examples/complete/game/hourly_team_score_it_test.py::HourlyTeamScoreIT::test_hourly_team_score_output_checksum_on_small_input
apache_beam/examples/cookbook/bigquery_tornadoes_it_test.py::BigqueryTornadoesIT::test_bigquery_tornadoes_it
apache_beam/examples/cookbook/filters_test.py::FiltersTest::test_filters_output_bigquery_matcher
<https://ci-beam.apache.org/job/beam_PostCommit_Python_Examples_Flink/ws/src/sdks/python/apache_beam/io/gcp/bigquery.py>:2291: BeamDeprecationWarning: options is deprecated since First stable release. References to <pipeline>.options will not be supported
experiments = p.options.view_as(DebugOptions).experiments or []
apache_beam/examples/complete/game/hourly_team_score_it_test.py::HourlyTeamScoreIT::test_hourly_team_score_output_checksum_on_small_input
apache_beam/examples/cookbook/bigquery_tornadoes_it_test.py::BigqueryTornadoesIT::test_bigquery_tornadoes_it
apache_beam/examples/cookbook/filters_test.py::FiltersTest::test_filters_output_bigquery_matcher
<https://ci-beam.apache.org/job/beam_PostCommit_Python_Examples_Flink/ws/src/sdks/python/apache_beam/io/gcp/bigquery_file_loads.py>:1129: BeamDeprecationWarning: options is deprecated since First stable release. References to <pipeline>.options will not be supported
temp_location = p.options.view_as(GoogleCloudOptions).temp_location
apache_beam/examples/complete/game/hourly_team_score_it_test.py::HourlyTeamScoreIT::test_hourly_team_score_output_checksum_on_small_input
apache_beam/examples/cookbook/bigquery_tornadoes_it_test.py::BigqueryTornadoesIT::test_bigquery_tornadoes_it
apache_beam/examples/cookbook/filters_test.py::FiltersTest::test_filters_output_bigquery_matcher
<https://ci-beam.apache.org/job/beam_PostCommit_Python_Examples_Flink/ws/src/sdks/python/apache_beam/io/gcp/bigquery_file_loads.py>:1131: BeamDeprecationWarning: options is deprecated since First stable release. References to <pipeline>.options will not be supported
p.options.view_as(GoogleCloudOptions).job_name or 'AUTOMATIC_JOB_NAME')
apache_beam/examples/cookbook/bigquery_side_input_it_test.py::BigQuerySideInputIT::test_bigquery_side_input_it
apache_beam/examples/cookbook/bigquery_side_input_it_test.py::BigQuerySideInputIT::test_bigquery_side_input_it
apache_beam/examples/cookbook/bigquery_tornadoes_it_test.py::BigqueryTornadoesIT::test_bigquery_tornadoes_it
apache_beam/examples/cookbook/filters_test.py::FiltersTest::test_filters_output_bigquery_matcher
apache_beam/examples/dataframe/flight_delays_it_test.py::FlightDelaysTest::test_flight_delays
<https://ci-beam.apache.org/job/beam_PostCommit_Python_Examples_Flink/ws/src/sdks/python/apache_beam/io/gcp/bigquery.py>:2774: BeamDeprecationWarning: options is deprecated since First stable release. References to <pipeline>.options will not be supported
temp_location = pcoll.pipeline.options.view_as(
apache_beam/examples/cookbook/bigquery_side_input_it_test.py::BigQuerySideInputIT::test_bigquery_side_input_it
apache_beam/examples/cookbook/bigquery_side_input_it_test.py::BigQuerySideInputIT::test_bigquery_side_input_it
apache_beam/examples/cookbook/bigquery_tornadoes_it_test.py::BigqueryTornadoesIT::test_bigquery_tornadoes_it
apache_beam/examples/cookbook/filters_test.py::FiltersTest::test_filters_output_bigquery_matcher
apache_beam/examples/dataframe/flight_delays_it_test.py::FlightDelaysTest::test_flight_delays
<https://ci-beam.apache.org/job/beam_PostCommit_Python_Examples_Flink/ws/src/sdks/python/apache_beam/io/gcp/bigquery.py>:2776: BeamDeprecationWarning: options is deprecated since First stable release. References to <pipeline>.options will not be supported
job_name = pcoll.pipeline.options.view_as(GoogleCloudOptions).job_name
apache_beam/examples/cookbook/bigquery_side_input_it_test.py::BigQuerySideInputIT::test_bigquery_side_input_it
apache_beam/examples/cookbook/bigquery_side_input_it_test.py::BigQuerySideInputIT::test_bigquery_side_input_it
apache_beam/examples/cookbook/bigquery_tornadoes_it_test.py::BigqueryTornadoesIT::test_bigquery_tornadoes_it
apache_beam/examples/cookbook/filters_test.py::FiltersTest::test_filters_output_bigquery_matcher
apache_beam/examples/dataframe/flight_delays_it_test.py::FlightDelaysTest::test_flight_delays
<https://ci-beam.apache.org/job/beam_PostCommit_Python_Examples_Flink/ws/src/sdks/python/apache_beam/io/gcp/bigquery.py>:2807: BeamDeprecationWarning: options is deprecated since First stable release. References to <pipeline>.options will not be supported
| _PassThroughThenCleanup(files_to_remove_pcoll))
apache_beam/examples/cookbook/bigquery_tornadoes_it_test.py::BigqueryTornadoesIT::test_bigquery_tornadoes_it
apache_beam/examples/cookbook/filters_test.py::FiltersTest::test_filters_output_bigquery_matcher
<https://ci-beam.apache.org/job/beam_PostCommit_Python_Examples_Flink/ws/src/sdks/python/apache_beam/io/gcp/bigquery.py>:2281: BeamDeprecationWarning: options is deprecated since First stable release. References to <pipeline>.options will not be supported
self.table_reference.projectId = pcoll.pipeline.options.view_as(
apache_beam/examples/cookbook/bigquery_tornadoes_it_test.py::BigqueryTornadoesIT::test_bigquery_tornadoes_it
apache_beam/examples/cookbook/filters_test.py::FiltersTest::test_filters_output_bigquery_matcher
<https://ci-beam.apache.org/job/beam_PostCommit_Python_Examples_Flink/ws/src/sdks/python/apache_beam/io/gcp/tests/utils.py>:100: PendingDeprecationWarning: Client.dataset is deprecated and will be removed in a future version. Use a string like 'my_project.my_dataset' or a cloud.google.bigquery.DatasetReference object, instead.
table_ref = client.dataset(dataset_id).table(table_id)
apache_beam/examples/dataframe/flight_delays_it_test.py::FlightDelaysTest::test_flight_delays
apache_beam/examples/dataframe/flight_delays_it_test.py::FlightDelaysTest::test_flight_delays
<https://ci-beam.apache.org/job/beam_PostCommit_Python_Examples_Flink/ws/src/sdks/python/apache_beam/examples/dataframe/flight_delays.py>:47: FutureWarning: Dropping of nuisance columns in DataFrame reductions (with 'numeric_only=None') is deprecated; in a future version this will raise TypeError. Select only valid columns before calling the reduction.
return airline_df[at_top_airports].mean()
apache_beam/examples/dataframe/flight_delays_it_test.py::FlightDelaysTest::test_flight_delays
apache_beam/examples/dataframe/wordcount_test.py::WordCountTest::test_basics
<https://ci-beam.apache.org/job/beam_PostCommit_Python_Examples_Flink/ws/src/sdks/python/apache_beam/dataframe/io.py>:664: FutureWarning: WriteToFiles is experimental.
sink=lambda _: _WriteToPandasFileSink(
apache_beam/examples/dataframe/flight_delays_it_test.py::FlightDelaysTest::test_flight_delays
apache_beam/examples/dataframe/wordcount_test.py::WordCountTest::test_basics
<https://ci-beam.apache.org/job/beam_PostCommit_Python_Examples_Flink/ws/src/sdks/python/apache_beam/io/fileio.py>:590: BeamDeprecationWarning: options is deprecated since First stable release. References to <pipeline>.options will not be supported
p.options.view_as(GoogleCloudOptions).temp_location or
-- Docs: https://docs.pytest.org/en/stable/how-to/capture-warnings.html
- generated xml file: <https://ci-beam.apache.org/job/beam_PostCommit_Python_Examples_Flink/ws/src/sdks/python/pytest_postCommitExamples-flink-py37.xml> -
=========================== short test summary info ============================
FAILED apache_beam/examples/cookbook/bigquery_side_input_it_test.py::BigQuerySideInputIT::test_bigquery_side_input_it
= 1 failed, 21 passed, 3 skipped, 6634 deselected, 40 warnings in 550.28s (0:09:10) =
> Task :sdks:python:test-suites:portable:py37:flinkExamples FAILED
FAILURE: Build completed with 2 failures.
1: Task failed with an exception.
-----------
* Where:
Script '<https://ci-beam.apache.org/job/beam_PostCommit_Python_Examples_Flink/ws/src/sdks/python/test-suites/portable/common.gradle'> line: 240
* What went wrong:
Execution failed for task ':sdks:python:test-suites:portable:py39:flinkExamples'.
> Process 'command 'sh'' finished with non-zero exit value 1
* Try:
> Run with --stacktrace option to get the stack trace.
> Run with --info or --debug option to get more log output.
> Run with --scan to get full insights.
==============================================================================
2: Task failed with an exception.
-----------
* Where:
Script '<https://ci-beam.apache.org/job/beam_PostCommit_Python_Examples_Flink/ws/src/sdks/python/test-suites/portable/common.gradle'> line: 240
* What went wrong:
Execution failed for task ':sdks:python:test-suites:portable:py37:flinkExamples'.
> Process 'command 'sh'' finished with non-zero exit value 1
* Try:
> Run with --stacktrace option to get the stack trace.
> Run with --info or --debug option to get more log output.
> Run with --scan to get full insights.
==============================================================================
* Get more help at https://help.gradle.org
Deprecated Gradle features were used in this build, making it incompatible with Gradle 8.0.
You can use '--warning-mode all' to show the individual deprecation warnings and determine if they come from your own scripts or plugins.
See https://docs.gradle.org/7.4/userguide/command_line_interface.html#sec:command_line_warnings
BUILD FAILED in 10m 58s
133 actionable tasks: 87 executed, 44 from cache, 2 up-to-date
Publishing build scan...
https://gradle.com/s/k7hvfbvjbqqx2
Build step 'Invoke Gradle script' changed build result to FAILURE
Build step 'Invoke Gradle script' marked build as failure
---------------------------------------------------------------------
To unsubscribe, e-mail: builds-unsubscribe@beam.apache.org
For additional commands, e-mail: builds-help@beam.apache.org
Build failed in Jenkins: beam_PostCommit_Python_Examples_Flink #837
Posted by Apache Jenkins Server <je...@builds.apache.org>.
See <https://ci-beam.apache.org/job/beam_PostCommit_Python_Examples_Flink/837/display/redirect>
Changes:
------------------------------------------
[...truncated 109.52 MB...]
File "<https://ci-beam.apache.org/job/beam_PostCommit_Python_Examples_Flink/ws/src/build/gradleenv/2022703441/lib/python3.7/site-packages/grpc/_interceptor.py",> line 247, in continuation
compression=new_compression)
File "<https://ci-beam.apache.org/job/beam_PostCommit_Python_Examples_Flink/ws/src/build/gradleenv/2022703441/lib/python3.7/site-packages/grpc/_channel.py",> line 957, in with_call
return _end_unary_response_blocking(state, call, True, None)
File "<https://ci-beam.apache.org/job/beam_PostCommit_Python_Examples_Flink/ws/src/build/gradleenv/2022703441/lib/python3.7/site-packages/grpc/_channel.py",> line 849, in _end_unary_response_blocking
raise _InactiveRpcError(state)
grpc._channel._InactiveRpcError: <_InactiveRpcError of RPC that terminated with:
status = StatusCode.UNAVAILABLE
details = "failed to connect to all addresses; last error: UNKNOWN: Failed to connect to remote host: Connection refused"
debug_error_string = "UNKNOWN:Failed to pick subchannel {created_time:"2022-09-05T15:44:33.674551584+00:00", children:[UNKNOWN:failed to connect to all addresses; last error: UNKNOWN: Failed to connect to remote host: Connection refused {created_time:"2022-09-05T15:44:33.674539456+00:00", grpc_status:14}]}"
>
Exception in thread run_worker_3-1:
Traceback (most recent call last):
File "/usr/lib/python3.7/threading.py", line 926, in _bootstrap_inner
self.run()
File "/usr/lib/python3.7/threading.py", line 870, in run
self._target(*self._args, **self._kwargs)
File "<https://ci-beam.apache.org/job/beam_PostCommit_Python_Examples_Flink/ws/src/sdks/python/apache_beam/runners/worker/sdk_worker.py",> line 254, in run
for work_request in self._control_stub.Control(get_responses()):
File "<https://ci-beam.apache.org/job/beam_PostCommit_Python_Examples_Flink/ws/src/build/gradleenv/2022703441/lib/python3.7/site-packages/grpc/_channel.py",> line 426, in __next__
return self._next()
File "<https://ci-beam.apache.org/job/beam_PostCommit_Python_Examples_Flink/ws/src/build/gradleenv/2022703441/lib/python3.7/site-packages/grpc/_channel.py",> line 826, in _next
raise self
grpc._channel._MultiThreadedRendezvous: <_MultiThreadedRendezvous of RPC that terminated with:
status = StatusCode.CANCELLED
details = "Runner closed connection"
debug_error_string = "UNKNOWN:Error received from peer ipv4:127.0.0.1:34663 {created_time:"2022-09-05T15:44:33.663962439+00:00", grpc_status:1, grpc_message:"Runner closed connection"}"
>
Traceback (most recent call last):
File "<https://ci-beam.apache.org/job/beam_PostCommit_Python_Examples_Flink/ws/src/sdks/python/apache_beam/runners/worker/sdk_worker.py",> line 287, in _execute
response = task()
File "<https://ci-beam.apache.org/job/beam_PostCommit_Python_Examples_Flink/ws/src/sdks/python/apache_beam/runners/worker/sdk_worker.py",> line 360, in <lambda>
lambda: self.create_worker().do_instruction(request), request)
File "<https://ci-beam.apache.org/job/beam_PostCommit_Python_Examples_Flink/ws/src/sdks/python/apache_beam/runners/worker/sdk_worker.py",> line 597, in do_instruction
getattr(request, request_type), request.instruction_id)
File "<https://ci-beam.apache.org/job/beam_PostCommit_Python_Examples_Flink/ws/src/sdks/python/apache_beam/runners/worker/sdk_worker.py",> line 628, in process_bundle
instruction_id, request.process_bundle_descriptor_id)
File "<https://ci-beam.apache.org/job/beam_PostCommit_Python_Examples_Flink/ws/src/sdks/python/apache_beam/runners/worker/sdk_worker.py",> line 460, in get
self.fns[bundle_descriptor_id],
File "<https://ci-beam.apache.org/job/beam_PostCommit_Python_Examples_Flink/ws/src/sdks/python/apache_beam/runners/worker/sdk_worker.py",> line 1381, in __missing__
self[key] = self.default_factory(key) # type: ignore # pylint: disable=E1137
File "<https://ci-beam.apache.org/job/beam_PostCommit_Python_Examples_Flink/ws/src/sdks/python/apache_beam/runners/worker/sdk_worker.py",> line 204, in default_factory
process_bundle_descriptor_id=id))
File "<https://ci-beam.apache.org/job/beam_PostCommit_Python_Examples_Flink/ws/src/build/gradleenv/2022703441/lib/python3.7/site-packages/grpc/_interceptor.py",> line 221, in __call__
compression=compression)
File "<https://ci-beam.apache.org/job/beam_PostCommit_Python_Examples_Flink/ws/src/build/gradleenv/2022703441/lib/python3.7/site-packages/grpc/_interceptor.py",> line 257, in _with_call
return call.result(), call
File "<https://ci-beam.apache.org/job/beam_PostCommit_Python_Examples_Flink/ws/src/build/gradleenv/2022703441/lib/python3.7/site-packages/grpc/_channel.py",> line 343, in result
raise self
File "<https://ci-beam.apache.org/job/beam_PostCommit_Python_Examples_Flink/ws/src/build/gradleenv/2022703441/lib/python3.7/site-packages/grpc/_interceptor.py",> line 247, in continuation
compression=new_compression)
File "<https://ci-beam.apache.org/job/beam_PostCommit_Python_Examples_Flink/ws/src/build/gradleenv/2022703441/lib/python3.7/site-packages/grpc/_channel.py",> line 957, in with_call
return _end_unary_response_blocking(state, call, True, None)
File "<https://ci-beam.apache.org/job/beam_PostCommit_Python_Examples_Flink/ws/src/build/gradleenv/2022703441/lib/python3.7/site-packages/grpc/_channel.py",> line 849, in _end_unary_response_blocking
raise _InactiveRpcError(state)
grpc._channel._InactiveRpcError: <_InactiveRpcError of RPC that terminated with:
status = StatusCode.UNAVAILABLE
details = "failed to connect to all addresses; last error: UNKNOWN: Failed to connect to remote host: Connection refused"
debug_error_string = "UNKNOWN:Failed to pick subchannel {created_time:"2022-09-05T15:44:33.695362301+00:00", children:[UNKNOWN:failed to connect to all addresses; last error: UNKNOWN: Failed to connect to remote host: Connection refused {created_time:"2022-09-05T15:44:33.695347843+00:00", grpc_status:14}]}"
>
=============================== warnings summary ===============================
../../build/gradleenv/2022703441/lib/python3.7/site-packages/hdfs/config.py:15
<https://ci-beam.apache.org/job/beam_PostCommit_Python_Examples_Flink/ws/src/build/gradleenv/2022703441/lib/python3.7/site-packages/hdfs/config.py>:15: DeprecationWarning: the imp module is deprecated in favour of importlib; see the module's documentation for alternative uses
from imp import load_source
../../build/gradleenv/2022703441/lib/python3.7/site-packages/google/api_core/grpc_helpers.py:42
<https://ci-beam.apache.org/job/beam_PostCommit_Python_Examples_Flink/ws/src/build/gradleenv/2022703441/lib/python3.7/site-packages/google/api_core/grpc_helpers.py>:42: DeprecationWarning: Support for grpcio-gcp is deprecated. This feature will be
removed from `google-api-core` after January 1, 2024. If you need to
continue to use this feature, please pin to a specific version of
`google-api-core`.
DeprecationWarning,
apache_beam/examples/complete/game/hourly_team_score_it_test.py::HourlyTeamScoreIT::test_hourly_team_score_output_checksum_on_small_input
<https://ci-beam.apache.org/job/beam_PostCommit_Python_Examples_Flink/ws/src/sdks/python/apache_beam/io/gcp/tests/utils.py>:63: PendingDeprecationWarning: Client.dataset is deprecated and will be removed in a future version. Use a string like 'my_project.my_dataset' or a cloud.google.bigquery.DatasetReference object, instead.
dataset_ref = client.dataset(unique_dataset_name, project=project)
apache_beam/examples/complete/game/hourly_team_score_it_test.py::HourlyTeamScoreIT::test_hourly_team_score_output_checksum_on_small_input
apache_beam/examples/cookbook/bigquery_tornadoes_it_test.py::BigqueryTornadoesIT::test_bigquery_tornadoes_it
apache_beam/examples/cookbook/filters_test.py::FiltersTest::test_filters_output_bigquery_matcher
<https://ci-beam.apache.org/job/beam_PostCommit_Python_Examples_Flink/ws/src/sdks/python/apache_beam/io/gcp/bigquery.py>:2285: BeamDeprecationWarning: options is deprecated since First stable release. References to <pipeline>.options will not be supported
is_streaming_pipeline = p.options.view_as(StandardOptions).streaming
apache_beam/examples/complete/game/hourly_team_score_it_test.py::HourlyTeamScoreIT::test_hourly_team_score_output_checksum_on_small_input
apache_beam/examples/cookbook/bigquery_tornadoes_it_test.py::BigqueryTornadoesIT::test_bigquery_tornadoes_it
apache_beam/examples/cookbook/filters_test.py::FiltersTest::test_filters_output_bigquery_matcher
<https://ci-beam.apache.org/job/beam_PostCommit_Python_Examples_Flink/ws/src/sdks/python/apache_beam/io/gcp/bigquery.py>:2291: BeamDeprecationWarning: options is deprecated since First stable release. References to <pipeline>.options will not be supported
experiments = p.options.view_as(DebugOptions).experiments or []
apache_beam/examples/complete/game/hourly_team_score_it_test.py::HourlyTeamScoreIT::test_hourly_team_score_output_checksum_on_small_input
apache_beam/examples/cookbook/bigquery_tornadoes_it_test.py::BigqueryTornadoesIT::test_bigquery_tornadoes_it
apache_beam/examples/cookbook/filters_test.py::FiltersTest::test_filters_output_bigquery_matcher
<https://ci-beam.apache.org/job/beam_PostCommit_Python_Examples_Flink/ws/src/sdks/python/apache_beam/io/gcp/bigquery_file_loads.py>:1129: BeamDeprecationWarning: options is deprecated since First stable release. References to <pipeline>.options will not be supported
temp_location = p.options.view_as(GoogleCloudOptions).temp_location
apache_beam/examples/complete/game/hourly_team_score_it_test.py::HourlyTeamScoreIT::test_hourly_team_score_output_checksum_on_small_input
apache_beam/examples/cookbook/bigquery_tornadoes_it_test.py::BigqueryTornadoesIT::test_bigquery_tornadoes_it
apache_beam/examples/cookbook/filters_test.py::FiltersTest::test_filters_output_bigquery_matcher
<https://ci-beam.apache.org/job/beam_PostCommit_Python_Examples_Flink/ws/src/sdks/python/apache_beam/io/gcp/bigquery_file_loads.py>:1131: BeamDeprecationWarning: options is deprecated since First stable release. References to <pipeline>.options will not be supported
p.options.view_as(GoogleCloudOptions).job_name or 'AUTOMATIC_JOB_NAME')
apache_beam/examples/cookbook/bigquery_side_input_it_test.py::BigQuerySideInputIT::test_bigquery_side_input_it
apache_beam/examples/cookbook/bigquery_side_input_it_test.py::BigQuerySideInputIT::test_bigquery_side_input_it
apache_beam/examples/cookbook/bigquery_tornadoes_it_test.py::BigqueryTornadoesIT::test_bigquery_tornadoes_it
apache_beam/examples/cookbook/filters_test.py::FiltersTest::test_filters_output_bigquery_matcher
apache_beam/examples/dataframe/flight_delays_it_test.py::FlightDelaysTest::test_flight_delays
<https://ci-beam.apache.org/job/beam_PostCommit_Python_Examples_Flink/ws/src/sdks/python/apache_beam/io/gcp/bigquery.py>:2774: BeamDeprecationWarning: options is deprecated since First stable release. References to <pipeline>.options will not be supported
temp_location = pcoll.pipeline.options.view_as(
apache_beam/examples/cookbook/bigquery_side_input_it_test.py::BigQuerySideInputIT::test_bigquery_side_input_it
apache_beam/examples/cookbook/bigquery_side_input_it_test.py::BigQuerySideInputIT::test_bigquery_side_input_it
apache_beam/examples/cookbook/bigquery_tornadoes_it_test.py::BigqueryTornadoesIT::test_bigquery_tornadoes_it
apache_beam/examples/cookbook/filters_test.py::FiltersTest::test_filters_output_bigquery_matcher
apache_beam/examples/dataframe/flight_delays_it_test.py::FlightDelaysTest::test_flight_delays
<https://ci-beam.apache.org/job/beam_PostCommit_Python_Examples_Flink/ws/src/sdks/python/apache_beam/io/gcp/bigquery.py>:2776: BeamDeprecationWarning: options is deprecated since First stable release. References to <pipeline>.options will not be supported
job_name = pcoll.pipeline.options.view_as(GoogleCloudOptions).job_name
apache_beam/examples/cookbook/bigquery_side_input_it_test.py::BigQuerySideInputIT::test_bigquery_side_input_it
apache_beam/examples/cookbook/bigquery_side_input_it_test.py::BigQuerySideInputIT::test_bigquery_side_input_it
apache_beam/examples/cookbook/bigquery_tornadoes_it_test.py::BigqueryTornadoesIT::test_bigquery_tornadoes_it
apache_beam/examples/cookbook/filters_test.py::FiltersTest::test_filters_output_bigquery_matcher
apache_beam/examples/dataframe/flight_delays_it_test.py::FlightDelaysTest::test_flight_delays
<https://ci-beam.apache.org/job/beam_PostCommit_Python_Examples_Flink/ws/src/sdks/python/apache_beam/io/gcp/bigquery.py>:2807: BeamDeprecationWarning: options is deprecated since First stable release. References to <pipeline>.options will not be supported
Exception in thread read_grpc_client_inputs:
Traceback (most recent call last):
File "/usr/lib/python3.7/threading.py", line 926, in _bootstrap_inner
self.run()
File "/usr/lib/python3.7/threading.py", line 870, in run
self._target(*self._args, **self._kwargs)
File "<https://ci-beam.apache.org/job/beam_PostCommit_Python_Examples_Flink/ws/src/sdks/python/apache_beam/runners/worker/data_plane.py",> line 671, in <lambda>
target=lambda: self._read_inputs(elements_iterator),
File "<https://ci-beam.apache.org/job/beam_PostCommit_Python_Examples_Flink/ws/src/sdks/python/apache_beam/runners/worker/data_plane.py",> line 654, in _read_inputs
for elements in elements_iterator:
File "<https://ci-beam.apache.org/job/beam_PostCommit_Python_Examples_Flink/ws/src/build/gradleenv/2022703441/lib/python3.7/site-packages/grpc/_channel.py",> line 426, in __next__
return self._next()
File "<https://ci-beam.apache.org/job/beam_PostCommit_Python_Examples_Flink/ws/src/build/gradleenv/2022703441/lib/python3.7/site-packages/grpc/_channel.py",> line 826, in _next
raise self
grpc._channel._MultiThreadedRendezvous: <_MultiThreadedRendezvous of RPC that terminated with:
status = StatusCode.CANCELLED
details = "Multiplexer hanging up"
debug_error_string = "UNKNOWN:Error received from peer ipv4:127.0.0.1:39805 {grpc_message:"Multiplexer hanging up", grpc_status:1, created_time:"2022-09-05T15:45:10.502099708+00:00"}"
>
Exception in thread read_grpc_client_inputs:
Traceback (most recent call last):
File "/usr/lib/python3.7/threading.py", line 926, in _bootstrap_inner
self.run()
File "/usr/lib/python3.7/threading.py", line 870, in run
self._target(*self._args, **self._kwargs)
File "<https://ci-beam.apache.org/job/beam_PostCommit_Python_Examples_Flink/ws/src/sdks/python/apache_beam/runners/worker/data_plane.py",> line 671, in <lambda>
target=lambda: self._read_inputs(elements_iterator),
File "<https://ci-beam.apache.org/job/beam_PostCommit_Python_Examples_Flink/ws/src/sdks/python/apache_beam/runners/worker/data_plane.py",> line 654, in _read_inputs
for elements in elements_iterator:
File "<https://ci-beam.apache.org/job/beam_PostCommit_Python_Examples_Flink/ws/src/build/gradleenv/2022703441/lib/python3.7/site-packages/grpc/_channel.py",> line 426, in __next__
return self._next()
File "<https://ci-beam.apache.org/job/beam_PostCommit_Python_Examples_Flink/ws/src/build/gradleenv/2022703441/lib/python3.7/site-packages/grpc/_channel.py",> line 826, in _next
raise self
grpc._channel._MultiThreadedRendezvous: <_MultiThreadedRendezvous of RPC that terminated with:
status = StatusCode.CANCELLED
details = "Multiplexer hanging up"
debug_error_string = "UNKNOWN:Error received from peer ipv4:127.0.0.1:36619 {created_time:"2022-09-05T15:45:18.514196029+00:00", grpc_status:1, grpc_message:"Multiplexer hanging up"}"
>
| _PassThroughThenCleanup(files_to_remove_pcoll))
apache_beam/examples/cookbook/bigquery_tornadoes_it_test.py::BigqueryTornadoesIT::test_bigquery_tornadoes_it
apache_beam/examples/cookbook/filters_test.py::FiltersTest::test_filters_output_bigquery_matcher
<https://ci-beam.apache.org/job/beam_PostCommit_Python_Examples_Flink/ws/src/sdks/python/apache_beam/io/gcp/bigquery.py>:2281: BeamDeprecationWarning: options is deprecated since First stable release. References to <pipeline>.options will not be supported
self.table_reference.projectId = pcoll.pipeline.options.view_as(
apache_beam/examples/cookbook/bigquery_tornadoes_it_test.py::BigqueryTornadoesIT::test_bigquery_tornadoes_it
apache_beam/examples/cookbook/filters_test.py::FiltersTest::test_filters_output_bigquery_matcher
<https://ci-beam.apache.org/job/beam_PostCommit_Python_Examples_Flink/ws/src/sdks/python/apache_beam/io/gcp/tests/utils.py>:100: PendingDeprecationWarning: Client.dataset is deprecated and will be removed in a future version. Use a string like 'my_project.my_dataset' or a cloud.google.bigquery.DatasetReference object, instead.
table_ref = client.dataset(dataset_id).table(table_id)
apache_beam/examples/dataframe/flight_delays_it_test.py::FlightDelaysTest::test_flight_delays
apache_beam/examples/dataframe/flight_delays_it_test.py::FlightDelaysTest::test_flight_delays
<https://ci-beam.apache.org/job/beam_PostCommit_Python_Examples_Flink/ws/src/sdks/python/apache_beam/examples/dataframe/flight_delays.py>:47: FutureWarning: Dropping of nuisance columns in DataFrame reductions (with 'numeric_only=None') is deprecated; in a future version this will raise TypeError. Select only valid columns before calling the reduction.
return airline_df[at_top_airports].mean()
apache_beam/examples/dataframe/flight_delays_it_test.py::FlightDelaysTest::test_flight_delays
apache_beam/examples/dataframe/wordcount_test.py::WordCountTest::test_basics
<https://ci-beam.apache.org/job/beam_PostCommit_Python_Examples_Flink/ws/src/sdks/python/apache_beam/dataframe/io.py>:664: FutureWarning: WriteToFiles is experimental.
sink=lambda _: _WriteToPandasFileSink(
apache_beam/examples/dataframe/flight_delays_it_test.py::FlightDelaysTest::test_flight_delays
apache_beam/examples/dataframe/wordcount_test.py::WordCountTest::test_basics
<https://ci-beam.apache.org/job/beam_PostCommit_Python_Examples_Flink/ws/src/sdks/python/apache_beam/io/fileio.py>:590: BeamDeprecationWarning: options is deprecated since First stable release. References to <pipeline>.options will not be supported
p.options.view_as(GoogleCloudOptions).temp_location or
-- Docs: https://docs.pytest.org/en/stable/how-to/capture-warnings.html
- generated xml file: <https://ci-beam.apache.org/job/beam_PostCommit_Python_Examples_Flink/ws/src/sdks/python/pytest_postCommitExamples-flink-py37.xml> -
=========================== short test summary info ============================
FAILED apache_beam/examples/cookbook/bigquery_side_input_it_test.py::BigQuerySideInputIT::test_bigquery_side_input_it
= 1 failed, 21 passed, 3 skipped, 6634 deselected, 40 warnings in 549.47s (0:09:09) =
> Task :sdks:python:test-suites:portable:py37:flinkExamples FAILED
FAILURE: Build completed with 2 failures.
1: Task failed with an exception.
-----------
* Where:
Script '<https://ci-beam.apache.org/job/beam_PostCommit_Python_Examples_Flink/ws/src/sdks/python/test-suites/portable/common.gradle'> line: 240
* What went wrong:
Execution failed for task ':sdks:python:test-suites:portable:py39:flinkExamples'.
> Process 'command 'sh'' finished with non-zero exit value 1
* Try:
> Run with --stacktrace option to get the stack trace.
> Run with --info or --debug option to get more log output.
> Run with --scan to get full insights.
==============================================================================
2: Task failed with an exception.
-----------
* Where:
Script '<https://ci-beam.apache.org/job/beam_PostCommit_Python_Examples_Flink/ws/src/sdks/python/test-suites/portable/common.gradle'> line: 240
* What went wrong:
Execution failed for task ':sdks:python:test-suites:portable:py37:flinkExamples'.
> Process 'command 'sh'' finished with non-zero exit value 1
* Try:
> Run with --stacktrace option to get the stack trace.
> Run with --info or --debug option to get more log output.
> Run with --scan to get full insights.
==============================================================================
* Get more help at https://help.gradle.org
Deprecated Gradle features were used in this build, making it incompatible with Gradle 8.0.
You can use '--warning-mode all' to show the individual deprecation warnings and determine if they come from your own scripts or plugins.
See https://docs.gradle.org/7.4/userguide/command_line_interface.html#sec:command_line_warnings
BUILD FAILED in 11m
133 actionable tasks: 87 executed, 44 from cache, 2 up-to-date
Publishing build scan...
https://gradle.com/s/q2mps5ukvokre
Build step 'Invoke Gradle script' changed build result to FAILURE
Build step 'Invoke Gradle script' marked build as failure
---------------------------------------------------------------------
To unsubscribe, e-mail: builds-unsubscribe@beam.apache.org
For additional commands, e-mail: builds-help@beam.apache.org
Build failed in Jenkins: beam_PostCommit_Python_Examples_Flink #836
Posted by Apache Jenkins Server <je...@builds.apache.org>.
See <https://ci-beam.apache.org/job/beam_PostCommit_Python_Examples_Flink/836/display/redirect?page=changes>
Changes:
[noreply] Generalize interface of InfluxDBPublisher to support more use cases
------------------------------------------
[...truncated 108.73 MB...]
INFO apache_beam.utils.subprocess_server:subprocess_server.py:132 Sep 05, 2022 9:44:11 AM org.apache.flink.runtime.taskmanager.Task transitionState
INFO apache_beam.utils.subprocess_server:subprocess_server.py:132 INFO: DataSource (Impulse) (10/16)#0 (de6aa6aa7b379737d4e82fde5b3f842e) switched from RUNNING to FINISHED.
INFO apache_beam.runners.portability.portable_runner:portable_runner.py:583 Job state changed to FAILED
INFO apache_beam.utils.subprocess_server:subprocess_server.py:132 Sep 05, 2022 9:44:11 AM org.apache.flink.runtime.taskmanager.Task doRun
INFO apache_beam.utils.subprocess_server:subprocess_server.py:132 INFO: Freeing task resources for DataSource (Impulse) (11/16)#0 (7229477c41b4a20d7907573cd269b3d8).
INFO apache_beam.utils.subprocess_server:subprocess_server.py:132 Sep 05, 2022 9:44:11 AM org.apache.flink.runtime.taskmanager.Task doRun
INFO apache_beam.utils.subprocess_server:subprocess_server.py:132 INFO: Freeing task resources for DataSource (Impulse) (10/16)#0 (de6aa6aa7b379737d4e82fde5b3f842e).
INFO apache_beam.utils.subprocess_server:subprocess_server.py:132 Sep 05, 2022 9:44:11 AM org.apache.flink.runtime.executiongraph.Execution transitionState
INFO apache_beam.utils.subprocess_server:subprocess_server.py:132 INFO: DataSource (Impulse) (12/16) (eca0a341b669c67c8080a4c4190af0e0) switched from INITIALIZING to RUNNING.
INFO apache_beam.utils.subprocess_server:subprocess_server.py:132 Sep 05, 2022 9:44:11 AM org.apache.flink.runtime.taskexecutor.TaskExecutor submitTask
INFO apache_beam.utils.subprocess_server:subprocess_server.py:132 INFO: Received task CHAIN MapPartition (MapPartition at [1]create groups/Map(decode)) -> FlatMap (FlatMap at ExtractOutput[0]) (7/16)#0 (841f90646475c3350c0971d84147502c), deploy into slot with allocation id 4b3e839f4557c5bfeb6f8222f5f7ae5e.
INFO apache_beam.utils.subprocess_server:subprocess_server.py:132 Sep 05, 2022 9:44:11 AM org.apache.flink.runtime.executiongraph.Execution transitionState
INFO apache_beam.utils.subprocess_server:subprocess_server.py:132 INFO: DataSource (Impulse) (8/16) (91de8195b310ad461d3e316c13cd29c7) switched from DEPLOYING to INITIALIZING.
INFO apache_beam.utils.subprocess_server:subprocess_server.py:132 Sep 05, 2022 9:44:11 AM org.apache.flink.runtime.executiongraph.Execution transitionState
INFO apache_beam.utils.subprocess_server:subprocess_server.py:132 INFO: DataSource (Impulse) (8/16) (91de8195b310ad461d3e316c13cd29c7) switched from INITIALIZING to RUNNING.
INFO apache_beam.utils.subprocess_server:subprocess_server.py:132 Sep 05, 2022 9:44:11 AM org.apache.flink.runtime.taskexecutor.slot.TaskSlotTableImpl markExistingSlotActive
INFO apache_beam.utils.subprocess_server:subprocess_server.py:132 INFO: Activate slot 0201f97e198d372a50f8d218554d8b82.
INFO apache_beam.utils.subprocess_server:subprocess_server.py:132 Sep 05, 2022 9:44:11 AM org.apache.flink.runtime.taskmanager.Task transitionState
INFO apache_beam.utils.subprocess_server:subprocess_server.py:132 INFO: CHAIN MapPartition (MapPartition at [1]create groups/Map(decode)) -> FlatMap (FlatMap at ExtractOutput[0]) (7/16)#0 (841f90646475c3350c0971d84147502c) switched from CREATED to DEPLOYING.
INFO apache_beam.utils.subprocess_server:subprocess_server.py:132 Sep 05, 2022 9:44:11 AM org.apache.flink.runtime.taskmanager.Task transitionState
INFO apache_beam.utils.subprocess_server:subprocess_server.py:132 INFO: DataSource (Impulse) (12/16)#0 (eca0a341b669c67c8080a4c4190af0e0) switched from RUNNING to FINISHED.
INFO apache_beam.utils.subprocess_server:subprocess_server.py:132 Sep 05, 2022 9:44:11 AM org.apache.flink.runtime.taskmanager.Task transitionState
INFO apache_beam.utils.subprocess_server:subprocess_server.py:132 INFO: DataSource (Impulse) (8/16)#0 (91de8195b310ad461d3e316c13cd29c7) switched from RUNNING to FINISHED.
INFO apache_beam.utils.subprocess_server:subprocess_server.py:132 Sep 05, 2022 9:44:11 AM org.apache.flink.runtime.taskmanager.Task doRun
INFO apache_beam.utils.subprocess_server:subprocess_server.py:132 INFO: Freeing task resources for DataSource (Impulse) (12/16)#0 (eca0a341b669c67c8080a4c4190af0e0).
INFO apache_beam.utils.subprocess_server:subprocess_server.py:132 Sep 05, 2022 9:44:11 AM org.apache.flink.runtime.executiongraph.Execution transitionState
INFO apache_beam.utils.subprocess_server:subprocess_server.py:132 INFO: DataSource (Impulse) (13/16) (33c3f3ea783b7810b5e1ad17430ba246) switched from DEPLOYING to INITIALIZING.
INFO apache_beam.utils.subprocess_server:subprocess_server.py:132 Sep 05, 2022 9:44:11 AM org.apache.flink.runtime.taskmanager.Task doRun
INFO apache_beam.utils.subprocess_server:subprocess_server.py:132 INFO: Freeing task resources for DataSource (Impulse) (8/16)#0 (91de8195b310ad461d3e316c13cd29c7).
INFO apache_beam.utils.subprocess_server:subprocess_server.py:132 Sep 05, 2022 9:44:11 AM org.apache.flink.runtime.taskmanager.Task doRun
INFO apache_beam.utils.subprocess_server:subprocess_server.py:132 INFO: Loading JAR files for task CHAIN MapPartition (MapPartition at [1]create groups/Map(decode)) -> FlatMap (FlatMap at ExtractOutput[0]) (7/16)#0 (841f90646475c3350c0971d84147502c) [DEPLOYING].
INFO apache_beam.utils.subprocess_server:subprocess_server.py:132 Sep 05, 2022 9:44:11 AM org.apache.flink.runtime.executiongraph.Execution transitionState
INFO apache_beam.utils.subprocess_server:subprocess_server.py:132 INFO: DataSource (Impulse) (13/16) (33c3f3ea783b7810b5e1ad17430ba246) switched from INITIALIZING to RUNNING.
INFO apache_beam.utils.subprocess_server:subprocess_server.py:132 Sep 05, 2022 9:44:11 AM org.apache.flink.runtime.executiongraph.Execution transitionState
INFO apache_beam.utils.subprocess_server:subprocess_server.py:132 INFO: DataSource (Impulse) (14/16) (87070b36f04f67a3805c9fce7f134dcf) switched from DEPLOYING to INITIALIZING.
INFO apache_beam.utils.subprocess_server:subprocess_server.py:132 Sep 05, 2022 9:44:11 AM org.apache.flink.runtime.taskmanager.Task transitionState
INFO apache_beam.utils.subprocess_server:subprocess_server.py:132 INFO: CHAIN MapPartition (MapPartition at [1]create groups/Map(decode)) -> FlatMap (FlatMap at ExtractOutput[0]) (7/16)#0 (841f90646475c3350c0971d84147502c) switched from DEPLOYING to INITIALIZING.
INFO apache_beam.utils.subprocess_server:subprocess_server.py:132 Sep 05, 2022 9:44:11 AM org.apache.flink.runtime.taskexecutor.TaskExecutor submitTask
INFO apache_beam.utils.subprocess_server:subprocess_server.py:132 INFO: Received task CHAIN MapPartition (MapPartition at [1]create groups/Map(decode)) -> FlatMap (FlatMap at ExtractOutput[0]) (8/16)#0 (1616922ac1b336c1b549fb074ae5c402), deploy into slot with allocation id 0201f97e198d372a50f8d218554d8b82.
INFO apache_beam.utils.subprocess_server:subprocess_server.py:132 Sep 05, 2022 9:44:11 AM org.apache.flink.runtime.executiongraph.Execution transitionState
INFO apache_beam.utils.subprocess_server:subprocess_server.py:132 INFO: DataSource (Impulse) (14/16) (87070b36f04f67a3805c9fce7f134dcf) switched from INITIALIZING to RUNNING.
INFO apache_beam.utils.subprocess_server:subprocess_server.py:132 Sep 05, 2022 9:44:11 AM org.apache.flink.runtime.taskmanager.Task transitionState
INFO apache_beam.utils.subprocess_server:subprocess_server.py:132 INFO: CHAIN MapPartition (MapPartition at [1]create groups/Map(decode)) -> FlatMap (FlatMap at ExtractOutput[0]) (7/16)#0 (841f90646475c3350c0971d84147502c) switched from INITIALIZING to RUNNING.
=============================== warnings summary ===============================
../../build/gradleenv/2022703441/lib/python3.7/site-packages/hdfs/config.py:15
<https://ci-beam.apache.org/job/beam_PostCommit_Python_Examples_Flink/ws/src/build/gradleenv/2022703441/lib/python3.7/site-packages/hdfs/config.py>:15: DeprecationWarning: the imp module is deprecated in favour of importlib; see the module's documentation for alternative uses
from imp import load_source
../../build/gradleenv/2022703441/lib/python3.7/site-packages/google/api_core/grpc_helpers.py:42
<https://ci-beam.apache.org/job/beam_PostCommit_Python_Examples_Flink/ws/src/build/gradleenv/2022703441/lib/python3.7/site-packages/google/api_core/grpc_helpers.py>:42: DeprecationWarning: Support for grpcio-gcp is deprecated. This feature will be
removed from `google-api-core` after January 1, 2024. If you need to
continue to use this feature, please pin to a specific version of
`google-api-core`.
DeprecationWarning,
apache_beam/examples/complete/game/hourly_team_score_it_test.py::HourlyTeamScoreIT::test_hourly_team_score_output_checksum_on_small_input
<https://ci-beam.apache.org/job/beam_PostCommit_Python_Examples_Flink/ws/src/sdks/python/apache_beam/io/gcp/tests/utils.py>:63: PendingDeprecationWarning: Client.dataset is deprecated and will be removed in a future version. Use a string like 'my_project.my_dataset' or a cloud.google.bigquery.DatasetReference object, instead.
dataset_ref = client.dataset(unique_dataset_name, project=project)
apache_beam/examples/complete/game/hourly_team_score_it_test.py::HourlyTeamScoreIT::test_hourly_team_score_output_checksum_on_small_input
apache_beam/examples/cookbook/bigquery_tornadoes_it_test.py::BigqueryTornadoesIT::test_bigquery_tornadoes_it
apache_beam/examples/cookbook/filters_test.py::FiltersTest::test_filters_output_bigquery_matcher
<https://ci-beam.apache.org/job/beam_PostCommit_Python_Examples_Flink/ws/src/sdks/python/apache_beam/io/gcp/bigquery.py>:2285: BeamDeprecationWarning: options is deprecated since First stable release. References to <pipeline>.options will not be supported
is_streaming_pipeline = p.options.view_as(StandardOptions).streaming
apache_beam/examples/complete/game/hourly_team_score_it_test.py::HourlyTeamScoreIT::test_hourly_team_score_output_checksum_on_small_input
apache_beam/examples/cookbook/bigquery_tornadoes_it_test.py::BigqueryTornadoesIT::test_bigquery_tornadoes_it
apache_beam/examples/cookbook/filters_test.py::FiltersTest::test_filters_output_bigquery_matcher
<https://ci-beam.apache.org/job/beam_PostCommit_Python_Examples_Flink/ws/src/sdks/python/apache_beam/io/gcp/bigquery.py>:2291: BeamDeprecationWarning: options is deprecated since First stable release. References to <pipeline>.options will not be supported
experiments = p.options.view_as(DebugOptions).experiments or []
apache_beam/examples/complete/game/hourly_team_score_it_test.py::HourlyTeamScoreIT::test_hourly_team_score_output_checksum_on_small_input
apache_beam/examples/cookbook/bigquery_tornadoes_it_test.py::BigqueryTornadoesIT::test_bigquery_tornadoes_it
apache_beam/examples/cookbook/filters_test.py::FiltersTest::test_filters_output_bigquery_matcher
<https://ci-beam.apache.org/job/beam_PostCommit_Python_Examples_Flink/ws/src/sdks/python/apache_beam/io/gcp/bigquery_file_loads.py>:1129: BeamDeprecationWarning: options is deprecated since First stable release. References to <pipeline>.options will not be supported
temp_location = p.options.view_as(GoogleCloudOptions).temp_location
apache_beam/examples/complete/game/hourly_team_score_it_test.py::HourlyTeamScoreIT::test_hourly_team_score_output_checksum_on_small_input
apache_beam/examples/cookbook/bigquery_tornadoes_it_test.py::BigqueryTornadoesIT::test_bigquery_tornadoes_it
apache_beam/examples/cookbook/filters_test.py::FiltersTest::test_filters_output_bigquery_matcher
<https://ci-beam.apache.org/job/beam_PostCommit_Python_Examples_Flink/ws/src/sdks/python/apache_beam/io/gcp/bigquery_file_loads.py>:1131: BeamDeprecationWarning: options is deprecated since First stable release. References to <pipeline>.options will not be supported
p.options.view_as(GoogleCloudOptions).job_name or 'AUTOMATIC_JOB_NAME')
apache_beam/examples/cookbook/bigquery_side_input_it_test.py::BigQuerySideInputIT::test_bigquery_side_input_it
apache_beam/examples/cookbook/bigquery_side_input_it_test.py::BigQuerySideInputIT::test_bigquery_side_input_it
apache_beam/examples/cookbook/bigquery_tornadoes_it_test.py::BigqueryTornadoesIT::test_bigquery_tornadoes_it
apache_beam/examples/cookbook/filters_test.py::FiltersTest::test_filters_output_bigquery_matcher
apache_beam/examples/dataframe/flight_delays_it_test.py::FlightDelaysTest::test_flight_delays
<https://ci-beam.apache.org/job/beam_PostCommit_Python_Examples_Flink/ws/src/sdks/python/apache_beam/io/gcp/bigquery.py>:2774: BeamDeprecationWarning: options is deprecated since First stable release. References to <pipeline>.options will not be supported
temp_location = pcoll.pipeline.options.view_as(
apache_beam/examples/cookbook/bigquery_side_input_it_test.py::BigQuerySideInputIT::test_bigquery_side_input_it
apache_beam/examples/cookbook/bigquery_side_input_it_test.py::BigQuerySideInputIT::test_bigquery_side_input_it
apache_beam/examples/cookbook/bigquery_tornadoes_it_test.py::BigqueryTornadoesIT::test_bigquery_tornadoes_it
apache_beam/examples/cookbook/filters_test.py::FiltersTest::test_filters_output_bigquery_matcher
apache_beam/examples/dataframe/flight_delays_it_test.py::FlightDelaysTest::test_flight_delays
<https://ci-beam.apache.org/job/beam_PostCommit_Python_Examples_Flink/ws/src/sdks/python/apache_beam/io/gcp/bigquery.py>:2776: BeamDeprecationWarning: options is deprecated since First stable release. References to <pipeline>.options will not be supported
job_name = pcoll.pipeline.options.view_as(GoogleCloudOptions).job_name
apache_beam/examples/cookbook/bigquery_side_input_it_test.py::BigQuerySideInputIT::test_bigquery_side_input_it
apache_beam/examples/cookbook/bigquery_side_input_it_test.py::BigQuerySideInputIT::test_bigquery_side_input_it
apache_beam/examples/cookbook/bigquery_tornadoes_it_test.py::BigqueryTornadoesIT::test_bigquery_tornadoes_it
apache_beam/examples/cookbook/filters_test.py::FiltersTest::test_filters_output_bigquery_matcher
apache_beam/examples/dataframe/flight_delays_it_test.py::FlightDelaysTest::test_flight_delays
<https://ci-beam.apache.org/job/beam_PostCommit_Python_Examples_Flink/ws/src/sdks/python/apache_beam/io/gcp/bigquery.py>:2807: BeamDeprecationWarning: options is deprecated since First stable release. References to <pipeline>.options will not be supported
| _PassThroughThenCleanup(files_to_remove_pcoll))
apache_beam/examples/cookbook/bigquery_tornadoes_it_test.py::BigqueryTornadoesIT::test_bigquery_tornadoes_it
apache_beam/examples/cookbook/filters_test.py::FiltersTest::test_filters_output_bigquery_matcher
<https://ci-beam.apache.org/job/beam_PostCommit_Python_Examples_Flink/ws/src/sdks/python/apache_beam/io/gcp/bigquery.py>:2281: BeamDeprecationWarning: options is deprecated since First stable release. References to <pipeline>.options will not be supported
self.table_reference.projectId = pcoll.pipeline.options.view_as(
apache_beam/examples/cookbook/bigquery_tornadoes_it_test.py::BigqueryTornadoesIT::test_bigquery_tornadoes_it
apache_beam/examples/cookbook/filters_test.py::FiltersTest::test_filters_output_bigquery_matcher
<https://ci-beam.apache.org/job/beam_PostCommit_Python_Examples_Flink/ws/src/sdks/python/apache_beam/io/gcp/tests/utils.py>:100: PendingDeprecationWarning: Client.dataset is deprecated and will be removed in a future version. Use a string like 'my_project.my_dataset' or a cloud.google.bigquery.DatasetReference object, instead.
table_ref = client.dataset(dataset_id).table(table_id)
apache_beam/examples/dataframe/flight_delays_it_test.py::FlightDelaysTest::test_flight_delays
apache_beam/examples/dataframe/flight_delays_it_test.py::FlightDelaysTest::test_flight_delays
<https://ci-beam.apache.org/job/beam_PostCommit_Python_Examples_Flink/ws/src/sdks/python/apache_beam/examples/dataframe/flight_delays.py>:47: FutureWarning: Dropping of nuisance columns in DataFrame reductions (with 'numeric_only=None') is deprecated; in a future version this will raise TypeError. Select only valid columns before calling the reduction.
return airline_df[at_top_airports].mean()
apache_beam/examples/dataframe/flight_delays_it_test.py::FlightDelaysTest::test_flight_delays
apache_beam/examples/dataframe/wordcount_test.py::WordCountTest::test_basics
<https://ci-beam.apache.org/job/beam_PostCommit_Python_Examples_Flink/ws/src/sdks/python/apache_beam/dataframe/io.py>:664: FutureWarning: WriteToFiles is experimental.
sink=lambda _: _WriteToPandasFileSink(
apache_beam/examples/dataframe/flight_delays_it_test.py::FlightDelaysTest::test_flight_delays
apache_beam/examples/dataframe/wordcount_test.py::WordCountTest::test_basics
<https://ci-beam.apache.org/job/beam_PostCommit_Python_Examples_Flink/ws/src/sdks/python/apache_beam/io/fileio.py>:590: BeamDeprecationWarning: options is deprecated since First stable release. References to <pipeline>.options will not be supported
p.options.view_as(GoogleCloudOptions).temp_location or
-- Docs: https://docs.pytest.org/en/stable/how-to/capture-warnings.html
- generated xml file: <https://ci-beam.apache.org/job/beam_PostCommit_Python_Examples_Flink/ws/src/sdks/python/pytest_postCommitExamples-flink-py37.xml> -
=========================== short test summary info ============================
FAILED apache_beam/examples/cookbook/bigquery_side_input_it_test.py::BigQuerySideInputIT::test_bigquery_side_input_it
Exception in thread read_grpc_client_inputs:
Traceback (most recent call last):
File "/usr/lib/python3.7/threading.py", line 926, in _bootstrap_inner
self.run()
File "/usr/lib/python3.7/threading.py", line 870, in run
self._target(*self._args, **self._kwargs)
= 1 failed, 21 passed, 3 skipped, 6634 deselected, 40 warnings in 546.93s (0:09:06) =
File "<https://ci-beam.apache.org/job/beam_PostCommit_Python_Examples_Flink/ws/src/sdks/python/apache_beam/runners/worker/data_plane.py",> line 671, in <lambda>
target=lambda: self._read_inputs(elements_iterator),
File "<https://ci-beam.apache.org/job/beam_PostCommit_Python_Examples_Flink/ws/src/sdks/python/apache_beam/runners/worker/data_plane.py",> line 654, in _read_inputs
for elements in elements_iterator:
File "<https://ci-beam.apache.org/job/beam_PostCommit_Python_Examples_Flink/ws/src/build/gradleenv/2022703441/lib/python3.7/site-packages/grpc/_channel.py",> line 426, in __next__
return self._next()
File "<https://ci-beam.apache.org/job/beam_PostCommit_Python_Examples_Flink/ws/src/build/gradleenv/2022703441/lib/python3.7/site-packages/grpc/_channel.py",> line 826, in _next
raise self
grpc._channel._MultiThreadedRendezvous: <_MultiThreadedRendezvous of RPC that terminated with:
status = StatusCode.CANCELLED
details = "Multiplexer hanging up"
debug_error_string = "UNKNOWN:Error received from peer ipv4:127.0.0.1:39095 {created_time:"2022-09-05T09:46:01.776217273+00:00", grpc_status:1, grpc_message:"Multiplexer hanging up"}"
>
Exception in thread read_grpc_client_inputs:
Traceback (most recent call last):
File "/usr/lib/python3.7/threading.py", line 926, in _bootstrap_inner
self.run()
File "/usr/lib/python3.7/threading.py", line 870, in run
self._target(*self._args, **self._kwargs)
File "<https://ci-beam.apache.org/job/beam_PostCommit_Python_Examples_Flink/ws/src/sdks/python/apache_beam/runners/worker/data_plane.py",> line 671, in <lambda>
target=lambda: self._read_inputs(elements_iterator),
File "<https://ci-beam.apache.org/job/beam_PostCommit_Python_Examples_Flink/ws/src/sdks/python/apache_beam/runners/worker/data_plane.py",> line 654, in _read_inputs
for elements in elements_iterator:
File "<https://ci-beam.apache.org/job/beam_PostCommit_Python_Examples_Flink/ws/src/build/gradleenv/2022703441/lib/python3.7/site-packages/grpc/_channel.py",> line 426, in __next__
return self._next()
File "<https://ci-beam.apache.org/job/beam_PostCommit_Python_Examples_Flink/ws/src/build/gradleenv/2022703441/lib/python3.7/site-packages/grpc/_channel.py",> line 826, in _next
raise self
grpc._channel._MultiThreadedRendezvous: <_MultiThreadedRendezvous of RPC that terminated with:
status = StatusCode.CANCELLED
details = "Multiplexer hanging up"
debug_error_string = "UNKNOWN:Error received from peer ipv4:127.0.0.1:46255 {created_time:"2022-09-05T09:46:04.260059487+00:00", grpc_status:1, grpc_message:"Multiplexer hanging up"}"
>
Exception in thread read_grpc_client_inputs:
Traceback (most recent call last):
File "/usr/lib/python3.7/threading.py", line 926, in _bootstrap_inner
self.run()
File "/usr/lib/python3.7/threading.py", line 870, in run
self._target(*self._args, **self._kwargs)
File "<https://ci-beam.apache.org/job/beam_PostCommit_Python_Examples_Flink/ws/src/sdks/python/apache_beam/runners/worker/data_plane.py",> line 671, in <lambda>
target=lambda: self._read_inputs(elements_iterator),
File "<https://ci-beam.apache.org/job/beam_PostCommit_Python_Examples_Flink/ws/src/sdks/python/apache_beam/runners/worker/data_plane.py",> line 654, in _read_inputs
for elements in elements_iterator:
File "<https://ci-beam.apache.org/job/beam_PostCommit_Python_Examples_Flink/ws/src/build/gradleenv/2022703441/lib/python3.7/site-packages/grpc/_channel.py",> line 426, in __next__
return self._next()
File "<https://ci-beam.apache.org/job/beam_PostCommit_Python_Examples_Flink/ws/src/build/gradleenv/2022703441/lib/python3.7/site-packages/grpc/_channel.py",> line 826, in _next
raise self
grpc._channel._MultiThreadedRendezvous: <_MultiThreadedRendezvous of RPC that terminated with:
status = StatusCode.CANCELLED
details = "Multiplexer hanging up"
debug_error_string = "UNKNOWN:Error received from peer ipv4:127.0.0.1:42941 {grpc_message:"Multiplexer hanging up", grpc_status:1, created_time:"2022-09-05T09:46:14.980001581+00:00"}"
>
> Task :sdks:python:test-suites:portable:py37:flinkExamples FAILED
FAILURE: Build completed with 2 failures.
1: Task failed with an exception.
-----------
* Where:
Script '<https://ci-beam.apache.org/job/beam_PostCommit_Python_Examples_Flink/ws/src/sdks/python/test-suites/portable/common.gradle'> line: 240
* What went wrong:
Execution failed for task ':sdks:python:test-suites:portable:py39:flinkExamples'.
> Process 'command 'sh'' finished with non-zero exit value 1
* Try:
> Run with --stacktrace option to get the stack trace.
> Run with --info or --debug option to get more log output.
> Run with --scan to get full insights.
==============================================================================
2: Task failed with an exception.
-----------
* Where:
Script '<https://ci-beam.apache.org/job/beam_PostCommit_Python_Examples_Flink/ws/src/sdks/python/test-suites/portable/common.gradle'> line: 240
* What went wrong:
Execution failed for task ':sdks:python:test-suites:portable:py37:flinkExamples'.
> Process 'command 'sh'' finished with non-zero exit value 1
* Try:
> Run with --stacktrace option to get the stack trace.
> Run with --info or --debug option to get more log output.
> Run with --scan to get full insights.
==============================================================================
* Get more help at https://help.gradle.org
Deprecated Gradle features were used in this build, making it incompatible with Gradle 8.0.
You can use '--warning-mode all' to show the individual deprecation warnings and determine if they come from your own scripts or plugins.
See https://docs.gradle.org/7.4/userguide/command_line_interface.html#sec:command_line_warnings
BUILD FAILED in 10m 48s
133 actionable tasks: 87 executed, 44 from cache, 2 up-to-date
Publishing build scan...
https://gradle.com/s/esukah2gim222
Build step 'Invoke Gradle script' changed build result to FAILURE
Build step 'Invoke Gradle script' marked build as failure
---------------------------------------------------------------------
To unsubscribe, e-mail: builds-unsubscribe@beam.apache.org
For additional commands, e-mail: builds-help@beam.apache.org
Build failed in Jenkins: beam_PostCommit_Python_Examples_Flink #835
Posted by Apache Jenkins Server <je...@builds.apache.org>.
See <https://ci-beam.apache.org/job/beam_PostCommit_Python_Examples_Flink/835/display/redirect>
Changes:
------------------------------------------
[...truncated 109.17 MB...]
INFO apache_beam.utils.subprocess_server:subprocess_server.py:132 INFO: Received task MapPartition (MapPartition at [2]read corpus/{Read, _PassThroughThenCleanup}) (9/16)#0 (7dd34e97b1cff88d6d3d4a875b378c72), deploy into slot with allocation id 7eab754a15fb16d1cf2c3016e5f0ad02.
INFO apache_beam.utils.subprocess_server:subprocess_server.py:132 Sep 05, 2022 3:44:53 AM org.apache.flink.runtime.executiongraph.Execution transitionState
INFO apache_beam.utils.subprocess_server:subprocess_server.py:132 INFO: DataSource (Impulse) (5/16) (2532c4e7b86e00b9d6c19eff7d0b64cf) switched from INITIALIZING to RUNNING.
INFO apache_beam.utils.subprocess_server:subprocess_server.py:132 Sep 05, 2022 3:44:53 AM org.apache.flink.runtime.taskexecutor.slot.TaskSlotTableImpl markExistingSlotActive
INFO apache_beam.utils.subprocess_server:subprocess_server.py:132 INFO: Activate slot 340cf317b8d69a8972f1367c6a5a7916.
INFO apache_beam.utils.subprocess_server:subprocess_server.py:132 Sep 05, 2022 3:44:53 AM org.apache.flink.runtime.executiongraph.Execution transitionState
INFO apache_beam.utils.subprocess_server:subprocess_server.py:132 INFO: DataSource (Impulse) (6/16) (826b4adecc070bb8cdebfe2ff78a1c69) switched from DEPLOYING to INITIALIZING.
INFO apache_beam.utils.subprocess_server:subprocess_server.py:132 Sep 05, 2022 3:44:53 AM org.apache.flink.runtime.taskmanager.Task transitionState
INFO apache_beam.utils.subprocess_server:subprocess_server.py:132 INFO: DataSource (Impulse) (2/16)#0 (d6f40f54977b76376feb6a59848cd8e9) switched from RUNNING to FINISHED.
INFO apache_beam.utils.subprocess_server:subprocess_server.py:132 Sep 05, 2022 3:44:53 AM org.apache.flink.runtime.taskmanager.Task doRun
INFO apache_beam.utils.subprocess_server:subprocess_server.py:132 INFO: Freeing task resources for DataSource (Impulse) (2/16)#0 (d6f40f54977b76376feb6a59848cd8e9).
INFO apache_beam.utils.subprocess_server:subprocess_server.py:132 Sep 05, 2022 3:44:53 AM org.apache.flink.runtime.executiongraph.Execution transitionState
INFO apache_beam.utils.subprocess_server:subprocess_server.py:132 INFO: DataSource (Impulse) (6/16) (826b4adecc070bb8cdebfe2ff78a1c69) switched from INITIALIZING to RUNNING.
INFO apache_beam.utils.subprocess_server:subprocess_server.py:132 Sep 05, 2022 3:44:53 AM org.apache.flink.runtime.executiongraph.Execution transitionState
INFO apache_beam.utils.subprocess_server:subprocess_server.py:132 INFO: DataSource (Impulse) (7/16) (33ce711b826f93a2945d88dab68a9313) switched from DEPLOYING to INITIALIZING.
INFO apache_beam.utils.subprocess_server:subprocess_server.py:132 Sep 05, 2022 3:44:53 AM org.apache.flink.runtime.taskmanager.Task transitionState
INFO apache_beam.utils.subprocess_server:subprocess_server.py:132 INFO: MapPartition (MapPartition at [2]read corpus/{Read, _PassThroughThenCleanup}) (9/16)#0 (7dd34e97b1cff88d6d3d4a875b378c72) switched from CREATED to DEPLOYING.
INFO apache_beam.utils.subprocess_server:subprocess_server.py:132 Sep 05, 2022 3:44:53 AM org.apache.flink.runtime.taskmanager.Task transitionState
INFO apache_beam.utils.subprocess_server:subprocess_server.py:132 INFO: DataSource (Impulse) (3/16)#0 (8c44844281a491d0f1e74d390c965468) switched from RUNNING to FINISHED.
INFO apache_beam.utils.subprocess_server:subprocess_server.py:132 Sep 05, 2022 3:44:53 AM org.apache.flink.runtime.taskmanager.Task doRun
INFO apache_beam.utils.subprocess_server:subprocess_server.py:132 INFO: Freeing task resources for DataSource (Impulse) (3/16)#0 (8c44844281a491d0f1e74d390c965468).
INFO apache_beam.utils.subprocess_server:subprocess_server.py:132 Sep 05, 2022 3:44:53 AM org.apache.flink.runtime.taskmanager.Task doRun
INFO apache_beam.utils.subprocess_server:subprocess_server.py:132 INFO: Loading JAR files for task MapPartition (MapPartition at [2]read corpus/{Read, _PassThroughThenCleanup}) (9/16)#0 (7dd34e97b1cff88d6d3d4a875b378c72) [DEPLOYING].
INFO apache_beam.utils.subprocess_server:subprocess_server.py:132 Sep 05, 2022 3:44:53 AM org.apache.flink.runtime.taskmanager.Task transitionState
INFO apache_beam.utils.subprocess_server:subprocess_server.py:132 INFO: DataSource (Impulse) (4/16)#0 (f03e0a8974c91e927246e99b449ab8d3) switched from RUNNING to FINISHED.
INFO apache_beam.utils.subprocess_server:subprocess_server.py:132 Sep 05, 2022 3:44:53 AM org.apache.flink.runtime.executiongraph.Execution transitionState
INFO apache_beam.utils.subprocess_server:subprocess_server.py:132 INFO: DataSource (Impulse) (7/16) (33ce711b826f93a2945d88dab68a9313) switched from INITIALIZING to RUNNING.
INFO apache_beam.utils.subprocess_server:subprocess_server.py:132 Sep 05, 2022 3:44:53 AM org.apache.flink.runtime.taskmanager.Task doRun
INFO apache_beam.utils.subprocess_server:subprocess_server.py:132 INFO: Freeing task resources for DataSource (Impulse) (4/16)#0 (f03e0a8974c91e927246e99b449ab8d3).
INFO apache_beam.utils.subprocess_server:subprocess_server.py:132 Sep 05, 2022 3:44:53 AM org.apache.flink.runtime.taskmanager.Task transitionState
INFO apache_beam.utils.subprocess_server:subprocess_server.py:132 INFO: MapPartition (MapPartition at [2]read corpus/{Read, _PassThroughThenCleanup}) (9/16)#0 (7dd34e97b1cff88d6d3d4a875b378c72) switched from DEPLOYING to INITIALIZING.
INFO apache_beam.utils.subprocess_server:subprocess_server.py:132 Sep 05, 2022 3:44:53 AM org.apache.flink.runtime.executiongraph.Execution transitionState
INFO apache_beam.utils.subprocess_server:subprocess_server.py:132 INFO: DataSource (Impulse) (8/16) (7758a52f0c1030cbc7ba5660cdf411eb) switched from DEPLOYING to INITIALIZING.
INFO apache_beam.utils.subprocess_server:subprocess_server.py:132 Sep 05, 2022 3:44:53 AM org.apache.flink.runtime.taskmanager.Task transitionState
INFO apache_beam.utils.subprocess_server:subprocess_server.py:132 INFO: DataSource (Impulse) (5/16)#0 (2532c4e7b86e00b9d6c19eff7d0b64cf) switched from RUNNING to FINISHED.
INFO apache_beam.utils.subprocess_server:subprocess_server.py:132 Sep 05, 2022 3:44:53 AM org.apache.flink.runtime.taskmanager.Task doRun
INFO apache_beam.utils.subprocess_server:subprocess_server.py:132 INFO: Freeing task resources for DataSource (Impulse) (5/16)#0 (2532c4e7b86e00b9d6c19eff7d0b64cf).
INFO apache_beam.utils.subprocess_server:subprocess_server.py:132 Sep 05, 2022 3:44:53 AM org.apache.flink.runtime.taskmanager.Task transitionState
---------------------------- Captured log teardown -----------------------------
INFO apache_beam.utils.subprocess_server:subprocess_server.py:132
INFO apache_beam.utils.subprocess_server:subprocess_server.py:132 Sep 05, 2022 3:44:54 AM org.apache.flink.runtime.taskmanager.Task doRun
INFO apache_beam.utils.subprocess_server:subprocess_server.py:132 INFO: Freeing task resources for DataSink (DiscardingOutput) (10/16)#0 (c85f721eaa820e32dd3933bd846e2bc1).
INFO apache_beam.utils.subprocess_server:subprocess_server.py:132 Sep 05, 2022 3:44:54 AM org.apache.flink.runtime.taskexecutor.TaskExecutor submitTask
=============================== warnings summary ===============================
../../build/gradleenv/2022703441/lib/python3.7/site-packages/hdfs/config.py:15
<https://ci-beam.apache.org/job/beam_PostCommit_Python_Examples_Flink/ws/src/build/gradleenv/2022703441/lib/python3.7/site-packages/hdfs/config.py>:15: DeprecationWarning: the imp module is deprecated in favour of importlib; see the module's documentation for alternative uses
from imp import load_source
../../build/gradleenv/2022703441/lib/python3.7/site-packages/google/api_core/grpc_helpers.py:42
<https://ci-beam.apache.org/job/beam_PostCommit_Python_Examples_Flink/ws/src/build/gradleenv/2022703441/lib/python3.7/site-packages/google/api_core/grpc_helpers.py>:42: DeprecationWarning: Support for grpcio-gcp is deprecated. This feature will be
removed from `google-api-core` after January 1, 2024. If you need to
continue to use this feature, please pin to a specific version of
`google-api-core`.
DeprecationWarning,
apache_beam/examples/complete/game/hourly_team_score_it_test.py::HourlyTeamScoreIT::test_hourly_team_score_output_checksum_on_small_input
<https://ci-beam.apache.org/job/beam_PostCommit_Python_Examples_Flink/ws/src/sdks/python/apache_beam/io/gcp/tests/utils.py>:63: PendingDeprecationWarning: Client.dataset is deprecated and will be removed in a future version. Use a string like 'my_project.my_dataset' or a cloud.google.bigquery.DatasetReference object, instead.
dataset_ref = client.dataset(unique_dataset_name, project=project)
apache_beam/examples/complete/game/hourly_team_score_it_test.py::HourlyTeamScoreIT::test_hourly_team_score_output_checksum_on_small_input
apache_beam/examples/cookbook/bigquery_tornadoes_it_test.py::BigqueryTornadoesIT::test_bigquery_tornadoes_it
apache_beam/examples/cookbook/filters_test.py::FiltersTest::test_filters_output_bigquery_matcher
<https://ci-beam.apache.org/job/beam_PostCommit_Python_Examples_Flink/ws/src/sdks/python/apache_beam/io/gcp/bigquery.py>:2285: BeamDeprecationWarning: options is deprecated since First stable release. References to <pipeline>.options will not be supported
is_streaming_pipeline = p.options.view_as(StandardOptions).streaming
apache_beam/examples/complete/game/hourly_team_score_it_test.py::HourlyTeamScoreIT::test_hourly_team_score_output_checksum_on_small_input
apache_beam/examples/cookbook/bigquery_tornadoes_it_test.py::BigqueryTornadoesIT::test_bigquery_tornadoes_it
apache_beam/examples/cookbook/filters_test.py::FiltersTest::test_filters_output_bigquery_matcher
<https://ci-beam.apache.org/job/beam_PostCommit_Python_Examples_Flink/ws/src/sdks/python/apache_beam/io/gcp/bigquery.py>:2291: BeamDeprecationWarning: options is deprecated since First stable release. References to <pipeline>.options will not be supported
experiments = p.options.view_as(DebugOptions).experiments or []
apache_beam/examples/complete/game/hourly_team_score_it_test.py::HourlyTeamScoreIT::test_hourly_team_score_output_checksum_on_small_input
apache_beam/examples/cookbook/bigquery_tornadoes_it_test.py::BigqueryTornadoesIT::test_bigquery_tornadoes_it
apache_beam/examples/cookbook/filters_test.py::FiltersTest::test_filters_output_bigquery_matcher
<https://ci-beam.apache.org/job/beam_PostCommit_Python_Examples_Flink/ws/src/sdks/python/apache_beam/io/gcp/bigquery_file_loads.py>:1129: BeamDeprecationWarning: options is deprecated since First stable release. References to <pipeline>.options will not be supported
temp_location = p.options.view_as(GoogleCloudOptions).temp_location
apache_beam/examples/complete/game/hourly_team_score_it_test.py::HourlyTeamScoreIT::test_hourly_team_score_output_checksum_on_small_input
apache_beam/examples/cookbook/bigquery_tornadoes_it_test.py::BigqueryTornadoesIT::test_bigquery_tornadoes_it
apache_beam/examples/cookbook/filters_test.py::FiltersTest::test_filters_output_bigquery_matcher
<https://ci-beam.apache.org/job/beam_PostCommit_Python_Examples_Flink/ws/src/sdks/python/apache_beam/io/gcp/bigquery_file_loads.py>:1131: BeamDeprecationWarning: options is deprecated since First stable release. References to <pipeline>.options will not be supported
p.options.view_as(GoogleCloudOptions).job_name or 'AUTOMATIC_JOB_NAME')
apache_beam/examples/cookbook/bigquery_side_input_it_test.py::BigQuerySideInputIT::test_bigquery_side_input_it
apache_beam/examples/cookbook/bigquery_side_input_it_test.py::BigQuerySideInputIT::test_bigquery_side_input_it
apache_beam/examples/cookbook/bigquery_tornadoes_it_test.py::BigqueryTornadoesIT::test_bigquery_tornadoes_it
apache_beam/examples/cookbook/filters_test.py::FiltersTest::test_filters_output_bigquery_matcher
apache_beam/examples/dataframe/flight_delays_it_test.py::FlightDelaysTest::test_flight_delays
<https://ci-beam.apache.org/job/beam_PostCommit_Python_Examples_Flink/ws/src/sdks/python/apache_beam/io/gcp/bigquery.py>:2774: BeamDeprecationWarning: options is deprecated since First stable release. References to <pipeline>.options will not be supported
temp_location = pcoll.pipeline.options.view_as(
apache_beam/examples/cookbook/bigquery_side_input_it_test.py::BigQuerySideInputIT::test_bigquery_side_input_it
apache_beam/examples/cookbook/bigquery_side_input_it_test.py::BigQuerySideInputIT::test_bigquery_side_input_it
apache_beam/examples/cookbook/bigquery_tornadoes_it_test.py::BigqueryTornadoesIT::test_bigquery_tornadoes_it
apache_beam/examples/cookbook/filters_test.py::FiltersTest::test_filters_output_bigquery_matcher
apache_beam/examples/dataframe/flight_delays_it_test.py::FlightDelaysTest::test_flight_delays
<https://ci-beam.apache.org/job/beam_PostCommit_Python_Examples_Flink/ws/src/sdks/python/apache_beam/io/gcp/bigquery.py>:2776: BeamDeprecationWarning: options is deprecated since First stable release. References to <pipeline>.options will not be supported
job_name = pcoll.pipeline.options.view_as(GoogleCloudOptions).job_name
apache_beam/examples/cookbook/bigquery_side_input_it_test.py::BigQuerySideInputIT::test_bigquery_side_input_it
apache_beam/examples/cookbook/bigquery_side_input_it_test.py::BigQuerySideInputIT::test_bigquery_side_input_it
apache_beam/examples/cookbook/bigquery_tornadoes_it_test.py::BigqueryTornadoesIT::test_bigquery_tornadoes_it
apache_beam/examples/cookbook/filters_test.py::FiltersTest::test_filters_output_bigquery_matcher
apache_beam/examples/dataframe/flight_delays_it_test.py::FlightDelaysTest::test_flight_delays
<https://ci-beam.apache.org/job/beam_PostCommit_Python_Examples_Flink/ws/src/sdks/python/apache_beam/io/gcp/bigquery.py>:2807: BeamDeprecationWarning: options is deprecated since First stable release. References to <pipeline>.options will not be supported
| _PassThroughThenCleanup(files_to_remove_pcoll))
apache_beam/examples/cookbook/bigquery_tornadoes_it_test.py::BigqueryTornadoesIT::test_bigquery_tornadoes_it
apache_beam/examples/cookbook/filters_test.py::FiltersTest::test_filters_output_bigquery_matcher
<https://ci-beam.apache.org/job/beam_PostCommit_Python_Examples_Flink/ws/src/sdks/python/apache_beam/io/gcp/bigquery.py>:2281: BeamDeprecationWarning: options is deprecated since First stable release. References to <pipeline>.options will not be supported
self.table_reference.projectId = pcoll.pipeline.options.view_as(
apache_beam/examples/cookbook/bigquery_tornadoes_it_test.py::BigqueryTornadoesIT::test_bigquery_tornadoes_it
apache_beam/examples/cookbook/filters_test.py::FiltersTest::test_filters_output_bigquery_matcher
<https://ci-beam.apache.org/job/beam_PostCommit_Python_Examples_Flink/ws/src/sdks/python/apache_beam/io/gcp/tests/utils.py>:100: PendingDeprecationWarning: Client.dataset is deprecated and will be removed in a future version. Use a string like 'my_project.my_dataset' or a cloud.google.bigquery.DatasetReference object, instead.
table_ref = client.dataset(dataset_id).table(table_id)
Exception in thread read_grpc_client_inputs:
apache_beam/examples/dataframe/flight_delays_it_test.py::FlightDelaysTest::test_flight_delays
apache_beam/examples/dataframe/flight_delays_it_test.py::FlightDelaysTest::test_flight_delays
<https://ci-beam.apache.org/job/beam_PostCommit_Python_Examples_Flink/ws/src/sdks/python/apache_beam/examples/dataframe/flight_delays.py>:47: FutureWarning: Dropping of nuisance columns in DataFrame reductions (with 'numeric_only=None') is deprecated; in a future version this will raise TypeError. Select only valid columns before calling the reduction.
return airline_df[at_top_airports].mean()
apache_beam/examples/dataframe/flight_delays_it_test.py::FlightDelaysTest::test_flight_delays
apache_beam/examples/dataframe/wordcount_test.py::WordCountTest::test_basics
Traceback (most recent call last):
File "/usr/lib/python3.7/threading.py", line 926, in _bootstrap_inner
self.run()
File "/usr/lib/python3.7/threading.py", line 870, in run
self._target(*self._args, **self._kwargs)
<https://ci-beam.apache.org/job/beam_PostCommit_Python_Examples_Flink/ws/src/sdks/python/apache_beam/dataframe/io.py>:664: FutureWarning: WriteToFiles is experimental.
sink=lambda _: _WriteToPandasFileSink(
apache_beam/examples/dataframe/flight_delays_it_test.py::FlightDelaysTest::test_flight_delays
apache_beam/examples/dataframe/wordcount_test.py::WordCountTest::test_basics
<https://ci-beam.apache.org/job/beam_PostCommit_Python_Examples_Flink/ws/src/sdks/python/apache_beam/io/fileio.py>:590: BeamDeprecationWarning: options is deprecated since First stable release. References to <pipeline>.options will not be supported
p.options.view_as(GoogleCloudOptions).temp_location or
-- Docs: https://docs.pytest.org/en/stable/how-to/capture-warnings.html
- generated xml file: <https://ci-beam.apache.org/job/beam_PostCommit_Python_Examples_Flink/ws/src/sdks/python/pytest_postCommitExamples-flink-py37.xml> -
=========================== short test summary info ============================
FAILED apache_beam/examples/cookbook/bigquery_side_input_it_test.py::BigQuerySideInputIT::test_bigquery_side_input_it
= 1 failed, 21 passed, 3 skipped, 6634 deselected, 40 warnings in 568.86s (0:09:28) =
File "<https://ci-beam.apache.org/job/beam_PostCommit_Python_Examples_Flink/ws/src/sdks/python/apache_beam/runners/worker/data_plane.py",> line 671, in <lambda>
target=lambda: self._read_inputs(elements_iterator),
File "<https://ci-beam.apache.org/job/beam_PostCommit_Python_Examples_Flink/ws/src/sdks/python/apache_beam/runners/worker/data_plane.py",> line 654, in _read_inputs
for elements in elements_iterator:
File "<https://ci-beam.apache.org/job/beam_PostCommit_Python_Examples_Flink/ws/src/build/gradleenv/2022703441/lib/python3.7/site-packages/grpc/_channel.py",> line 426, in __next__
return self._next()
File "<https://ci-beam.apache.org/job/beam_PostCommit_Python_Examples_Flink/ws/src/build/gradleenv/2022703441/lib/python3.7/site-packages/grpc/_channel.py",> line 826, in _next
raise self
grpc._channel._MultiThreadedRendezvous: <_MultiThreadedRendezvous of RPC that terminated with:
status = StatusCode.CANCELLED
details = "Multiplexer hanging up"
debug_error_string = "UNKNOWN:Error received from peer ipv4:127.0.0.1:46013 {created_time:"2022-09-05T03:45:58.912098143+00:00", grpc_status:1, grpc_message:"Multiplexer hanging up"}"
>
Exception in thread read_grpc_client_inputs:
Traceback (most recent call last):
File "/usr/lib/python3.7/threading.py", line 926, in _bootstrap_inner
self.run()
File "/usr/lib/python3.7/threading.py", line 870, in run
self._target(*self._args, **self._kwargs)
File "<https://ci-beam.apache.org/job/beam_PostCommit_Python_Examples_Flink/ws/src/sdks/python/apache_beam/runners/worker/data_plane.py",> line 671, in <lambda>
target=lambda: self._read_inputs(elements_iterator),
File "<https://ci-beam.apache.org/job/beam_PostCommit_Python_Examples_Flink/ws/src/sdks/python/apache_beam/runners/worker/data_plane.py",> line 654, in _read_inputs
for elements in elements_iterator:
File "<https://ci-beam.apache.org/job/beam_PostCommit_Python_Examples_Flink/ws/src/build/gradleenv/2022703441/lib/python3.7/site-packages/grpc/_channel.py",> line 426, in __next__
return self._next()
File "<https://ci-beam.apache.org/job/beam_PostCommit_Python_Examples_Flink/ws/src/build/gradleenv/2022703441/lib/python3.7/site-packages/grpc/_channel.py",> line 826, in _next
raise self
grpc._channel._MultiThreadedRendezvous: <_MultiThreadedRendezvous of RPC that terminated with:
status = StatusCode.CANCELLED
details = "Multiplexer hanging up"
debug_error_string = "UNKNOWN:Error received from peer ipv4:127.0.0.1:45901 {grpc_message:"Multiplexer hanging up", grpc_status:1, created_time:"2022-09-05T03:45:59.657200099+00:00"}"
>
Exception in thread read_grpc_client_inputs:
Traceback (most recent call last):
File "/usr/lib/python3.7/threading.py", line 926, in _bootstrap_inner
self.run()
File "/usr/lib/python3.7/threading.py", line 870, in run
self._target(*self._args, **self._kwargs)
File "<https://ci-beam.apache.org/job/beam_PostCommit_Python_Examples_Flink/ws/src/sdks/python/apache_beam/runners/worker/data_plane.py",> line 671, in <lambda>
target=lambda: self._read_inputs(elements_iterator),
File "<https://ci-beam.apache.org/job/beam_PostCommit_Python_Examples_Flink/ws/src/sdks/python/apache_beam/runners/worker/data_plane.py",> line 654, in _read_inputs
for elements in elements_iterator:
File "<https://ci-beam.apache.org/job/beam_PostCommit_Python_Examples_Flink/ws/src/build/gradleenv/2022703441/lib/python3.7/site-packages/grpc/_channel.py",> line 426, in __next__
return self._next()
File "<https://ci-beam.apache.org/job/beam_PostCommit_Python_Examples_Flink/ws/src/build/gradleenv/2022703441/lib/python3.7/site-packages/grpc/_channel.py",> line 826, in _next
raise self
grpc._channel._MultiThreadedRendezvous: <_MultiThreadedRendezvous of RPC that terminated with:
status = StatusCode.CANCELLED
details = "Multiplexer hanging up"
debug_error_string = "UNKNOWN:Error received from peer ipv4:127.0.0.1:35805 {grpc_message:"Multiplexer hanging up", grpc_status:1, created_time:"2022-09-05T03:46:34.032872744+00:00"}"
>
> Task :sdks:python:test-suites:portable:py37:flinkExamples FAILED
FAILURE: Build completed with 2 failures.
1: Task failed with an exception.
-----------
* Where:
Script '<https://ci-beam.apache.org/job/beam_PostCommit_Python_Examples_Flink/ws/src/sdks/python/test-suites/portable/common.gradle'> line: 240
* What went wrong:
Execution failed for task ':sdks:python:test-suites:portable:py39:flinkExamples'.
> Process 'command 'sh'' finished with non-zero exit value 1
* Try:
> Run with --stacktrace option to get the stack trace.
> Run with --info or --debug option to get more log output.
> Run with --scan to get full insights.
==============================================================================
2: Task failed with an exception.
-----------
* Where:
Script '<https://ci-beam.apache.org/job/beam_PostCommit_Python_Examples_Flink/ws/src/sdks/python/test-suites/portable/common.gradle'> line: 240
* What went wrong:
Execution failed for task ':sdks:python:test-suites:portable:py37:flinkExamples'.
> Process 'command 'sh'' finished with non-zero exit value 1
* Try:
> Run with --stacktrace option to get the stack trace.
> Run with --info or --debug option to get more log output.
> Run with --scan to get full insights.
==============================================================================
* Get more help at https://help.gradle.org
Deprecated Gradle features were used in this build, making it incompatible with Gradle 8.0.
You can use '--warning-mode all' to show the individual deprecation warnings and determine if they come from your own scripts or plugins.
See https://docs.gradle.org/7.4/userguide/command_line_interface.html#sec:command_line_warnings
BUILD FAILED in 11m 16s
133 actionable tasks: 87 executed, 44 from cache, 2 up-to-date
Publishing build scan...
https://gradle.com/s/i3rpvgne6zz7g
Build step 'Invoke Gradle script' changed build result to FAILURE
Build step 'Invoke Gradle script' marked build as failure
---------------------------------------------------------------------
To unsubscribe, e-mail: builds-unsubscribe@beam.apache.org
For additional commands, e-mail: builds-help@beam.apache.org
Build failed in Jenkins: beam_PostCommit_Python_Examples_Flink #834
Posted by Apache Jenkins Server <je...@builds.apache.org>.
See <https://ci-beam.apache.org/job/beam_PostCommit_Python_Examples_Flink/834/display/redirect>
Changes:
------------------------------------------
[...truncated 109.25 MB...]
INFO apache_beam.utils.subprocess_server:subprocess_server.py:132 Sep 04, 2022 9:44:05 PM org.apache.flink.runtime.metrics.groups.TaskMetricGroup getOrAddOperator
INFO apache_beam.utils.subprocess_server:subprocess_server.py:132 WARNING: The operator name MapPartition (MapPartition at [3]read corpus/Read/{Map(<lambda at iobase.py:908>), SDFBoundedSourceReader}) exceeded the 80 characters length limit and was truncated.
INFO apache_beam.utils.subprocess_server:subprocess_server.py:132 Sep 04, 2022 9:44:05 PM org.apache.flink.runtime.taskexecutor.TaskExecutor submitTask
INFO apache_beam.utils.subprocess_server:subprocess_server.py:132 INFO: Received task CHAIN MapPartition (MapPartition at [3]read corpus/Read/{Map(<lambda at iobase.py:908>), SDFBoundedSourceReader}) -> FlatMap (FlatMap at ExtractOutput[0]) (14/16)#0 (f5f05f8d9152e9ebc0827db776e19918), deploy into slot with allocation id d782bfe7d016047cbe79fc5bc3e2e34c.
INFO apache_beam.utils.subprocess_server:subprocess_server.py:132 Sep 04, 2022 9:44:05 PM org.apache.flink.runtime.taskmanager.Task transitionState
INFO apache_beam.utils.subprocess_server:subprocess_server.py:132 INFO: CHAIN MapPartition (MapPartition at [3]read corpus/Read/{Map(<lambda at iobase.py:908>), SDFBoundedSourceReader}) -> FlatMap (FlatMap at ExtractOutput[0]) (13/16)#0 (077ab6f9deb028059e2889948fd929cc) switched from DEPLOYING to INITIALIZING.
INFO apache_beam.utils.subprocess_server:subprocess_server.py:132 Sep 04, 2022 9:44:05 PM org.apache.flink.runtime.taskmanager.Task transitionState
INFO apache_beam.utils.subprocess_server:subprocess_server.py:132 INFO: CHAIN MapPartition (MapPartition at [3]read corpus/Read/{Map(<lambda at iobase.py:908>), SDFBoundedSourceReader}) -> FlatMap (FlatMap at ExtractOutput[0]) (13/16)#0 (077ab6f9deb028059e2889948fd929cc) switched from INITIALIZING to RUNNING.
INFO apache_beam.utils.subprocess_server:subprocess_server.py:132 Sep 04, 2022 9:44:05 PM org.apache.flink.runtime.taskmanager.Task transitionState
INFO apache_beam.utils.subprocess_server:subprocess_server.py:132 INFO: CHAIN MapPartition (MapPartition at [3]read corpus/Read/{Map(<lambda at iobase.py:908>), SDFBoundedSourceReader}) -> FlatMap (FlatMap at ExtractOutput[0]) (14/16)#0 (f5f05f8d9152e9ebc0827db776e19918) switched from CREATED to DEPLOYING.
INFO apache_beam.utils.subprocess_server:subprocess_server.py:132 Sep 04, 2022 9:44:05 PM org.apache.flink.runtime.taskexecutor.slot.TaskSlotTableImpl markExistingSlotActive
INFO apache_beam.utils.subprocess_server:subprocess_server.py:132 INFO: Activate slot 76b113883d70ba98693a9616b0e75906.
INFO apache_beam.utils.subprocess_server:subprocess_server.py:132 Sep 04, 2022 9:44:05 PM org.apache.flink.runtime.taskmanager.Task doRun
INFO apache_beam.utils.subprocess_server:subprocess_server.py:132 INFO: Loading JAR files for task CHAIN MapPartition (MapPartition at [3]read corpus/Read/{Map(<lambda at iobase.py:908>), SDFBoundedSourceReader}) -> FlatMap (FlatMap at ExtractOutput[0]) (14/16)#0 (f5f05f8d9152e9ebc0827db776e19918) [DEPLOYING].
INFO apache_beam.utils.subprocess_server:subprocess_server.py:132 Sep 04, 2022 9:44:05 PM org.apache.flink.runtime.metrics.groups.TaskMetricGroup getOrAddOperator
INFO apache_beam.utils.subprocess_server:subprocess_server.py:132 WARNING: The operator name MapPartition (MapPartition at [3]read corpus/Read/{Map(<lambda at iobase.py:908>), SDFBoundedSourceReader}) exceeded the 80 characters length limit and was truncated.
INFO apache_beam.utils.subprocess_server:subprocess_server.py:132 Sep 04, 2022 9:44:05 PM org.apache.flink.runtime.taskmanager.Task transitionState
--------------------------- Captured stdout teardown ---------------------------
FAILED [ 56%]
---------------------------- Captured log teardown -----------------------------
INFO apache_beam.utils.subprocess_server:subprocess_server.py:132 at org.apache.flink.runtime.io.network.buffer.NetworkBufferPool.internalCreateBufferPool(NetworkBufferPool.java:483)
INFO apache_beam.utils.subprocess_server:subprocess_server.py:132 at org.apache.flink.runtime.io.network.buffer.NetworkBufferPool.createBufferPool(NetworkBufferPool.java:461)
INFO apache_beam.utils.subprocess_server:subprocess_server.py:132 at org.apache.flink.runtime.io.network.partition.ResultPartitionFactory.lambda$createBufferPoolFactory$0(ResultPartitionFactory.java:279)
=============================== warnings summary ===============================
../../build/gradleenv/2022703441/lib/python3.7/site-packages/hdfs/config.py:15
<https://ci-beam.apache.org/job/beam_PostCommit_Python_Examples_Flink/ws/src/build/gradleenv/2022703441/lib/python3.7/site-packages/hdfs/config.py>:15: DeprecationWarning: the imp module is deprecated in favour of importlib; see the module's documentation for alternative uses
from imp import load_source
../../build/gradleenv/2022703441/lib/python3.7/site-packages/google/api_core/grpc_helpers.py:42
<https://ci-beam.apache.org/job/beam_PostCommit_Python_Examples_Flink/ws/src/build/gradleenv/2022703441/lib/python3.7/site-packages/google/api_core/grpc_helpers.py>:42: DeprecationWarning: Support for grpcio-gcp is deprecated. This feature will be
removed from `google-api-core` after January 1, 2024. If you need to
continue to use this feature, please pin to a specific version of
`google-api-core`.
DeprecationWarning,
apache_beam/examples/complete/game/hourly_team_score_it_test.py::HourlyTeamScoreIT::test_hourly_team_score_output_checksum_on_small_input
<https://ci-beam.apache.org/job/beam_PostCommit_Python_Examples_Flink/ws/src/sdks/python/apache_beam/io/gcp/tests/utils.py>:63: PendingDeprecationWarning: Client.dataset is deprecated and will be removed in a future version. Use a string like 'my_project.my_dataset' or a cloud.google.bigquery.DatasetReference object, instead.
dataset_ref = client.dataset(unique_dataset_name, project=project)
apache_beam/examples/complete/game/hourly_team_score_it_test.py::HourlyTeamScoreIT::test_hourly_team_score_output_checksum_on_small_input
apache_beam/examples/cookbook/bigquery_tornadoes_it_test.py::BigqueryTornadoesIT::test_bigquery_tornadoes_it
apache_beam/examples/cookbook/filters_test.py::FiltersTest::test_filters_output_bigquery_matcher
<https://ci-beam.apache.org/job/beam_PostCommit_Python_Examples_Flink/ws/src/sdks/python/apache_beam/io/gcp/bigquery.py>:2285: BeamDeprecationWarning: options is deprecated since First stable release. References to <pipeline>.options will not be supported
is_streaming_pipeline = p.options.view_as(StandardOptions).streaming
apache_beam/examples/complete/game/hourly_team_score_it_test.py::HourlyTeamScoreIT::test_hourly_team_score_output_checksum_on_small_input
apache_beam/examples/cookbook/bigquery_tornadoes_it_test.py::BigqueryTornadoesIT::test_bigquery_tornadoes_it
apache_beam/examples/cookbook/filters_test.py::FiltersTest::test_filters_output_bigquery_matcher
<https://ci-beam.apache.org/job/beam_PostCommit_Python_Examples_Flink/ws/src/sdks/python/apache_beam/io/gcp/bigquery.py>:2291: BeamDeprecationWarning: options is deprecated since First stable release. References to <pipeline>.options will not be supported
experiments = p.options.view_as(DebugOptions).experiments or []
apache_beam/examples/complete/game/hourly_team_score_it_test.py::HourlyTeamScoreIT::test_hourly_team_score_output_checksum_on_small_input
apache_beam/examples/cookbook/bigquery_tornadoes_it_test.py::BigqueryTornadoesIT::test_bigquery_tornadoes_it
apache_beam/examples/cookbook/filters_test.py::FiltersTest::test_filters_output_bigquery_matcher
<https://ci-beam.apache.org/job/beam_PostCommit_Python_Examples_Flink/ws/src/sdks/python/apache_beam/io/gcp/bigquery_file_loads.py>:1129: BeamDeprecationWarning: options is deprecated since First stable release. References to <pipeline>.options will not be supported
temp_location = p.options.view_as(GoogleCloudOptions).temp_location
apache_beam/examples/complete/game/hourly_team_score_it_test.py::HourlyTeamScoreIT::test_hourly_team_score_output_checksum_on_small_input
apache_beam/examples/cookbook/bigquery_tornadoes_it_test.py::BigqueryTornadoesIT::test_bigquery_tornadoes_it
apache_beam/examples/cookbook/filters_test.py::FiltersTest::test_filters_output_bigquery_matcher
<https://ci-beam.apache.org/job/beam_PostCommit_Python_Examples_Flink/ws/src/sdks/python/apache_beam/io/gcp/bigquery_file_loads.py>:1131: BeamDeprecationWarning: options is deprecated since First stable release. References to <pipeline>.options will not be supported
p.options.view_as(GoogleCloudOptions).job_name or 'AUTOMATIC_JOB_NAME')
apache_beam/examples/cookbook/bigquery_side_input_it_test.py::BigQuerySideInputIT::test_bigquery_side_input_it
apache_beam/examples/cookbook/bigquery_side_input_it_test.py::BigQuerySideInputIT::test_bigquery_side_input_it
apache_beam/examples/cookbook/bigquery_tornadoes_it_test.py::BigqueryTornadoesIT::test_bigquery_tornadoes_it
apache_beam/examples/cookbook/filters_test.py::FiltersTest::test_filters_output_bigquery_matcher
apache_beam/examples/dataframe/flight_delays_it_test.py::FlightDelaysTest::test_flight_delays
<https://ci-beam.apache.org/job/beam_PostCommit_Python_Examples_Flink/ws/src/sdks/python/apache_beam/io/gcp/bigquery.py>:2774: BeamDeprecationWarning: options is deprecated since First stable release. References to <pipeline>.options will not be supported
temp_location = pcoll.pipeline.options.view_as(
apache_beam/examples/cookbook/bigquery_side_input_it_test.py::BigQuerySideInputIT::test_bigquery_side_input_it
apache_beam/examples/cookbook/bigquery_side_input_it_test.py::BigQuerySideInputIT::test_bigquery_side_input_it
apache_beam/examples/cookbook/bigquery_tornadoes_it_test.py::BigqueryTornadoesIT::test_bigquery_tornadoes_it
apache_beam/examples/cookbook/filters_test.py::FiltersTest::test_filters_output_bigquery_matcher
apache_beam/examples/dataframe/flight_delays_it_test.py::FlightDelaysTest::test_flight_delays
<https://ci-beam.apache.org/job/beam_PostCommit_Python_Examples_Flink/ws/src/sdks/python/apache_beam/io/gcp/bigquery.py>:2776: BeamDeprecationWarning: options is deprecated since First stable release. References to <pipeline>.options will not be supported
job_name = pcoll.pipeline.options.view_as(GoogleCloudOptions).job_name
apache_beam/examples/cookbook/bigquery_side_input_it_test.py::BigQuerySideInputIT::test_bigquery_side_input_it
apache_beam/examples/cookbook/bigquery_side_input_it_test.py::BigQuerySideInputIT::test_bigquery_side_input_it
apache_beam/examples/cookbook/bigquery_tornadoes_it_test.py::BigqueryTornadoesIT::test_bigquery_tornadoes_it
apache_beam/examples/cookbook/filters_test.py::FiltersTest::test_filters_output_bigquery_matcher
apache_beam/examples/dataframe/flight_delays_it_test.py::FlightDelaysTest::test_flight_delays
<https://ci-beam.apache.org/job/beam_PostCommit_Python_Examples_Flink/ws/src/sdks/python/apache_beam/io/gcp/bigquery.py>:2807: BeamDeprecationWarning: options is deprecated since First stable release. References to <pipeline>.options will not be supported
| _PassThroughThenCleanup(files_to_remove_pcoll))
apache_beam/examples/cookbook/bigquery_tornadoes_it_test.py::BigqueryTornadoesIT::test_bigquery_tornadoes_it
apache_beam/examples/cookbook/filters_test.py::FiltersTest::test_filters_output_bigquery_matcher
<https://ci-beam.apache.org/job/beam_PostCommit_Python_Examples_Flink/ws/src/sdks/python/apache_beam/io/gcp/bigquery.py>:2281: BeamDeprecationWarning: options is deprecated since First stable release. References to <pipeline>.options will not be supported
self.table_reference.projectId = pcoll.pipeline.options.view_as(
apache_beam/examples/cookbook/bigquery_tornadoes_it_test.py::BigqueryTornadoesIT::test_bigquery_tornadoes_it
apache_beam/examples/cookbook/filters_test.py::FiltersTest::test_filters_output_bigquery_matcher
<https://ci-beam.apache.org/job/beam_PostCommit_Python_Examples_Flink/ws/src/sdks/python/apache_beam/io/gcp/tests/utils.py>:100: PendingDeprecationWarning: Client.dataset is deprecated and will be removed in a future version. Use a string like 'my_project.my_dataset' or a cloud.google.bigquery.DatasetReference object, instead.
table_ref = client.dataset(dataset_id).table(table_id)
apache_beam/examples/dataframe/flight_delays_it_test.py::FlightDelaysTest::test_flight_delays
apache_beam/examples/dataframe/flight_delays_it_test.py::FlightDelaysTest::test_flight_delays
<https://ci-beam.apache.org/job/beam_PostCommit_Python_Examples_Flink/ws/src/sdks/python/apache_beam/examples/dataframe/flight_delays.py>:47: FutureWarning: Dropping of nuisance columns in DataFrame reductions (with 'numeric_only=None') is deprecated; in a future version this will raise TypeError. Select only valid columns before calling the reduction.
return airline_df[at_top_airports].mean()
apache_beam/examples/dataframe/flight_delays_it_test.py::FlightDelaysTest::test_flight_delays
apache_beam/examples/dataframe/wordcount_test.py::WordCountTest::test_basics
<https://ci-beam.apache.org/job/beam_PostCommit_Python_Examples_Flink/ws/src/sdks/python/apache_beam/dataframe/io.py>:664: FutureWarning: WriteToFiles is experimental.
sink=lambda _: _WriteToPandasFileSink(
apache_beam/examples/dataframe/flight_delays_it_test.py::FlightDelaysTest::test_flight_delays
apache_beam/examples/dataframe/wordcount_test.py::WordCountTest::test_basics
Exception in thread read_grpc_client_inputs:
Traceback (most recent call last):
File "/usr/lib/python3.7/threading.py", line 926, in _bootstrap_inner
self.run()
File "/usr/lib/python3.7/threading.py", line 870, in run
self._target(*self._args, **self._kwargs)
<https://ci-beam.apache.org/job/beam_PostCommit_Python_Examples_Flink/ws/src/sdks/python/apache_beam/io/fileio.py>:590: BeamDeprecationWarning: options is deprecated since First stable release. References to <pipeline>.options will not be supported
p.options.view_as(GoogleCloudOptions).temp_location or
-- Docs: https://docs.pytest.org/en/stable/how-to/capture-warnings.html
File "<https://ci-beam.apache.org/job/beam_PostCommit_Python_Examples_Flink/ws/src/sdks/python/apache_beam/runners/worker/data_plane.py",> line 671, in <lambda>
target=lambda: self._read_inputs(elements_iterator),
File "<https://ci-beam.apache.org/job/beam_PostCommit_Python_Examples_Flink/ws/src/sdks/python/apache_beam/runners/worker/data_plane.py",> line 654, in _read_inputs
for elements in elements_iterator:
File "<https://ci-beam.apache.org/job/beam_PostCommit_Python_Examples_Flink/ws/src/build/gradleenv/2022703441/lib/python3.7/site-packages/grpc/_channel.py",> line 426, in __next__
return self._next()
File "<https://ci-beam.apache.org/job/beam_PostCommit_Python_Examples_Flink/ws/src/build/gradleenv/2022703441/lib/python3.7/site-packages/grpc/_channel.py",> line 826, in _next
raise self
grpc._channel._MultiThreadedRendezvous: <_MultiThreadedRendezvous of RPC that terminated with:
status = StatusCode.CANCELLED
details = "Multiplexer hanging up"
- generated xml file: <https://ci-beam.apache.org/job/beam_PostCommit_Python_Examples_Flink/ws/src/sdks/python/pytest_postCommitExamples-flink-py37.xml> -
=========================== short test summary info ============================
FAILED apache_beam/examples/cookbook/bigquery_side_input_it_test.py::BigQuerySideInputIT::test_bigquery_side_input_it
= 1 failed, 21 passed, 3 skipped, 6634 deselected, 40 warnings in 530.83s (0:08:50) =
debug_error_string = "UNKNOWN:Error received from peer ipv4:127.0.0.1:35683 {created_time:"2022-09-04T21:45:15.427173774+00:00", grpc_status:1, grpc_message:"Multiplexer hanging up"}"
>
Exception in thread read_grpc_client_inputs:
Traceback (most recent call last):
File "/usr/lib/python3.7/threading.py", line 926, in _bootstrap_inner
self.run()
File "/usr/lib/python3.7/threading.py", line 870, in run
self._target(*self._args, **self._kwargs)
File "<https://ci-beam.apache.org/job/beam_PostCommit_Python_Examples_Flink/ws/src/sdks/python/apache_beam/runners/worker/data_plane.py",> line 671, in <lambda>
target=lambda: self._read_inputs(elements_iterator),
File "<https://ci-beam.apache.org/job/beam_PostCommit_Python_Examples_Flink/ws/src/sdks/python/apache_beam/runners/worker/data_plane.py",> line 654, in _read_inputs
for elements in elements_iterator:
File "<https://ci-beam.apache.org/job/beam_PostCommit_Python_Examples_Flink/ws/src/build/gradleenv/2022703441/lib/python3.7/site-packages/grpc/_channel.py",> line 426, in __next__
return self._next()
File "<https://ci-beam.apache.org/job/beam_PostCommit_Python_Examples_Flink/ws/src/build/gradleenv/2022703441/lib/python3.7/site-packages/grpc/_channel.py",> line 826, in _next
raise self
grpc._channel._MultiThreadedRendezvous: <_MultiThreadedRendezvous of RPC that terminated with:
status = StatusCode.CANCELLED
details = "Multiplexer hanging up"
debug_error_string = "UNKNOWN:Error received from peer ipv4:127.0.0.1:46601 {created_time:"2022-09-04T21:45:16.066660549+00:00", grpc_status:1, grpc_message:"Multiplexer hanging up"}"
>
Exception in thread read_grpc_client_inputs:
Traceback (most recent call last):
File "/usr/lib/python3.7/threading.py", line 926, in _bootstrap_inner
self.run()
File "/usr/lib/python3.7/threading.py", line 870, in run
self._target(*self._args, **self._kwargs)
File "<https://ci-beam.apache.org/job/beam_PostCommit_Python_Examples_Flink/ws/src/sdks/python/apache_beam/runners/worker/data_plane.py",> line 671, in <lambda>
target=lambda: self._read_inputs(elements_iterator),
File "<https://ci-beam.apache.org/job/beam_PostCommit_Python_Examples_Flink/ws/src/sdks/python/apache_beam/runners/worker/data_plane.py",> line 654, in _read_inputs
for elements in elements_iterator:
File "<https://ci-beam.apache.org/job/beam_PostCommit_Python_Examples_Flink/ws/src/build/gradleenv/2022703441/lib/python3.7/site-packages/grpc/_channel.py",> line 426, in __next__
return self._next()
File "<https://ci-beam.apache.org/job/beam_PostCommit_Python_Examples_Flink/ws/src/build/gradleenv/2022703441/lib/python3.7/site-packages/grpc/_channel.py",> line 826, in _next
raise self
grpc._channel._MultiThreadedRendezvous: <_MultiThreadedRendezvous of RPC that terminated with:
status = StatusCode.CANCELLED
details = "Multiplexer hanging up"
debug_error_string = "UNKNOWN:Error received from peer ipv4:127.0.0.1:42835 {created_time:"2022-09-04T21:45:51.926226894+00:00", grpc_status:1, grpc_message:"Multiplexer hanging up"}"
>
Exception in thread read_grpc_client_inputs:
Traceback (most recent call last):
File "/usr/lib/python3.7/threading.py", line 926, in _bootstrap_inner
self.run()
File "/usr/lib/python3.7/threading.py", line 870, in run
self._target(*self._args, **self._kwargs)
File "<https://ci-beam.apache.org/job/beam_PostCommit_Python_Examples_Flink/ws/src/sdks/python/apache_beam/runners/worker/data_plane.py",> line 671, in <lambda>
target=lambda: self._read_inputs(elements_iterator),
File "<https://ci-beam.apache.org/job/beam_PostCommit_Python_Examples_Flink/ws/src/sdks/python/apache_beam/runners/worker/data_plane.py",> line 654, in _read_inputs
for elements in elements_iterator:
File "<https://ci-beam.apache.org/job/beam_PostCommit_Python_Examples_Flink/ws/src/build/gradleenv/2022703441/lib/python3.7/site-packages/grpc/_channel.py",> line 426, in __next__
return self._next()
File "<https://ci-beam.apache.org/job/beam_PostCommit_Python_Examples_Flink/ws/src/build/gradleenv/2022703441/lib/python3.7/site-packages/grpc/_channel.py",> line 826, in _next
raise self
grpc._channel._MultiThreadedRendezvous: <_MultiThreadedRendezvous of RPC that terminated with:
status = StatusCode.CANCELLED
details = "Multiplexer hanging up"
debug_error_string = "UNKNOWN:Error received from peer ipv4:127.0.0.1:46813 {created_time:"2022-09-04T21:45:54.206706981+00:00", grpc_status:1, grpc_message:"Multiplexer hanging up"}"
>
> Task :sdks:python:test-suites:portable:py37:flinkExamples FAILED
FAILURE: Build completed with 2 failures.
1: Task failed with an exception.
-----------
* Where:
Script '<https://ci-beam.apache.org/job/beam_PostCommit_Python_Examples_Flink/ws/src/sdks/python/test-suites/portable/common.gradle'> line: 240
* What went wrong:
Execution failed for task ':sdks:python:test-suites:portable:py39:flinkExamples'.
> Process 'command 'sh'' finished with non-zero exit value 1
* Try:
> Run with --stacktrace option to get the stack trace.
> Run with --info or --debug option to get more log output.
> Run with --scan to get full insights.
==============================================================================
2: Task failed with an exception.
-----------
* Where:
Script '<https://ci-beam.apache.org/job/beam_PostCommit_Python_Examples_Flink/ws/src/sdks/python/test-suites/portable/common.gradle'> line: 240
* What went wrong:
Execution failed for task ':sdks:python:test-suites:portable:py37:flinkExamples'.
> Process 'command 'sh'' finished with non-zero exit value 1
* Try:
> Run with --stacktrace option to get the stack trace.
> Run with --info or --debug option to get more log output.
> Run with --scan to get full insights.
==============================================================================
* Get more help at https://help.gradle.org
Deprecated Gradle features were used in this build, making it incompatible with Gradle 8.0.
You can use '--warning-mode all' to show the individual deprecation warnings and determine if they come from your own scripts or plugins.
See https://docs.gradle.org/7.4/userguide/command_line_interface.html#sec:command_line_warnings
BUILD FAILED in 10m 34s
133 actionable tasks: 87 executed, 44 from cache, 2 up-to-date
Publishing build scan...
https://gradle.com/s/dv5cev7ri7va4
Build step 'Invoke Gradle script' changed build result to FAILURE
Build step 'Invoke Gradle script' marked build as failure
---------------------------------------------------------------------
To unsubscribe, e-mail: builds-unsubscribe@beam.apache.org
For additional commands, e-mail: builds-help@beam.apache.org