You are viewing a plain text version of this content. The canonical link for it is here.
Posted to builds@cassandra.apache.org by Apache Jenkins Server <je...@builds.apache.org> on 2023/12/02 13:20:59 UTC
Build complete: Cassandra-4.0 #681 [UNSTABLE] e1b0b44f9e97caf720c84d79541ee1a146560aaa
-------------------------------------------------------------------------------
Build Cassandra-4.0 #681 Still Unstable
URL: https://ci-cassandra.apache.org/job/Cassandra-4.0/681/
-------------------------------------------------------------------------------
Changes:
[Jacek Lewandowski] Fix repeated tests on CircleCI and long-testsome/burn-testsome targets
-------------------------------------------------------------------------------
Failed Tests:
12 tests failed.
FAILED: dtest-novnode.topology_test.TestTopology.test_decommissioned_node_cant_rejoin
FAILED: dtest-novnode.global_row_key_cache_test.TestGlobalRowKeyCache.test_functional
FAILED: dtest-novnode.materialized_views_test.TestMaterializedViews.test_resume_stopped_build
FAILED: dtest-offheap.cqlsh_tests.test_cqlsh_copy.TestCqlshCopy.test_bulk_round_trip_blogposts_with_max_connections
FAILED: dtest.bootstrap_test.TestBootstrap.test_read_from_bootstrapped_node
FAILED: dtest.replace_address_test.TestReplaceAddress.test_fail_without_replace
FAILED: org.apache.cassandra.distributed.test.NetstatsRepairStreamingTest.testWithCompressionEnabled
FAILED: org.apache.cassandra.cql3.ViewTest.testTruncateWhileBuilding-cdc
FAILED: org.apache.cassandra.cql3.BatchTest.testNonCounterInLoggedBatch-compression
FAILED: dtest-offheap.bootstrap_test.TestBootstrap.test_killed_wiped_node_cannot_join
FAILED: dtest-offheap.bootstrap_test.TestBootstrap.test_decommissioned_wiped_node_can_join
FAILED: org.apache.cassandra.tools.TopPartitionsTest.testServiceTopPartitionsSingleTable
-------------------------------------------------------------------------------
For complete test report and logs see https://nightlies.apache.org/cassandra/Cassandra-4.0/681/