You are viewing a plain text version of this content. The canonical link for it is here.
Posted to dev@lucene.apache.org by Policeman Jenkins Server <je...@sd-datasolutions.de> on 2012/10/03 16:20:05 UTC
[JENKINS] Lucene-Solr-4.x-Linux (64bit/ibm-j9-jdk7) - Build # 1509
- Failure!
Build: http://jenkins.sd-datasolutions.de/job/Lucene-Solr-4.x-Linux/1509/
Java: 64bit/ibm-j9-jdk7 -Xjit:exclude={org/apache/lucene/util/fst/FST.pack(IIF)Lorg/apache/lucene/util/fst/FST;}
5 tests failed.
REGRESSION: org.apache.solr.TestDistributedGrouping.testDistribSearch
Error Message:
Server at http://127.0.0.1:37274/solr returned non ok status:500, message:Server Error
Stack Trace:
org.apache.solr.common.SolrException: Server at http://127.0.0.1:37274/solr returned non ok status:500, message:Server Error
at __randomizedtesting.SeedInfo.seed([449E3BDC90C3041F:C578B5C4E79C6423]:0)
at org.apache.solr.client.solrj.impl.HttpSolrServer.request(HttpSolrServer.java:372)
at org.apache.solr.client.solrj.impl.HttpSolrServer.request(HttpSolrServer.java:181)
at org.apache.solr.client.solrj.request.QueryRequest.process(QueryRequest.java:90)
at org.apache.solr.client.solrj.SolrServer.query(SolrServer.java:301)
at org.apache.solr.BaseDistributedSearchTestCase.queryServer(BaseDistributedSearchTestCase.java:371)
at org.apache.solr.BaseDistributedSearchTestCase.query(BaseDistributedSearchTestCase.java:394)
at org.apache.solr.BaseDistributedSearchTestCase.query(BaseDistributedSearchTestCase.java:376)
at org.apache.solr.TestDistributedGrouping.doTest(TestDistributedGrouping.java:146)
at org.apache.solr.BaseDistributedSearchTestCase.testDistribSearch(BaseDistributedSearchTestCase.java:701)
at sun.reflect.NativeMethodAccessorImpl.invoke0(Native Method)
at sun.reflect.NativeMethodAccessorImpl.invoke(NativeMethodAccessorImpl.java:88)
at sun.reflect.DelegatingMethodAccessorImpl.invoke(DelegatingMethodAccessorImpl.java:55)
at java.lang.reflect.Method.invoke(Method.java:613)
at com.carrotsearch.randomizedtesting.RandomizedRunner.invoke(RandomizedRunner.java:1559)
at com.carrotsearch.randomizedtesting.RandomizedRunner.access$600(RandomizedRunner.java:79)
at com.carrotsearch.randomizedtesting.RandomizedRunner$6.evaluate(RandomizedRunner.java:737)
at com.carrotsearch.randomizedtesting.RandomizedRunner$7.evaluate(RandomizedRunner.java:773)
at com.carrotsearch.randomizedtesting.RandomizedRunner$8.evaluate(RandomizedRunner.java:787)
at com.carrotsearch.randomizedtesting.rules.SystemPropertiesRestoreRule$1.evaluate(SystemPropertiesRestoreRule.java:53)
at org.apache.lucene.util.TestRuleSetupTeardownChained$1.evaluate(TestRuleSetupTeardownChained.java:50)
at org.apache.lucene.util.TestRuleFieldCacheSanity$1.evaluate(TestRuleFieldCacheSanity.java:51)
at org.apache.lucene.util.AbstractBeforeAfterRule$1.evaluate(AbstractBeforeAfterRule.java:45)
at com.carrotsearch.randomizedtesting.rules.SystemPropertiesInvariantRule$1.evaluate(SystemPropertiesInvariantRule.java:55)
at org.apache.lucene.util.TestRuleThreadAndTestName$1.evaluate(TestRuleThreadAndTestName.java:48)
at org.apache.lucene.util.TestRuleIgnoreAfterMaxFailures$1.evaluate(TestRuleIgnoreAfterMaxFailures.java:70)
at org.apache.lucene.util.TestRuleMarkFailure$1.evaluate(TestRuleMarkFailure.java:48)
at com.carrotsearch.randomizedtesting.rules.StatementAdapter.evaluate(StatementAdapter.java:36)
at com.carrotsearch.randomizedtesting.ThreadLeakControl$StatementRunner.run(ThreadLeakControl.java:358)
at com.carrotsearch.randomizedtesting.ThreadLeakControl.forkTimeoutingTask(ThreadLeakControl.java:782)
at com.carrotsearch.randomizedtesting.ThreadLeakControl$3.evaluate(ThreadLeakControl.java:442)
at com.carrotsearch.randomizedtesting.RandomizedRunner.runSingleTest(RandomizedRunner.java:746)
at com.carrotsearch.randomizedtesting.RandomizedRunner$3.evaluate(RandomizedRunner.java:648)
at com.carrotsearch.randomizedtesting.RandomizedRunner$4.evaluate(RandomizedRunner.java:682)
at com.carrotsearch.randomizedtesting.RandomizedRunner$5.evaluate(RandomizedRunner.java:693)
at com.carrotsearch.randomizedtesting.rules.StatementAdapter.evaluate(StatementAdapter.java:36)
at com.carrotsearch.randomizedtesting.rules.SystemPropertiesRestoreRule$1.evaluate(SystemPropertiesRestoreRule.java:53)
at org.apache.lucene.util.AbstractBeforeAfterRule$1.evaluate(AbstractBeforeAfterRule.java:45)
at org.apache.lucene.util.TestRuleStoreClassName$1.evaluate(TestRuleStoreClassName.java:42)
at com.carrotsearch.randomizedtesting.rules.SystemPropertiesInvariantRule$1.evaluate(SystemPropertiesInvariantRule.java:55)
at com.carrotsearch.randomizedtesting.rules.NoShadowingOrOverridesOnMethodsRule$1.evaluate(NoShadowingOrOverridesOnMethodsRule.java:39)
at com.carrotsearch.randomizedtesting.rules.NoShadowingOrOverridesOnMethodsRule$1.evaluate(NoShadowingOrOverridesOnMethodsRule.java:39)
at com.carrotsearch.randomizedtesting.rules.StatementAdapter.evaluate(StatementAdapter.java:36)
at org.apache.lucene.util.TestRuleAssertionsRequired$1.evaluate(TestRuleAssertionsRequired.java:43)
at org.apache.lucene.util.TestRuleMarkFailure$1.evaluate(TestRuleMarkFailure.java:48)
at org.apache.lucene.util.TestRuleIgnoreAfterMaxFailures$1.evaluate(TestRuleIgnoreAfterMaxFailures.java:70)
at org.apache.lucene.util.TestRuleIgnoreTestSuites$1.evaluate(TestRuleIgnoreTestSuites.java:55)
at com.carrotsearch.randomizedtesting.rules.StatementAdapter.evaluate(StatementAdapter.java:36)
at com.carrotsearch.randomizedtesting.ThreadLeakControl$StatementRunner.run(ThreadLeakControl.java:358)
at java.lang.Thread.run(Thread.java:777)
REGRESSION: org.apache.solr.TestDistributedSearch.testDistribSearch
Error Message:
Server at http://127.0.0.1:55035/solr returned non ok status:500, message:Server Error
Stack Trace:
org.apache.solr.common.SolrException: Server at http://127.0.0.1:55035/solr returned non ok status:500, message:Server Error
at __randomizedtesting.SeedInfo.seed([449E3BDC90C3041F:C578B5C4E79C6423]:0)
at org.apache.solr.client.solrj.impl.HttpSolrServer.request(HttpSolrServer.java:372)
at org.apache.solr.client.solrj.impl.HttpSolrServer.request(HttpSolrServer.java:181)
at org.apache.solr.client.solrj.request.QueryRequest.process(QueryRequest.java:90)
at org.apache.solr.client.solrj.SolrServer.query(SolrServer.java:301)
at org.apache.solr.BaseDistributedSearchTestCase.queryServer(BaseDistributedSearchTestCase.java:371)
at org.apache.solr.BaseDistributedSearchTestCase.query(BaseDistributedSearchTestCase.java:394)
at org.apache.solr.BaseDistributedSearchTestCase.query(BaseDistributedSearchTestCase.java:376)
at org.apache.solr.TestDistributedSearch.doTest(TestDistributedSearch.java:134)
at org.apache.solr.BaseDistributedSearchTestCase.testDistribSearch(BaseDistributedSearchTestCase.java:701)
at sun.reflect.NativeMethodAccessorImpl.invoke0(Native Method)
at sun.reflect.NativeMethodAccessorImpl.invoke(NativeMethodAccessorImpl.java:88)
at sun.reflect.DelegatingMethodAccessorImpl.invoke(DelegatingMethodAccessorImpl.java:55)
at java.lang.reflect.Method.invoke(Method.java:613)
at com.carrotsearch.randomizedtesting.RandomizedRunner.invoke(RandomizedRunner.java:1559)
at com.carrotsearch.randomizedtesting.RandomizedRunner.access$600(RandomizedRunner.java:79)
at com.carrotsearch.randomizedtesting.RandomizedRunner$6.evaluate(RandomizedRunner.java:737)
at com.carrotsearch.randomizedtesting.RandomizedRunner$7.evaluate(RandomizedRunner.java:773)
at com.carrotsearch.randomizedtesting.RandomizedRunner$8.evaluate(RandomizedRunner.java:787)
at com.carrotsearch.randomizedtesting.rules.SystemPropertiesRestoreRule$1.evaluate(SystemPropertiesRestoreRule.java:53)
at org.apache.lucene.util.TestRuleSetupTeardownChained$1.evaluate(TestRuleSetupTeardownChained.java:50)
at org.apache.lucene.util.TestRuleFieldCacheSanity$1.evaluate(TestRuleFieldCacheSanity.java:51)
at org.apache.lucene.util.AbstractBeforeAfterRule$1.evaluate(AbstractBeforeAfterRule.java:45)
at com.carrotsearch.randomizedtesting.rules.SystemPropertiesInvariantRule$1.evaluate(SystemPropertiesInvariantRule.java:55)
at org.apache.lucene.util.TestRuleThreadAndTestName$1.evaluate(TestRuleThreadAndTestName.java:48)
at org.apache.lucene.util.TestRuleIgnoreAfterMaxFailures$1.evaluate(TestRuleIgnoreAfterMaxFailures.java:70)
at org.apache.lucene.util.TestRuleMarkFailure$1.evaluate(TestRuleMarkFailure.java:48)
at com.carrotsearch.randomizedtesting.rules.StatementAdapter.evaluate(StatementAdapter.java:36)
at com.carrotsearch.randomizedtesting.ThreadLeakControl$StatementRunner.run(ThreadLeakControl.java:358)
at com.carrotsearch.randomizedtesting.ThreadLeakControl.forkTimeoutingTask(ThreadLeakControl.java:782)
at com.carrotsearch.randomizedtesting.ThreadLeakControl$3.evaluate(ThreadLeakControl.java:442)
at com.carrotsearch.randomizedtesting.RandomizedRunner.runSingleTest(RandomizedRunner.java:746)
at com.carrotsearch.randomizedtesting.RandomizedRunner$3.evaluate(RandomizedRunner.java:648)
at com.carrotsearch.randomizedtesting.RandomizedRunner$4.evaluate(RandomizedRunner.java:682)
at com.carrotsearch.randomizedtesting.RandomizedRunner$5.evaluate(RandomizedRunner.java:693)
at com.carrotsearch.randomizedtesting.rules.StatementAdapter.evaluate(StatementAdapter.java:36)
at com.carrotsearch.randomizedtesting.rules.SystemPropertiesRestoreRule$1.evaluate(SystemPropertiesRestoreRule.java:53)
at org.apache.lucene.util.AbstractBeforeAfterRule$1.evaluate(AbstractBeforeAfterRule.java:45)
at org.apache.lucene.util.TestRuleStoreClassName$1.evaluate(TestRuleStoreClassName.java:42)
at com.carrotsearch.randomizedtesting.rules.SystemPropertiesInvariantRule$1.evaluate(SystemPropertiesInvariantRule.java:55)
at com.carrotsearch.randomizedtesting.rules.NoShadowingOrOverridesOnMethodsRule$1.evaluate(NoShadowingOrOverridesOnMethodsRule.java:39)
at com.carrotsearch.randomizedtesting.rules.NoShadowingOrOverridesOnMethodsRule$1.evaluate(NoShadowingOrOverridesOnMethodsRule.java:39)
at com.carrotsearch.randomizedtesting.rules.StatementAdapter.evaluate(StatementAdapter.java:36)
at org.apache.lucene.util.TestRuleAssertionsRequired$1.evaluate(TestRuleAssertionsRequired.java:43)
at org.apache.lucene.util.TestRuleMarkFailure$1.evaluate(TestRuleMarkFailure.java:48)
at org.apache.lucene.util.TestRuleIgnoreAfterMaxFailures$1.evaluate(TestRuleIgnoreAfterMaxFailures.java:70)
at org.apache.lucene.util.TestRuleIgnoreTestSuites$1.evaluate(TestRuleIgnoreTestSuites.java:55)
at com.carrotsearch.randomizedtesting.rules.StatementAdapter.evaluate(StatementAdapter.java:36)
at com.carrotsearch.randomizedtesting.ThreadLeakControl$StatementRunner.run(ThreadLeakControl.java:358)
at java.lang.Thread.run(Thread.java:777)
REGRESSION: org.apache.solr.cloud.BasicDistributedZkTest.testDistribSearch
Error Message:
No live SolrServers available to handle this request:[http://127.0.0.1:39928/solr/collection1, http://127.0.0.1:59309/solr/collection1, http://127.0.0.1:37354/solr/collection1]
Stack Trace:
org.apache.solr.client.solrj.SolrServerException: No live SolrServers available to handle this request:[http://127.0.0.1:39928/solr/collection1, http://127.0.0.1:59309/solr/collection1, http://127.0.0.1:37354/solr/collection1]
at __randomizedtesting.SeedInfo.seed([449E3BDC90C3041F:C578B5C4E79C6423]:0)
at org.apache.solr.client.solrj.impl.LBHttpSolrServer.request(LBHttpSolrServer.java:324)
at org.apache.solr.client.solrj.impl.CloudSolrServer.request(CloudSolrServer.java:257)
at org.apache.solr.client.solrj.request.QueryRequest.process(QueryRequest.java:90)
at org.apache.solr.client.solrj.SolrServer.query(SolrServer.java:301)
at org.apache.solr.cloud.AbstractFullDistribZkTestBase.queryServer(AbstractFullDistribZkTestBase.java:994)
at org.apache.solr.cloud.BasicDistributedZkTest.queryServer(BasicDistributedZkTest.java:1050)
at org.apache.solr.BaseDistributedSearchTestCase.query(BaseDistributedSearchTestCase.java:394)
at org.apache.solr.cloud.BasicDistributedZkTest.doTest(BasicDistributedZkTest.java:208)
at org.apache.solr.BaseDistributedSearchTestCase.testDistribSearch(BaseDistributedSearchTestCase.java:695)
at sun.reflect.NativeMethodAccessorImpl.invoke0(Native Method)
at sun.reflect.NativeMethodAccessorImpl.invoke(NativeMethodAccessorImpl.java:88)
at sun.reflect.DelegatingMethodAccessorImpl.invoke(DelegatingMethodAccessorImpl.java:55)
at java.lang.reflect.Method.invoke(Method.java:613)
at com.carrotsearch.randomizedtesting.RandomizedRunner.invoke(RandomizedRunner.java:1559)
at com.carrotsearch.randomizedtesting.RandomizedRunner.access$600(RandomizedRunner.java:79)
at com.carrotsearch.randomizedtesting.RandomizedRunner$6.evaluate(RandomizedRunner.java:737)
at com.carrotsearch.randomizedtesting.RandomizedRunner$7.evaluate(RandomizedRunner.java:773)
at com.carrotsearch.randomizedtesting.RandomizedRunner$8.evaluate(RandomizedRunner.java:787)
at com.carrotsearch.randomizedtesting.rules.SystemPropertiesRestoreRule$1.evaluate(SystemPropertiesRestoreRule.java:53)
at org.apache.lucene.util.TestRuleSetupTeardownChained$1.evaluate(TestRuleSetupTeardownChained.java:50)
at org.apache.lucene.util.TestRuleFieldCacheSanity$1.evaluate(TestRuleFieldCacheSanity.java:51)
at org.apache.lucene.util.AbstractBeforeAfterRule$1.evaluate(AbstractBeforeAfterRule.java:45)
at com.carrotsearch.randomizedtesting.rules.SystemPropertiesInvariantRule$1.evaluate(SystemPropertiesInvariantRule.java:55)
at org.apache.lucene.util.TestRuleThreadAndTestName$1.evaluate(TestRuleThreadAndTestName.java:48)
at org.apache.lucene.util.TestRuleIgnoreAfterMaxFailures$1.evaluate(TestRuleIgnoreAfterMaxFailures.java:70)
at org.apache.lucene.util.TestRuleMarkFailure$1.evaluate(TestRuleMarkFailure.java:48)
at com.carrotsearch.randomizedtesting.rules.StatementAdapter.evaluate(StatementAdapter.java:36)
at com.carrotsearch.randomizedtesting.ThreadLeakControl$StatementRunner.run(ThreadLeakControl.java:358)
at com.carrotsearch.randomizedtesting.ThreadLeakControl.forkTimeoutingTask(ThreadLeakControl.java:782)
at com.carrotsearch.randomizedtesting.ThreadLeakControl$3.evaluate(ThreadLeakControl.java:442)
at com.carrotsearch.randomizedtesting.RandomizedRunner.runSingleTest(RandomizedRunner.java:746)
at com.carrotsearch.randomizedtesting.RandomizedRunner$3.evaluate(RandomizedRunner.java:648)
at com.carrotsearch.randomizedtesting.RandomizedRunner$4.evaluate(RandomizedRunner.java:682)
at com.carrotsearch.randomizedtesting.RandomizedRunner$5.evaluate(RandomizedRunner.java:693)
at com.carrotsearch.randomizedtesting.rules.StatementAdapter.evaluate(StatementAdapter.java:36)
at com.carrotsearch.randomizedtesting.rules.SystemPropertiesRestoreRule$1.evaluate(SystemPropertiesRestoreRule.java:53)
at org.apache.lucene.util.AbstractBeforeAfterRule$1.evaluate(AbstractBeforeAfterRule.java:45)
at org.apache.lucene.util.TestRuleStoreClassName$1.evaluate(TestRuleStoreClassName.java:42)
at com.carrotsearch.randomizedtesting.rules.SystemPropertiesInvariantRule$1.evaluate(SystemPropertiesInvariantRule.java:55)
at com.carrotsearch.randomizedtesting.rules.NoShadowingOrOverridesOnMethodsRule$1.evaluate(NoShadowingOrOverridesOnMethodsRule.java:39)
at com.carrotsearch.randomizedtesting.rules.NoShadowingOrOverridesOnMethodsRule$1.evaluate(NoShadowingOrOverridesOnMethodsRule.java:39)
at com.carrotsearch.randomizedtesting.rules.StatementAdapter.evaluate(StatementAdapter.java:36)
at org.apache.lucene.util.TestRuleAssertionsRequired$1.evaluate(TestRuleAssertionsRequired.java:43)
at org.apache.lucene.util.TestRuleMarkFailure$1.evaluate(TestRuleMarkFailure.java:48)
at org.apache.lucene.util.TestRuleIgnoreAfterMaxFailures$1.evaluate(TestRuleIgnoreAfterMaxFailures.java:70)
at org.apache.lucene.util.TestRuleIgnoreTestSuites$1.evaluate(TestRuleIgnoreTestSuites.java:55)
at com.carrotsearch.randomizedtesting.rules.StatementAdapter.evaluate(StatementAdapter.java:36)
at com.carrotsearch.randomizedtesting.ThreadLeakControl$StatementRunner.run(ThreadLeakControl.java:358)
at java.lang.Thread.run(Thread.java:777)
Caused by: org.apache.solr.common.SolrException: Server at http://127.0.0.1:59309/solr/collection1 returned non ok status:500, message:Server Error
at org.apache.solr.client.solrj.impl.HttpSolrServer.request(HttpSolrServer.java:372)
at org.apache.solr.client.solrj.impl.HttpSolrServer.request(HttpSolrServer.java:181)
at org.apache.solr.client.solrj.impl.LBHttpSolrServer.request(LBHttpSolrServer.java:255)
... 48 more
REGRESSION: org.apache.solr.handler.component.DistributedQueryElevationComponentTest.testDistribSearch
Error Message:
Server at http://127.0.0.1:44061/solr returned non ok status:500, message:Server Error
Stack Trace:
org.apache.solr.common.SolrException: Server at http://127.0.0.1:44061/solr returned non ok status:500, message:Server Error
at __randomizedtesting.SeedInfo.seed([449E3BDC90C3041F:C578B5C4E79C6423]:0)
at org.apache.solr.client.solrj.impl.HttpSolrServer.request(HttpSolrServer.java:372)
at org.apache.solr.client.solrj.impl.HttpSolrServer.request(HttpSolrServer.java:181)
at org.apache.solr.client.solrj.request.QueryRequest.process(QueryRequest.java:90)
at org.apache.solr.client.solrj.SolrServer.query(SolrServer.java:301)
at org.apache.solr.BaseDistributedSearchTestCase.queryServer(BaseDistributedSearchTestCase.java:371)
at org.apache.solr.BaseDistributedSearchTestCase.query(BaseDistributedSearchTestCase.java:394)
at org.apache.solr.BaseDistributedSearchTestCase.query(BaseDistributedSearchTestCase.java:376)
at org.apache.solr.handler.component.DistributedQueryElevationComponentTest.doTest(DistributedQueryElevationComponentTest.java:83)
at org.apache.solr.BaseDistributedSearchTestCase.testDistribSearch(BaseDistributedSearchTestCase.java:695)
at sun.reflect.NativeMethodAccessorImpl.invoke0(Native Method)
at sun.reflect.NativeMethodAccessorImpl.invoke(NativeMethodAccessorImpl.java:88)
at sun.reflect.DelegatingMethodAccessorImpl.invoke(DelegatingMethodAccessorImpl.java:55)
at java.lang.reflect.Method.invoke(Method.java:613)
at com.carrotsearch.randomizedtesting.RandomizedRunner.invoke(RandomizedRunner.java:1559)
at com.carrotsearch.randomizedtesting.RandomizedRunner.access$600(RandomizedRunner.java:79)
at com.carrotsearch.randomizedtesting.RandomizedRunner$6.evaluate(RandomizedRunner.java:737)
at com.carrotsearch.randomizedtesting.RandomizedRunner$7.evaluate(RandomizedRunner.java:773)
at com.carrotsearch.randomizedtesting.RandomizedRunner$8.evaluate(RandomizedRunner.java:787)
at com.carrotsearch.randomizedtesting.rules.SystemPropertiesRestoreRule$1.evaluate(SystemPropertiesRestoreRule.java:53)
at org.apache.lucene.util.TestRuleSetupTeardownChained$1.evaluate(TestRuleSetupTeardownChained.java:50)
at org.apache.lucene.util.TestRuleFieldCacheSanity$1.evaluate(TestRuleFieldCacheSanity.java:51)
at org.apache.lucene.util.AbstractBeforeAfterRule$1.evaluate(AbstractBeforeAfterRule.java:45)
at com.carrotsearch.randomizedtesting.rules.SystemPropertiesInvariantRule$1.evaluate(SystemPropertiesInvariantRule.java:55)
at org.apache.lucene.util.TestRuleThreadAndTestName$1.evaluate(TestRuleThreadAndTestName.java:48)
at org.apache.lucene.util.TestRuleIgnoreAfterMaxFailures$1.evaluate(TestRuleIgnoreAfterMaxFailures.java:70)
at org.apache.lucene.util.TestRuleMarkFailure$1.evaluate(TestRuleMarkFailure.java:48)
at com.carrotsearch.randomizedtesting.rules.StatementAdapter.evaluate(StatementAdapter.java:36)
at com.carrotsearch.randomizedtesting.ThreadLeakControl$StatementRunner.run(ThreadLeakControl.java:358)
at com.carrotsearch.randomizedtesting.ThreadLeakControl.forkTimeoutingTask(ThreadLeakControl.java:782)
at com.carrotsearch.randomizedtesting.ThreadLeakControl$3.evaluate(ThreadLeakControl.java:442)
at com.carrotsearch.randomizedtesting.RandomizedRunner.runSingleTest(RandomizedRunner.java:746)
at com.carrotsearch.randomizedtesting.RandomizedRunner$3.evaluate(RandomizedRunner.java:648)
at com.carrotsearch.randomizedtesting.RandomizedRunner$4.evaluate(RandomizedRunner.java:682)
at com.carrotsearch.randomizedtesting.RandomizedRunner$5.evaluate(RandomizedRunner.java:693)
at com.carrotsearch.randomizedtesting.rules.StatementAdapter.evaluate(StatementAdapter.java:36)
at com.carrotsearch.randomizedtesting.rules.SystemPropertiesRestoreRule$1.evaluate(SystemPropertiesRestoreRule.java:53)
at org.apache.lucene.util.AbstractBeforeAfterRule$1.evaluate(AbstractBeforeAfterRule.java:45)
at org.apache.lucene.util.TestRuleStoreClassName$1.evaluate(TestRuleStoreClassName.java:42)
at com.carrotsearch.randomizedtesting.rules.SystemPropertiesInvariantRule$1.evaluate(SystemPropertiesInvariantRule.java:55)
at com.carrotsearch.randomizedtesting.rules.NoShadowingOrOverridesOnMethodsRule$1.evaluate(NoShadowingOrOverridesOnMethodsRule.java:39)
at com.carrotsearch.randomizedtesting.rules.NoShadowingOrOverridesOnMethodsRule$1.evaluate(NoShadowingOrOverridesOnMethodsRule.java:39)
at com.carrotsearch.randomizedtesting.rules.StatementAdapter.evaluate(StatementAdapter.java:36)
at org.apache.lucene.util.TestRuleAssertionsRequired$1.evaluate(TestRuleAssertionsRequired.java:43)
at org.apache.lucene.util.TestRuleMarkFailure$1.evaluate(TestRuleMarkFailure.java:48)
at org.apache.lucene.util.TestRuleIgnoreAfterMaxFailures$1.evaluate(TestRuleIgnoreAfterMaxFailures.java:70)
at org.apache.lucene.util.TestRuleIgnoreTestSuites$1.evaluate(TestRuleIgnoreTestSuites.java:55)
at com.carrotsearch.randomizedtesting.rules.StatementAdapter.evaluate(StatementAdapter.java:36)
at com.carrotsearch.randomizedtesting.ThreadLeakControl$StatementRunner.run(ThreadLeakControl.java:358)
at java.lang.Thread.run(Thread.java:777)
REGRESSION: org.apache.solr.handler.component.StatsComponentTest.testStats
Error Message:
Exception during query
Stack Trace:
java.lang.RuntimeException: Exception during query
at __randomizedtesting.SeedInfo.seed([449E3BDC90C3041F:DE1F6263F81FCA3C]:0)
at org.apache.solr.util.AbstractSolrTestCase.assertQ(AbstractSolrTestCase.java:283)
at org.apache.solr.handler.component.StatsComponentTest.doTestFacetStatisticsResult(StatsComponentTest.java:239)
at org.apache.solr.handler.component.StatsComponentTest.testStats(StatsComponentTest.java:68)
at sun.reflect.NativeMethodAccessorImpl.invoke0(Native Method)
at sun.reflect.NativeMethodAccessorImpl.invoke(NativeMethodAccessorImpl.java:88)
at sun.reflect.DelegatingMethodAccessorImpl.invoke(DelegatingMethodAccessorImpl.java:55)
at java.lang.reflect.Method.invoke(Method.java:613)
at com.carrotsearch.randomizedtesting.RandomizedRunner.invoke(RandomizedRunner.java:1559)
at com.carrotsearch.randomizedtesting.RandomizedRunner.access$600(RandomizedRunner.java:79)
at com.carrotsearch.randomizedtesting.RandomizedRunner$6.evaluate(RandomizedRunner.java:737)
at com.carrotsearch.randomizedtesting.RandomizedRunner$7.evaluate(RandomizedRunner.java:773)
at com.carrotsearch.randomizedtesting.RandomizedRunner$8.evaluate(RandomizedRunner.java:787)
at com.carrotsearch.randomizedtesting.rules.SystemPropertiesRestoreRule$1.evaluate(SystemPropertiesRestoreRule.java:53)
at org.apache.lucene.util.TestRuleSetupTeardownChained$1.evaluate(TestRuleSetupTeardownChained.java:50)
at org.apache.lucene.util.TestRuleFieldCacheSanity$1.evaluate(TestRuleFieldCacheSanity.java:51)
at org.apache.lucene.util.AbstractBeforeAfterRule$1.evaluate(AbstractBeforeAfterRule.java:45)
at com.carrotsearch.randomizedtesting.rules.SystemPropertiesInvariantRule$1.evaluate(SystemPropertiesInvariantRule.java:55)
at org.apache.lucene.util.TestRuleThreadAndTestName$1.evaluate(TestRuleThreadAndTestName.java:48)
at org.apache.lucene.util.TestRuleIgnoreAfterMaxFailures$1.evaluate(TestRuleIgnoreAfterMaxFailures.java:70)
at org.apache.lucene.util.TestRuleMarkFailure$1.evaluate(TestRuleMarkFailure.java:48)
at com.carrotsearch.randomizedtesting.rules.StatementAdapter.evaluate(StatementAdapter.java:36)
at com.carrotsearch.randomizedtesting.ThreadLeakControl$StatementRunner.run(ThreadLeakControl.java:358)
at com.carrotsearch.randomizedtesting.ThreadLeakControl.forkTimeoutingTask(ThreadLeakControl.java:782)
at com.carrotsearch.randomizedtesting.ThreadLeakControl$3.evaluate(ThreadLeakControl.java:442)
at com.carrotsearch.randomizedtesting.RandomizedRunner.runSingleTest(RandomizedRunner.java:746)
at com.carrotsearch.randomizedtesting.RandomizedRunner$3.evaluate(RandomizedRunner.java:648)
at com.carrotsearch.randomizedtesting.RandomizedRunner$4.evaluate(RandomizedRunner.java:682)
at com.carrotsearch.randomizedtesting.RandomizedRunner$5.evaluate(RandomizedRunner.java:693)
at com.carrotsearch.randomizedtesting.rules.StatementAdapter.evaluate(StatementAdapter.java:36)
at com.carrotsearch.randomizedtesting.rules.SystemPropertiesRestoreRule$1.evaluate(SystemPropertiesRestoreRule.java:53)
at org.apache.lucene.util.AbstractBeforeAfterRule$1.evaluate(AbstractBeforeAfterRule.java:45)
at org.apache.lucene.util.TestRuleStoreClassName$1.evaluate(TestRuleStoreClassName.java:42)
at com.carrotsearch.randomizedtesting.rules.SystemPropertiesInvariantRule$1.evaluate(SystemPropertiesInvariantRule.java:55)
at com.carrotsearch.randomizedtesting.rules.NoShadowingOrOverridesOnMethodsRule$1.evaluate(NoShadowingOrOverridesOnMethodsRule.java:39)
at com.carrotsearch.randomizedtesting.rules.NoShadowingOrOverridesOnMethodsRule$1.evaluate(NoShadowingOrOverridesOnMethodsRule.java:39)
at com.carrotsearch.randomizedtesting.rules.StatementAdapter.evaluate(StatementAdapter.java:36)
at org.apache.lucene.util.TestRuleAssertionsRequired$1.evaluate(TestRuleAssertionsRequired.java:43)
at org.apache.lucene.util.TestRuleMarkFailure$1.evaluate(TestRuleMarkFailure.java:48)
at org.apache.lucene.util.TestRuleIgnoreAfterMaxFailures$1.evaluate(TestRuleIgnoreAfterMaxFailures.java:70)
at org.apache.lucene.util.TestRuleIgnoreTestSuites$1.evaluate(TestRuleIgnoreTestSuites.java:55)
at com.carrotsearch.randomizedtesting.rules.StatementAdapter.evaluate(StatementAdapter.java:36)
at com.carrotsearch.randomizedtesting.ThreadLeakControl$StatementRunner.run(ThreadLeakControl.java:358)
at java.lang.Thread.run(Thread.java:777)
Caused by: java.lang.NullPointerException
at org.apache.solr.util.NumberUtils.SortableStr2int(NumberUtils.java:162)
at org.apache.solr.schema.SortableIntField.toObject(SortableIntField.java:96)
at org.apache.solr.schema.SortableIntField.toObject(SortableIntField.java:55)
at org.apache.solr.schema.FieldType.toObject(FieldType.java:342)
at org.apache.solr.handler.component.AbstractStatsValues.accumulate(StatsValuesFactory.java:129)
at org.apache.solr.handler.component.SimpleStats.getFieldCacheStats(StatsComponent.java:281)
at org.apache.solr.handler.component.SimpleStats.getStatsFields(StatsComponent.java:227)
at org.apache.solr.handler.component.SimpleStats.getStatsCounts(StatsComponent.java:201)
at org.apache.solr.handler.component.StatsComponent.process(StatsComponent.java:70)
at org.apache.solr.handler.component.SearchHandler.handleRequestBody(SearchHandler.java:206)
at org.apache.solr.handler.RequestHandlerBase.handleRequest(RequestHandlerBase.java:129)
at org.apache.solr.core.SolrCore.execute(SolrCore.java:1750)
at org.apache.solr.util.TestHarness.query(TestHarness.java:364)
at org.apache.solr.util.TestHarness.query(TestHarness.java:346)
at org.apache.solr.util.AbstractSolrTestCase.assertQ(AbstractSolrTestCase.java:273)
... 42 more
Build Log:
[...truncated 8356 lines...]
[junit4:junit4] Suite: org.apache.solr.handler.component.DistributedQueryElevationComponentTest
[junit4:junit4] 2> 3 T354 oas.SolrTestCaseJ4.setUp ###Starting testDistribSearch
[junit4:junit4] 2> 4 T354 oejs.Server.doStart jetty-8.1.2.v20120308
[junit4:junit4] 2> 8 T354 oejs.AbstractConnector.doStart Started SocketConnector@0.0.0.0:57747
[junit4:junit4] 2> 9 T354 oasc.SolrResourceLoader.locateSolrHome JNDI not configured for solr (NoInitialContextEx)
[junit4:junit4] 2> 9 T354 oasc.SolrResourceLoader.locateSolrHome using system property solr.solr.home: /mnt/ssd/jenkins/workspace/Lucene-Solr-4.x-Linux/solr/build/solr-core/test-files/solr
[junit4:junit4] 2> 10 T354 oasc.SolrResourceLoader.<init> new SolrResourceLoader for deduced Solr Home: '/mnt/ssd/jenkins/workspace/Lucene-Solr-4.x-Linux/solr/build/solr-core/test-files/solr/'
[junit4:junit4] 2> 19 T354 oass.SolrDispatchFilter.init SolrDispatchFilter.init()
[junit4:junit4] 2> 20 T354 oasc.SolrResourceLoader.locateSolrHome JNDI not configured for solr (NoInitialContextEx)
[junit4:junit4] 2> 20 T354 oasc.SolrResourceLoader.locateSolrHome using system property solr.solr.home: /mnt/ssd/jenkins/workspace/Lucene-Solr-4.x-Linux/solr/build/solr-core/test-files/solr
[junit4:junit4] 2> 21 T354 oasc.CoreContainer$Initializer.initialize looking for solr.xml: /mnt/ssd/jenkins/workspace/Lucene-Solr-4.x-Linux/solr/build/solr-core/test-files/solr/solr.xml
[junit4:junit4] 2> 21 T354 oasc.CoreContainer.<init> New CoreContainer 1356408040
[junit4:junit4] 2> 21 T354 oasc.CoreContainer.load Loading CoreContainer using Solr Home: '/mnt/ssd/jenkins/workspace/Lucene-Solr-4.x-Linux/solr/build/solr-core/test-files/solr/'
[junit4:junit4] 2> 22 T354 oasc.SolrResourceLoader.<init> new SolrResourceLoader for directory: '/mnt/ssd/jenkins/workspace/Lucene-Solr-4.x-Linux/solr/build/solr-core/test-files/solr/'
[junit4:junit4] 2> 35 T354 oasc.CoreContainer.load Registering Log Listener
[junit4:junit4] 2> 44 T354 oasc.CoreContainer.create Creating SolrCore 'collection1' using instanceDir: /mnt/ssd/jenkins/workspace/Lucene-Solr-4.x-Linux/solr/build/solr-core/test-files/solr/collection1
[junit4:junit4] 2> 44 T354 oasc.SolrResourceLoader.<init> new SolrResourceLoader for directory: '/mnt/ssd/jenkins/workspace/Lucene-Solr-4.x-Linux/solr/build/solr-core/test-files/solr/collection1/'
[junit4:junit4] 2> 45 T354 oasc.SolrResourceLoader.replaceClassLoader Adding 'file:/mnt/ssd/jenkins/workspace/Lucene-Solr-4.x-Linux/solr/build/solr-core/test-files/solr/collection1/lib/README' to classloader
[junit4:junit4] 2> 46 T354 oasc.SolrResourceLoader.replaceClassLoader Adding 'file:/mnt/ssd/jenkins/workspace/Lucene-Solr-4.x-Linux/solr/build/solr-core/test-files/solr/collection1/lib/classes/' to classloader
[junit4:junit4] 2> 65 T354 oasc.SolrConfig.<init> Using Lucene MatchVersion: LUCENE_41
[junit4:junit4] 2> 90 T354 oasc.SolrConfig.<init> Loaded SolrConfig: solrconfig-elevate.xml
[junit4:junit4] 2> 91 T354 oass.IndexSchema.readSchema Reading Solr Schema
[junit4:junit4] 2> 94 T354 oass.IndexSchema.readSchema Schema name=example
[junit4:junit4] 2> 205 T354 oass.IndexSchema.readSchema default search field in schema is text
[junit4:junit4] 2> 207 T354 oass.IndexSchema.readSchema unique key field: id
[junit4:junit4] 2> 210 T354 oasc.SolrCore.<init> [collection1] Opening new SolrCore at /mnt/ssd/jenkins/workspace/Lucene-Solr-4.x-Linux/solr/build/solr-core/test-files/solr/collection1/, dataDir=./org.apache.solr.handler.component.DistributedQueryElevationComponentTest-1349273610156/control/data/
[junit4:junit4] 2> 211 T354 oasc.JmxMonitoredMap.<init> JMX monitoring is enabled. Adding Solr mbeans to JMX Server: com.sun.jmx.mbeanserver.JmxMBeanServer@21f19e3
[junit4:junit4] 2> 211 T354 oasc.SolrCore.getNewIndexDir New index directory detected: old=null new=./org.apache.solr.handler.component.DistributedQueryElevationComponentTest-1349273610156/control/data/index/
[junit4:junit4] 2> 212 T354 oasc.SolrCore.initIndex WARNING [collection1] Solr index directory './org.apache.solr.handler.component.DistributedQueryElevationComponentTest-1349273610156/control/data/index' doesn't exist. Creating new index...
[junit4:junit4] 2> 213 T354 oasc.CachingDirectoryFactory.get return new directory for /mnt/ssd/jenkins/workspace/Lucene-Solr-4.x-Linux/solr/build/solr-core/test/J1/./org.apache.solr.handler.component.DistributedQueryElevationComponentTest-1349273610156/control/data/index forceNew:false
[junit4:junit4] 2> 214 T354 oasc.SolrDeletionPolicy.onCommit SolrDeletionPolicy.onCommit: commits:num=1
[junit4:junit4] 2> commit{dir=MockDirWrapper(org.apache.lucene.store.RAMDirectory@b09780d1 lockFactory=org.apache.lucene.store.SingleInstanceLockFactory@2c57ff98),segFN=segments_1,generation=1,filenames=[segments_1]
[junit4:junit4] 2> 214 T354 oasc.SolrDeletionPolicy.updateCommits newest commit = 1
[junit4:junit4] 2> 219 T354 oasc.RequestHandlers.initHandlersFromConfig created /update: solr.UpdateRequestHandler
[junit4:junit4] 2> 219 T354 oasc.RequestHandlers.initHandlersFromConfig created /elevate: org.apache.solr.handler.component.SearchHandler
[junit4:junit4] 2> 220 T354 oasc.RequestHandlers.initHandlersFromConfig created /dataElevate: org.apache.solr.handler.component.SearchHandler
[junit4:junit4] 2> 221 T354 oashl.XMLLoader.init xsltCacheLifetimeSeconds=60
[junit4:junit4] 2> 222 T354 oasc.RequestHandlers.initHandlersFromConfig WARNING no default request handler is registered (either '/select' or 'standard')
[junit4:junit4] 2> 223 T354 oasc.SolrCore.initDeprecatedSupport WARNING solrconfig.xml uses deprecated <admin/gettableFiles>, Please update your config to use the ShowFileRequestHandler.
[junit4:junit4] 2> 224 T354 oasc.SolrCore.initDeprecatedSupport WARNING adding ShowFileRequestHandler with hidden files: [BAD-SCHEMA-NOT-INDEXED-BUT-TF.XML, SCHEMA-REQUIRED-FIELDS.XML, SOLRCONFIG-MASTER1-KEEPONEBACKUP.XML, BAD-SCHEMA-NONTEXT-ANALYZER.XML, SOLRCONFIG-PROPINJECT.XML, SOLRCONFIG-PROPINJECT-INDEXDEFAULT.XML, STOP-2.TXT, SCHEMA11.XML, BAD-SCHEMA-UNIQUEKEY-USES-DEFAULT.XML, SCHEMA15.XML, SOLRCONFIG-NATIVELOCK.XML, SCHEMA-SIM.XML, CONDITIONAL.UPDATEPROCESSOR.JS, BAD-SOLRCONFIG-MISSING-SCRIPTFILE.XML, SOLRCONFIG-SCRIPT-UPDATEPROCESSOR.XML, SOLRCONFIG-REPEATER.XML, SOLRCONFIG-SPELLCHECKER.XML, SOLRCONFIG-NOCACHE.XML, SCHEMA-CHARFILTERS.XML, SOLRCONFIG-SOLCOREPROPERTIES.XML, SOLRCONFIG_CODEC.XML, BAD-SCHEMA-EXTERNAL-FILEFIELD.XML, HYPHENATION.DTD, TRIVIAL.UPDATEPROCESSOR1.JS, SCHEMA.XML, SOLRCONFIG-MERGEPOLICY.XML, SOLRCONFIG-PHRASESUGGEST.XML, SOLRCONFIG-SLAVE1.XML, SOLRCONFIG-BASIC.XML, SCHEMA-LMJELINEKMERCER.XML, BAD-MP-SOLRCONFIG.XML, BAD-SCHEMA-DUP-FIELD.XML, BAD-SCHEMA-UNIQUEKEY-MULTIVALUED.XML, SOLRCONFIG-MASTER.XML, SOLRCONFIG-HIGHLIGHT.XML, SCHEMA-TFIDF.XML, SCHEMA-REPLICATION1.XML, SYNONYMS.TXT, SOLRCONFIG-ELEVATE.XML, STOPWITHBOM.TXT, SOLRCONFIG-QUERYSENDER.XML, WDFTYPES.TXT, SOLRCONFIG-SNIPPET-PROCESSOR.XML, SOLRCONFIG-DELPOLICY1.XML, BAD_SOLRCONFIG.XML, HUNSPELL-TEST.DIC, SCHEMA-NUMERIC.XML, SCHEMA-LUCENEMATCHVERSION.XML, KEEP-2.TXT, SCHEMA-STOP-KEEP.XML, SCHEMA-IB.XML, STOP-SNOWBALL.TXT, SOLRCONFIG-SLAVE.XML, BAD-SCHEMA-NOT-INDEXED-BUT-NORMS.XML, STOPWORDSWRONGENCODING.TXT, THROW.ERROR.ON.ADD.UPDATEPROCESSOR.JS, STOPTYPES-1.TXT, SOLRCONFIG-SPELLCHECKCOMPONENT.XML, SOLRCONFIG-TLOG.XML, COMPOUNDDICTIONARY.TXT, DA_COMPOUNDDICTIONARY.TXT, SOLRCONFIG-TERMINDEX.XML, BAD-SOLRCONFIG-INVALID-SCRIPTFILE.XML, SCHEMASURROUND.XML, OPEN-EXCHANGE-RATES.JSON, BAD-SCHEMA-DUP-FIELDTYPE.XML, PHRASESUGGEST.TXT, BAD-SCHEMA-CURRENCY-FT-MULTIVALUED.XML, SOLRCONFIG-MASTER2.XML, OLD_SYNONYMS.TXT, BAD-SCHEMA-UNIQUEKEY-IS-COPYFIELD-DEST.XML, SCHEMA-NOT-REQUIRED-UNIQUE-KEY.XML, BAD-SCHEMA-CODEC-GLOBAL-VS-FT-MISMATCH.XML, SCHEMA-LMDIRICHLET.XML, BAD-SCHEMA-NOT-INDEXED-BUT-POS.XML, SCHEMA-REVERSED.XML, BAD-SCHEMA-CURRENCY-MULTIVALUED.XML, SCHEMA-FOLDING.XML, SOLRCONFIG-CACHING.XML, MAPPING-ISOLATIN1ACCENT.TXT, ADDFIELDS.UPDATEPROCESSOR.JS, SCHEMA-BM25.XML, STOP-1.TXT, SOLRCONFIG-ENABLEPLUGIN.XML, MISSING.FUNCTIONS.UPDATEPROCESSOR.JS, SCHEMA12.XML, SOLRCONFIG-TRANSFORMERS.XML, SCHEMA-COPYFIELD-TEST.XML, SOLRCONFIG-BASIC-LUCENEVERSION31.XML, BAD-SCHEMA-DUP-DYNAMICFIELD.XML, CURRENCY.XML, DA_UTF8.XML, MISSLEADING.EXTENSION.UPDATEPROCESSOR.JS.TXT, SOLRCONFIG-SOLR-749.XML, STOPWORDS.TXT, HUNSPELL-TEST.AFF, SOLRCONFIG_PERF.XML, SOLRCONFIG-SIMPLELOCK.XML, FRENCHARTICLES.TXT, SOLRCONFIG-LAZYWRITER.XML, SOLRCONFIG-RESPONSE-LOG-COMPONENT.XML, SCHEMA-REPLICATION2.XML, SCHEMA-SNIPPET-TYPE.XML, SCHEMA-SPATIAL.XML, SOLRCONFIG-XINCLUDE.XML, SCHEMA-SPELLCHECKER.XML, XSLT, SOLRCONFIG-DELPOLICY2.XML, TRIVIAL.UPDATEPROCESSOR0.JS, KEEP-1.TXT, BAD-SCHEMA-CURRENCY-DYNAMIC-MULTIVALUED.XML, SCHEMA-TRIE.XML, SCHEMA-BINARYFIELD.XML, SCHEMA-COLLATEFILTER.XML, BAD-SCHEMA-OMIT-TF-BUT-NOT-POS.XML, SCHEMA-MINIMAL.XML, STOPTYPES-2.TXT, SCHEMA_CODEC.XML, STEMDICT.TXT, ELEVATE.XML, SCHEMA-COLLATE.XML, PROTWORDS.TXT, SCHEMA-XINCLUDE.XML, SCHEMA-SNIPPET-FIELD.XML, SOLRCONFIG-REQHANDLER.INCL, SCHEMA-PHRASESUGGEST.XML, SCHEMA-DFR.XML, BAD-SCHEMA-ANALYZER-CLASS-AND-NESTED.XML, SOLRCONFIG-MASTER1.XML, SOLRCONFIG-FUNCTIONQUERY.XML, SOLRCONFIG-MASTER3.XML, SOLRCONFIG-UPDATE-PROCESSOR-CHAINS.XML, SOLRCONFIG-ALTDIRECTORY.XML, BAD-SCHEMA-SIM-GLOBAL-VS-FT-MISMATCH.XML, SOLRCONFIG-QUERYSENDER-NOQUERY.XML, BAD-SOLRCONFIG-BOGUS-SCRIPTENGINE-NAME.XML]
[junit4:junit4] 2> 226 T354 oass.SolrIndexSearcher.<init> Opening Searcher@4db05820 main
[junit4:junit4] 2> 226 T354 oass.SolrIndexSearcher.getIndexDir WARNING WARNING: Directory impl does not support setting indexDir: org.apache.lucene.store.MockDirectoryWrapper
[junit4:junit4] 2> 227 T354 oasu.CommitTracker.<init> Hard AutoCommit: disabled
[junit4:junit4] 2> 227 T354 oasu.CommitTracker.<init> Soft AutoCommit: disabled
[junit4:junit4] 2> 229 T354 oashc.QueryElevationComponent.inform Loading QueryElevation from: /mnt/ssd/jenkins/workspace/Lucene-Solr-4.x-Linux/solr/build/solr-core/test-files/solr/collection1/conf/elevate.xml
[junit4:junit4] 2> 237 T354 oashc.QueryElevationComponent.inform Loading QueryElevation from: /mnt/ssd/jenkins/workspace/Lucene-Solr-4.x-Linux/solr/build/solr-core/test-files/solr/collection1/conf/elevate.xml
[junit4:junit4] 2> 245 T354 oashc.HttpShardHandlerFactory.getParameter Setting socketTimeout to: 0
[junit4:junit4] 2> 245 T354 oashc.HttpShardHandlerFactory.getParameter Setting urlScheme to: http://
[junit4:junit4] 2> 246 T354 oashc.HttpShardHandlerFactory.getParameter Setting connTimeout to: 0
[junit4:junit4] 2> 246 T354 oashc.HttpShardHandlerFactory.getParameter Setting maxConnectionsPerHost to: 20
[junit4:junit4] 2> 247 T354 oashc.HttpShardHandlerFactory.getParameter Setting corePoolSize to: 0
[junit4:junit4] 2> 247 T354 oashc.HttpShardHandlerFactory.getParameter Setting maximumPoolSize to: 2147483647
[junit4:junit4] 2> 247 T354 oashc.HttpShardHandlerFactory.getParameter Setting maxThreadIdleTime to: 5
[junit4:junit4] 2> 248 T354 oashc.HttpShardHandlerFactory.getParameter Setting sizeOfQueue to: -1
[junit4:junit4] 2> 248 T354 oashc.HttpShardHandlerFactory.getParameter Setting fairnessPolicy to: false
[junit4:junit4] 2> 249 T354 oascsi.HttpClientUtil.createClient Creating new http client, config:maxConnectionsPerHost=20&maxConnections=10000&socketTimeout=0&connTimeout=0&retry=false
[junit4:junit4] 2> 262 T354 oasc.CoreContainer.register registering core: collection1
[junit4:junit4] 2> 262 T364 oasc.SolrCore.registerSearcher [collection1] Registered new searcher Searcher@4db05820 main{StandardDirectoryReader(segments_1:1)}
[junit4:junit4] 2> 263 T354 oass.SolrDispatchFilter.init user.dir=/mnt/ssd/jenkins/workspace/Lucene-Solr-4.x-Linux/solr/build/solr-core/test/J1
[junit4:junit4] 2> 263 T354 oass.SolrDispatchFilter.init SolrDispatchFilter.init() done
[junit4:junit4] 2> 263 T354 oascsi.HttpClientUtil.createClient Creating new http client, config:maxConnections=128&maxConnectionsPerHost=32&followRedirects=false
[junit4:junit4] 2> 267 T354 oejs.Server.doStart jetty-8.1.2.v20120308
[junit4:junit4] 2> 269 T354 oejs.AbstractConnector.doStart Started SocketConnector@0.0.0.0:38641
[junit4:junit4] 2> 270 T354 oasc.SolrResourceLoader.locateSolrHome JNDI not configured for solr (NoInitialContextEx)
[junit4:junit4] 2> 270 T354 oasc.SolrResourceLoader.locateSolrHome using system property solr.solr.home: /mnt/ssd/jenkins/workspace/Lucene-Solr-4.x-Linux/solr/build/solr-core/test-files/solr
[junit4:junit4] 2> 270 T354 oasc.SolrResourceLoader.<init> new SolrResourceLoader for deduced Solr Home: '/mnt/ssd/jenkins/workspace/Lucene-Solr-4.x-Linux/solr/build/solr-core/test-files/solr/'
[junit4:junit4] 2> 283 T354 oass.SolrDispatchFilter.init SolrDispatchFilter.init()
[junit4:junit4] 2> 283 T354 oasc.SolrResourceLoader.locateSolrHome JNDI not configured for solr (NoInitialContextEx)
[junit4:junit4] 2> 284 T354 oasc.SolrResourceLoader.locateSolrHome using system property solr.solr.home: /mnt/ssd/jenkins/workspace/Lucene-Solr-4.x-Linux/solr/build/solr-core/test-files/solr
[junit4:junit4] 2> 284 T354 oasc.CoreContainer$Initializer.initialize looking for solr.xml: /mnt/ssd/jenkins/workspace/Lucene-Solr-4.x-Linux/solr/build/solr-core/test-files/solr/solr.xml
[junit4:junit4] 2> 285 T354 oasc.CoreContainer.<init> New CoreContainer -1257125419
[junit4:junit4] 2> 285 T354 oasc.CoreContainer.load Loading CoreContainer using Solr Home: '/mnt/ssd/jenkins/workspace/Lucene-Solr-4.x-Linux/solr/build/solr-core/test-files/solr/'
[junit4:junit4] 2> 286 T354 oasc.SolrResourceLoader.<init> new SolrResourceLoader for directory: '/mnt/ssd/jenkins/workspace/Lucene-Solr-4.x-Linux/solr/build/solr-core/test-files/solr/'
[junit4:junit4] 2> 298 T354 oasc.CoreContainer.load Registering Log Listener
[junit4:junit4] 2> 308 T354 oasc.CoreContainer.create Creating SolrCore 'collection1' using instanceDir: /mnt/ssd/jenkins/workspace/Lucene-Solr-4.x-Linux/solr/build/solr-core/test-files/solr/collection1
[junit4:junit4] 2> 308 T354 oasc.SolrResourceLoader.<init> new SolrResourceLoader for directory: '/mnt/ssd/jenkins/workspace/Lucene-Solr-4.x-Linux/solr/build/solr-core/test-files/solr/collection1/'
[junit4:junit4] 2> 309 T354 oasc.SolrResourceLoader.replaceClassLoader Adding 'file:/mnt/ssd/jenkins/workspace/Lucene-Solr-4.x-Linux/solr/build/solr-core/test-files/solr/collection1/lib/README' to classloader
[junit4:junit4] 2> 309 T354 oasc.SolrResourceLoader.replaceClassLoader Adding 'file:/mnt/ssd/jenkins/workspace/Lucene-Solr-4.x-Linux/solr/build/solr-core/test-files/solr/collection1/lib/classes/' to classloader
[junit4:junit4] 2> 328 T354 oasc.SolrConfig.<init> Using Lucene MatchVersion: LUCENE_41
[junit4:junit4] 2> 352 T354 oasc.SolrConfig.<init> Loaded SolrConfig: solrconfig-elevate.xml
[junit4:junit4] 2> 353 T354 oass.IndexSchema.readSchema Reading Solr Schema
[junit4:junit4] 2> 356 T354 oass.IndexSchema.readSchema Schema name=example
[junit4:junit4] 2> 489 T354 oass.IndexSchema.readSchema default search field in schema is text
[junit4:junit4] 2> 490 T354 oass.IndexSchema.readSchema unique key field: id
[junit4:junit4] 2> 495 T354 oasc.SolrCore.<init> [collection1] Opening new SolrCore at /mnt/ssd/jenkins/workspace/Lucene-Solr-4.x-Linux/solr/build/solr-core/test-files/solr/collection1/, dataDir=./org.apache.solr.handler.component.DistributedQueryElevationComponentTest-1349273610156/shard0/data/
[junit4:junit4] 2> 495 T354 oasc.JmxMonitoredMap.<init> JMX monitoring is enabled. Adding Solr mbeans to JMX Server: com.sun.jmx.mbeanserver.JmxMBeanServer@21f19e3
[junit4:junit4] 2> 496 T354 oasc.SolrCore.getNewIndexDir New index directory detected: old=null new=./org.apache.solr.handler.component.DistributedQueryElevationComponentTest-1349273610156/shard0/data/index/
[junit4:junit4] 2> 497 T354 oasc.SolrCore.initIndex WARNING [collection1] Solr index directory './org.apache.solr.handler.component.DistributedQueryElevationComponentTest-1349273610156/shard0/data/index' doesn't exist. Creating new index...
[junit4:junit4] 2> 498 T354 oasc.CachingDirectoryFactory.get return new directory for /mnt/ssd/jenkins/workspace/Lucene-Solr-4.x-Linux/solr/build/solr-core/test/J1/./org.apache.solr.handler.component.DistributedQueryElevationComponentTest-1349273610156/shard0/data/index forceNew:false
[junit4:junit4] 2> 499 T354 oasc.SolrDeletionPolicy.onCommit SolrDeletionPolicy.onCommit: commits:num=1
[junit4:junit4] 2> commit{dir=MockDirWrapper(org.apache.lucene.store.RAMDirectory@45474d68 lockFactory=org.apache.lucene.store.SingleInstanceLockFactory@dbc15cd7),segFN=segments_1,generation=1,filenames=[segments_1]
[junit4:junit4] 2> 500 T354 oasc.SolrDeletionPolicy.updateCommits newest commit = 1
[junit4:junit4] 2> 502 T354 oasc.RequestHandlers.initHandlersFromConfig created /update: solr.UpdateRequestHandler
[junit4:junit4] 2> 503 T354 oasc.RequestHandlers.initHandlersFromConfig created /elevate: org.apache.solr.handler.component.SearchHandler
[junit4:junit4] 2> 504 T354 oasc.RequestHandlers.initHandlersFromConfig created /dataElevate: org.apache.solr.handler.component.SearchHandler
[junit4:junit4] 2> 505 T354 oashl.XMLLoader.init xsltCacheLifetimeSeconds=60
[junit4:junit4] 2> 506 T354 oasc.RequestHandlers.initHandlersFromConfig WARNING no default request handler is registered (either '/select' or 'standard')
[junit4:junit4] 2> 507 T354 oasc.SolrCore.initDeprecatedSupport WARNING solrconfig.xml uses deprecated <admin/gettableFiles>, Please update your config to use the ShowFileRequestHandler.
[junit4:junit4] 2> 509 T354 oasc.SolrCore.initDeprecatedSupport WARNING adding ShowFileRequestHandler with hidden files: [BAD-SCHEMA-NOT-INDEXED-BUT-TF.XML, SCHEMA-REQUIRED-FIELDS.XML, SOLRCONFIG-MASTER1-KEEPONEBACKUP.XML, BAD-SCHEMA-NONTEXT-ANALYZER.XML, SOLRCONFIG-PROPINJECT.XML, SOLRCONFIG-PROPINJECT-INDEXDEFAULT.XML, STOP-2.TXT, SCHEMA11.XML, BAD-SCHEMA-UNIQUEKEY-USES-DEFAULT.XML, SCHEMA15.XML, SOLRCONFIG-NATIVELOCK.XML, SCHEMA-SIM.XML, CONDITIONAL.UPDATEPROCESSOR.JS, BAD-SOLRCONFIG-MISSING-SCRIPTFILE.XML, SOLRCONFIG-SCRIPT-UPDATEPROCESSOR.XML, SOLRCONFIG-REPEATER.XML, SOLRCONFIG-SPELLCHECKER.XML, SOLRCONFIG-NOCACHE.XML, SCHEMA-CHARFILTERS.XML, SOLRCONFIG-SOLCOREPROPERTIES.XML, SOLRCONFIG_CODEC.XML, BAD-SCHEMA-EXTERNAL-FILEFIELD.XML, HYPHENATION.DTD, TRIVIAL.UPDATEPROCESSOR1.JS, SCHEMA.XML, SOLRCONFIG-MERGEPOLICY.XML, SOLRCONFIG-PHRASESUGGEST.XML, SOLRCONFIG-SLAVE1.XML, SOLRCONFIG-BASIC.XML, SCHEMA-LMJELINEKMERCER.XML, BAD-MP-SOLRCONFIG.XML, BAD-SCHEMA-DUP-FIELD.XML, BAD-SCHEMA-UNIQUEKEY-MULTIVALUED.XML, SOLRCONFIG-MASTER.XML, SOLRCONFIG-HIGHLIGHT.XML, SCHEMA-TFIDF.XML, SCHEMA-REPLICATION1.XML, SYNONYMS.TXT, SOLRCONFIG-ELEVATE.XML, STOPWITHBOM.TXT, SOLRCONFIG-QUERYSENDER.XML, WDFTYPES.TXT, SOLRCONFIG-SNIPPET-PROCESSOR.XML, SOLRCONFIG-DELPOLICY1.XML, BAD_SOLRCONFIG.XML, HUNSPELL-TEST.DIC, SCHEMA-NUMERIC.XML, SCHEMA-LUCENEMATCHVERSION.XML, KEEP-2.TXT, SCHEMA-STOP-KEEP.XML, SCHEMA-IB.XML, STOP-SNOWBALL.TXT, SOLRCONFIG-SLAVE.XML, BAD-SCHEMA-NOT-INDEXED-BUT-NORMS.XML, STOPWORDSWRONGENCODING.TXT, THROW.ERROR.ON.ADD.UPDATEPROCESSOR.JS, STOPTYPES-1.TXT, SOLRCONFIG-SPELLCHECKCOMPONENT.XML, SOLRCONFIG-TLOG.XML, COMPOUNDDICTIONARY.TXT, DA_COMPOUNDDICTIONARY.TXT, SOLRCONFIG-TERMINDEX.XML, BAD-SOLRCONFIG-INVALID-SCRIPTFILE.XML, SCHEMASURROUND.XML, OPEN-EXCHANGE-RATES.JSON, BAD-SCHEMA-DUP-FIELDTYPE.XML, PHRASESUGGEST.TXT, BAD-SCHEMA-CURRENCY-FT-MULTIVALUED.XML, SOLRCONFIG-MASTER2.XML, OLD_SYNONYMS.TXT, BAD-SCHEMA-UNIQUEKEY-IS-COPYFIELD-DEST.XML, SCHEMA-NOT-REQUIRED-UNIQUE-KEY.XML, BAD-SCHEMA-CODEC-GLOBAL-VS-FT-MISMATCH.XML, SCHEMA-LMDIRICHLET.XML, BAD-SCHEMA-NOT-INDEXED-BUT-POS.XML, SCHEMA-REVERSED.XML, BAD-SCHEMA-CURRENCY-MULTIVALUED.XML, SCHEMA-FOLDING.XML, SOLRCONFIG-CACHING.XML, MAPPING-ISOLATIN1ACCENT.TXT, ADDFIELDS.UPDATEPROCESSOR.JS, SCHEMA-BM25.XML, STOP-1.TXT, SOLRCONFIG-ENABLEPLUGIN.XML, MISSING.FUNCTIONS.UPDATEPROCESSOR.JS, SCHEMA12.XML, SOLRCONFIG-TRANSFORMERS.XML, SCHEMA-COPYFIELD-TEST.XML, SOLRCONFIG-BASIC-LUCENEVERSION31.XML, BAD-SCHEMA-DUP-DYNAMICFIELD.XML, CURRENCY.XML, DA_UTF8.XML, MISSLEADING.EXTENSION.UPDATEPROCESSOR.JS.TXT, SOLRCONFIG-SOLR-749.XML, STOPWORDS.TXT, HUNSPELL-TEST.AFF, SOLRCONFIG_PERF.XML, SOLRCONFIG-SIMPLELOCK.XML, FRENCHARTICLES.TXT, SOLRCONFIG-LAZYWRITER.XML, SOLRCONFIG-RESPONSE-LOG-COMPONENT.XML, SCHEMA-REPLICATION2.XML, SCHEMA-SNIPPET-TYPE.XML, SCHEMA-SPATIAL.XML, SOLRCONFIG-XINCLUDE.XML, SCHEMA-SPELLCHECKER.XML, XSLT, SOLRCONFIG-DELPOLICY2.XML, TRIVIAL.UPDATEPROCESSOR0.JS, KEEP-1.TXT, BAD-SCHEMA-CURRENCY-DYNAMIC-MULTIVALUED.XML, SCHEMA-TRIE.XML, SCHEMA-BINARYFIELD.XML, SCHEMA-COLLATEFILTER.XML, BAD-SCHEMA-OMIT-TF-BUT-NOT-POS.XML, SCHEMA-MINIMAL.XML, STOPTYPES-2.TXT, SCHEMA_CODEC.XML, STEMDICT.TXT, ELEVATE.XML, SCHEMA-COLLATE.XML, PROTWORDS.TXT, SCHEMA-XINCLUDE.XML, SCHEMA-SNIPPET-FIELD.XML, SOLRCONFIG-REQHANDLER.INCL, SCHEMA-PHRASESUGGEST.XML, SCHEMA-DFR.XML, BAD-SCHEMA-ANALYZER-CLASS-AND-NESTED.XML, SOLRCONFIG-MASTER1.XML, SOLRCONFIG-FUNCTIONQUERY.XML, SOLRCONFIG-MASTER3.XML, SOLRCONFIG-UPDATE-PROCESSOR-CHAINS.XML, SOLRCONFIG-ALTDIRECTORY.XML, BAD-SCHEMA-SIM-GLOBAL-VS-FT-MISMATCH.XML, SOLRCONFIG-QUERYSENDER-NOQUERY.XML, BAD-SOLRCONFIG-BOGUS-SCRIPTENGINE-NAME.XML]
[junit4:junit4] 2> 510 T354 oass.SolrIndexSearcher.<init> Opening Searcher@3b35e4e7 main
[junit4:junit4] 2> 511 T354 oass.SolrIndexSearcher.getIndexDir WARNING WARNING: Directory impl does not support setting indexDir: org.apache.lucene.store.MockDirectoryWrapper
[junit4:junit4] 2> 511 T354 oasu.CommitTracker.<init> Hard AutoCommit: disabled
[junit4:junit4] 2> 512 T354 oasu.CommitTracker.<init> Soft AutoCommit: disabled
[junit4:junit4] 2> 513 T354 oashc.QueryElevationComponent.inform Loading QueryElevation from: /mnt/ssd/jenkins/workspace/Lucene-Solr-4.x-Linux/solr/build/solr-core/test-files/solr/collection1/conf/elevate.xml
[junit4:junit4] 2> 523 T354 oashc.QueryElevationComponent.inform Loading QueryElevation from: /mnt/ssd/jenkins/workspace/Lucene-Solr-4.x-Linux/solr/build/solr-core/test-files/solr/collection1/conf/elevate.xml
[junit4:junit4] 2> 533 T354 oashc.HttpShardHandlerFactory.getParameter Setting socketTimeout to: 0
[junit4:junit4] 2> 534 T354 oashc.HttpShardHandlerFactory.getParameter Setting urlScheme to: http://
[junit4:junit4] 2> 534 T354 oashc.HttpShardHandlerFactory.getParameter Setting connTimeout to: 0
[junit4:junit4] 2> 534 T354 oashc.HttpShardHandlerFactory.getParameter Setting maxConnectionsPerHost to: 20
[junit4:junit4] 2> 535 T354 oashc.HttpShardHandlerFactory.getParameter Setting corePoolSize to: 0
[junit4:junit4] 2> 535 T354 oashc.HttpShardHandlerFactory.getParameter Setting maximumPoolSize to: 2147483647
[junit4:junit4] 2> 536 T354 oashc.HttpShardHandlerFactory.getParameter Setting maxThreadIdleTime to: 5
[junit4:junit4] 2> 536 T354 oashc.HttpShardHandlerFactory.getParameter Setting sizeOfQueue to: -1
[junit4:junit4] 2> 537 T354 oashc.HttpShardHandlerFactory.getParameter Setting fairnessPolicy to: false
[junit4:junit4] 2> 537 T354 oascsi.HttpClientUtil.createClient Creating new http client, config:maxConnectionsPerHost=20&maxConnections=10000&socketTimeout=0&connTimeout=0&retry=false
[junit4:junit4] 2> 543 T374 oasc.SolrCore.registerSearcher [collection1] Registered new searcher Searcher@3b35e4e7 main{StandardDirectoryReader(segments_1:1)}
[junit4:junit4] 2> 543 T354 oasc.CoreContainer.register registering core: collection1
[junit4:junit4] 2> 544 T354 oass.SolrDispatchFilter.init user.dir=/mnt/ssd/jenkins/workspace/Lucene-Solr-4.x-Linux/solr/build/solr-core/test/J1
[junit4:junit4] 2> 544 T354 oass.SolrDispatchFilter.init SolrDispatchFilter.init() done
[junit4:junit4] 2> 545 T354 oascsi.HttpClientUtil.createClient Creating new http client, config:maxConnections=128&maxConnectionsPerHost=32&followRedirects=false
[junit4:junit4] 2> 548 T354 oejs.Server.doStart jetty-8.1.2.v20120308
[junit4:junit4] 2> 550 T354 oejs.AbstractConnector.doStart Started SocketConnector@0.0.0.0:44061
[junit4:junit4] 2> 551 T354 oasc.SolrResourceLoader.locateSolrHome JNDI not configured for solr (NoInitialContextEx)
[junit4:junit4] 2> 551 T354 oasc.SolrResourceLoader.locateSolrHome using system property solr.solr.home: /mnt/ssd/jenkins/workspace/Lucene-Solr-4.x-Linux/solr/build/solr-core/test-files/solr
[junit4:junit4] 2> 552 T354 oasc.SolrResourceLoader.<init> new SolrResourceLoader for deduced Solr Home: '/mnt/ssd/jenkins/workspace/Lucene-Solr-4.x-Linux/solr/build/solr-core/test-files/solr/'
[junit4:junit4] 2> 567 T354 oass.SolrDispatchFilter.init SolrDispatchFilter.init()
[junit4:junit4] 2> 567 T354 oasc.SolrResourceLoader.locateSolrHome JNDI not configured for solr (NoInitialContextEx)
[junit4:junit4] 2> 568 T354 oasc.SolrResourceLoader.locateSolrHome using system property solr.solr.home: /mnt/ssd/jenkins/workspace/Lucene-Solr-4.x-Linux/solr/build/solr-core/test-files/solr
[junit4:junit4] 2> 569 T354 oasc.CoreContainer$Initializer.initialize looking for solr.xml: /mnt/ssd/jenkins/workspace/Lucene-Solr-4.x-Linux/solr/build/solr-core/test-files/solr/solr.xml
[junit4:junit4] 2> 569 T354 oasc.CoreContainer.<init> New CoreContainer 1424876057
[junit4:junit4] 2> 570 T354 oasc.CoreContainer.load Loading CoreContainer using Solr Home: '/mnt/ssd/jenkins/workspace/Lucene-Solr-4.x-Linux/solr/build/solr-core/test-files/solr/'
[junit4:junit4] 2> 571 T354 oasc.SolrResourceLoader.<init> new SolrResourceLoader for directory: '/mnt/ssd/jenkins/workspace/Lucene-Solr-4.x-Linux/solr/build/solr-core/test-files/solr/'
[junit4:junit4] 2> 588 T354 oasc.CoreContainer.load Registering Log Listener
[junit4:junit4] 2> 601 T354 oasc.CoreContainer.create Creating SolrCore 'collection1' using instanceDir: /mnt/ssd/jenkins/workspace/Lucene-Solr-4.x-Linux/solr/build/solr-core/test-files/solr/collection1
[junit4:junit4] 2> 601 T354 oasc.SolrResourceLoader.<init> new SolrResourceLoader for directory: '/mnt/ssd/jenkins/workspace/Lucene-Solr-4.x-Linux/solr/build/solr-core/test-files/solr/collection1/'
[junit4:junit4] 2> 602 T354 oasc.SolrResourceLoader.replaceClassLoader Adding 'file:/mnt/ssd/jenkins/workspace/Lucene-Solr-4.x-Linux/solr/build/solr-core/test-files/solr/collection1/lib/README' to classloader
[junit4:junit4] 2> 603 T354 oasc.SolrResourceLoader.replaceClassLoader Adding 'file:/mnt/ssd/jenkins/workspace/Lucene-Solr-4.x-Linux/solr/build/solr-core/test-files/solr/collection1/lib/classes/' to classloader
[junit4:junit4] 2> 641 T354 oasc.SolrConfig.<init> Using Lucene MatchVersion: LUCENE_41
[junit4:junit4] 2> 693 T354 oasc.SolrConfig.<init> Loaded SolrConfig: solrconfig-elevate.xml
[junit4:junit4] 2> 694 T354 oass.IndexSchema.readSchema Reading Solr Schema
[junit4:junit4] 2> 699 T354 oass.IndexSchema.readSchema Schema name=example
[junit4:junit4] 2> 906 T354 oass.IndexSchema.readSchema default search field in schema is text
[junit4:junit4] 2> 909 T354 oass.IndexSchema.readSchema unique key field: id
[junit4:junit4] 2> 915 T354 oasc.SolrCore.<init> [collection1] Opening new SolrCore at /mnt/ssd/jenkins/workspace/Lucene-Solr-4.x-Linux/solr/build/solr-core/test-files/solr/collection1/, dataDir=./org.apache.solr.handler.component.DistributedQueryElevationComponentTest-1349273610156/shard1/data/
[junit4:junit4] 2> 916 T354 oasc.JmxMonitoredMap.<init> JMX monitoring is enabled. Adding Solr mbeans to JMX Server: com.sun.jmx.mbeanserver.JmxMBeanServer@21f19e3
[junit4:junit4] 2> 917 T354 oasc.SolrCore.getNewIndexDir New index directory detected: old=null new=./org.apache.solr.handler.component.DistributedQueryElevationComponentTest-1349273610156/shard1/data/index/
[junit4:junit4] 2> 918 T354 oasc.SolrCore.initIndex WARNING [collection1] Solr index directory './org.apache.solr.handler.component.DistributedQueryElevationComponentTest-1349273610156/shard1/data/index' doesn't exist. Creating new index...
[junit4:junit4] 2> 919 T354 oasc.CachingDirectoryFactory.get return new directory for /mnt/ssd/jenkins/workspace/Lucene-Solr-4.x-Linux/solr/build/solr-core/test/J1/./org.apache.solr.handler.component.DistributedQueryElevationComponentTest-1349273610156/shard1/data/index forceNew:false
[junit4:junit4] 2> 921 T354 oasc.SolrDeletionPolicy.onCommit SolrDeletionPolicy.onCommit: commits:num=1
[junit4:junit4] 2> commit{dir=MockDirWrapper(org.apache.lucene.store.RAMDirectory@b588982f lockFactory=org.apache.lucene.store.SingleInstanceLockFactory@87ccc098),segFN=segments_1,generation=1,filenames=[segments_1]
[junit4:junit4] 2> 922 T354 oasc.SolrDeletionPolicy.updateCommits newest commit = 1
[junit4:junit4] 2> 924 T354 oasc.RequestHandlers.initHandlersFromConfig created /update: solr.UpdateRequestHandler
[junit4:junit4] 2> 926 T354 oasc.RequestHandlers.initHandlersFromConfig created /elevate: org.apache.solr.handler.component.SearchHandler
[junit4:junit4] 2> 927 T354 oasc.RequestHandlers.initHandlersFromConfig created /dataElevate: org.apache.solr.handler.component.SearchHandler
[junit4:junit4] 2> 929 T354 oashl.XMLLoader.init xsltCacheLifetimeSeconds=60
[junit4:junit4] 2> 930 T354 oasc.RequestHandlers.initHandlersFromConfig WARNING no default request handler is registered (either '/select' or 'standard')
[junit4:junit4] 2> 932 T354 oasc.SolrCore.initDeprecatedSupport WARNING solrconfig.xml uses deprecated <admin/gettableFiles>, Please update your config to use the ShowFileRequestHandler.
[junit4:junit4] 2> 934 T354 oasc.SolrCore.initDeprecatedSupport WARNING adding ShowFileRequestHandler with hidden files: [BAD-SCHEMA-NOT-INDEXED-BUT-TF.XML, SCHEMA-REQUIRED-FIELDS.XML, SOLRCONFIG-MASTER1-KEEPONEBACKUP.XML, BAD-SCHEMA-NONTEXT-ANALYZER.XML, SOLRCONFIG-PROPINJECT.XML, SOLRCONFIG-PROPINJECT-INDEXDEFAULT.XML, STOP-2.TXT, SCHEMA11.XML, BAD-SCHEMA-UNIQUEKEY-USES-DEFAULT.XML, SCHEMA15.XML, SOLRCONFIG-NATIVELOCK.XML, SCHEMA-SIM.XML, CONDITIONAL.UPDATEPROCESSOR.JS, BAD-SOLRCONFIG-MISSING-SCRIPTFILE.XML, SOLRCONFIG-SCRIPT-UPDATEPROCESSOR.XML, SOLRCONFIG-REPEATER.XML, SOLRCONFIG-SPELLCHECKER.XML, SOLRCONFIG-NOCACHE.XML, SCHEMA-CHARFILTERS.XML, SOLRCONFIG-SOLCOREPROPERTIES.XML, SOLRCONFIG_CODEC.XML, BAD-SCHEMA-EXTERNAL-FILEFIELD.XML, HYPHENATION.DTD, TRIVIAL.UPDATEPROCESSOR1.JS, SCHEMA.XML, SOLRCONFIG-MERGEPOLICY.XML, SOLRCONFIG-PHRASESUGGEST.XML, SOLRCONFIG-SLAVE1.XML, SOLRCONFIG-BASIC.XML, SCHEMA-LMJELINEKMERCER.XML, BAD-MP-SOLRCONFIG.XML, BAD-SCHEMA-DUP-FIELD.XML, BAD-SCHEMA-UNIQUEKEY-MULTIVALUED.XML, SOLRCONFIG-MASTER.XML, SOLRCONFIG-HIGHLIGHT.XML, SCHEMA-TFIDF.XML, SCHEMA-REPLICATION1.XML, SYNONYMS.TXT, SOLRCONFIG-ELEVATE.XML, STOPWITHBOM.TXT, SOLRCONFIG-QUERYSENDER.XML, WDFTYPES.TXT, SOLRCONFIG-SNIPPET-PROCESSOR.XML, SOLRCONFIG-DELPOLICY1.XML, BAD_SOLRCONFIG.XML, HUNSPELL-TEST.DIC, SCHEMA-NUMERIC.XML, SCHEMA-LUCENEMATCHVERSION.XML, KEEP-2.TXT, SCHEMA-STOP-KEEP.XML, SCHEMA-IB.XML, STOP-SNOWBALL.TXT, SOLRCONFIG-SLAVE.XML, BAD-SCHEMA-NOT-INDEXED-BUT-NORMS.XML, STOPWORDSWRONGENCODING.TXT, THROW.ERROR.ON.ADD.UPDATEPROCESSOR.JS, STOPTYPES-1.TXT, SOLRCONFIG-SPELLCHECKCOMPONENT.XML, SOLRCONFIG-TLOG.XML, COMPOUNDDICTIONARY.TXT, DA_COMPOUNDDICTIONARY.TXT, SOLRCONFIG-TERMINDEX.XML, BAD-SOLRCONFIG-INVALID-SCRIPTFILE.XML, SCHEMASURROUND.XML, OPEN-EXCHANGE-RATES.JSON, BAD-SCHEMA-DUP-FIELDTYPE.XML, PHRASESUGGEST.TXT, BAD-SCHEMA-CURRENCY-FT-MULTIVALUED.XML, SOLRCONFIG-MASTER2.XML, OLD_SYNONYMS.TXT, BAD-SCHEMA-UNIQUEKEY-IS-COPYFIELD-DEST.XML, SCHEMA-NOT-REQUIRED-UNIQUE-KEY.XML, BAD-SCHEMA-CODEC-GLOBAL-VS-FT-MISMATCH.XML, SCHEMA-LMDIRICHLET.XML, BAD-SCHEMA-NOT-INDEXED-BUT-POS.XML, SCHEMA-REVERSED.XML, BAD-SCHEMA-CURRENCY-MULTIVALUED.XML, SCHEMA-FOLDING.XML, SOLRCONFIG-CACHING.XML, MAPPING-ISOLATIN1ACCENT.TXT, ADDFIELDS.UPDATEPROCESSOR.JS, SCHEMA-BM25.XML, STOP-1.TXT, SOLRCONFIG-ENABLEPLUGIN.XML, MISSING.FUNCTIONS.UPDATEPROCESSOR.JS, SCHEMA12.XML, SOLRCONFIG-TRANSFORMERS.XML, SCHEMA-COPYFIELD-TEST.XML, SOLRCONFIG-BASIC-LUCENEVERSION31.XML, BAD-SCHEMA-DUP-DYNAMICFIELD.XML, CURRENCY.XML, DA_UTF8.XML, MISSLEADING.EXTENSION.UPDATEPROCESSOR.JS.TXT, SOLRCONFIG-SOLR-749.XML, STOPWORDS.TXT, HUNSPELL-TEST.AFF, SOLRCONFIG_PERF.XML, SOLRCONFIG-SIMPLELOCK.XML, FRENCHARTICLES.TXT, SOLRCONFIG-LAZYWRITER.XML, SOLRCONFIG-RESPONSE-LOG-COMPONENT.XML, SCHEMA-REPLICATION2.XML, SCHEMA-SNIPPET-TYPE.XML, SCHEMA-SPATIAL.XML, SOLRCONFIG-XINCLUDE.XML, SCHEMA-SPELLCHECKER.XML, XSLT, SOLRCONFIG-DELPOLICY2.XML, TRIVIAL.UPDATEPROCESSOR0.JS, KEEP-1.TXT, BAD-SCHEMA-CURRENCY-DYNAMIC-MULTIVALUED.XML, SCHEMA-TRIE.XML, SCHEMA-BINARYFIELD.XML, SCHEMA-COLLATEFILTER.XML, BAD-SCHEMA-OMIT-TF-BUT-NOT-POS.XML, SCHEMA-MINIMAL.XML, STOPTYPES-2.TXT, SCHEMA_CODEC.XML, STEMDICT.TXT, ELEVATE.XML, SCHEMA-COLLATE.XML, PROTWORDS.TXT, SCHEMA-XINCLUDE.XML, SCHEMA-SNIPPET-FIELD.XML, SOLRCONFIG-REQHANDLER.INCL, SCHEMA-PHRASESUGGEST.XML, SCHEMA-DFR.XML, BAD-SCHEMA-ANALYZER-CLASS-AND-NESTED.XML, SOLRCONFIG-MASTER1.XML, SOLRCONFIG-FUNCTIONQUERY.XML, SOLRCONFIG-MASTER3.XML, SOLRCONFIG-UPDATE-PROCESSOR-CHAINS.XML, SOLRCONFIG-ALTDIRECTORY.XML, BAD-SCHEMA-SIM-GLOBAL-VS-FT-MISMATCH.XML, SOLRCONFIG-QUERYSENDER-NOQUERY.XML, BAD-SOLRCONFIG-BOGUS-SCRIPTENGINE-NAME.XML]
[junit4:junit4] 2> 941 T354 oass.SolrIndexSearcher.<init> Opening Searcher@f8ab157 main
[junit4:junit4] 2> 941 T354 oass.SolrIndexSearcher.getIndexDir WARNING WARNING: Directory impl does not support setting indexDir: org.apache.lucene.store.MockDirectoryWrapper
[junit4:junit4] 2> 942 T354 oasu.CommitTracker.<init> Hard AutoCommit: disabled
[junit4:junit4] 2> 942 T354 oasu.CommitTracker.<init> Soft AutoCommit: disabled
[junit4:junit4] 2> 943 T354 oashc.QueryElevationComponent.inform Loading QueryElevation from: /mnt/ssd/jenkins/workspace/Lucene-Solr-4.x-Linux/solr/build/solr-core/test-files/solr/collection1/conf/elevate.xml
[junit4:junit4] 2> 955 T354 oashc.QueryElevationComponent.inform Loading QueryElevation from: /mnt/ssd/jenkins/workspace/Lucene-Solr-4.x-Linux/solr/build/solr-core/test-files/solr/collection1/conf/elevate.xml
[junit4:junit4] 2> 969 T354 oashc.HttpShardHandlerFactory.getParameter Setting socketTimeout to: 0
[junit4:junit4] 2> 970 T354 oashc.HttpShardHandlerFactory.getParameter Setting urlScheme to: http://
[junit4:junit4] 2> 971 T354 oashc.HttpShardHandlerFactory.getParameter Setting connTimeout to: 0
[junit4:junit4] 2> 972 T354 oashc.HttpShardHandlerFactory.getParameter Setting maxConnectionsPerHost to: 20
[junit4:junit4] 2> 972 T354 oashc.HttpShardHandlerFactory.getParameter Setting corePoolSize to: 0
[junit4:junit4] 2> 973 T354 oashc.HttpShardHandlerFactory.getParameter Setting maximumPoolSize to: 2147483647
[junit4:junit4] 2> 974 T354 oashc.HttpShardHandlerFactory.getParameter Setting maxThreadIdleTime to: 5
[junit4:junit4] 2> 975 T354 oashc.HttpShardHandlerFactory.getParameter Setting sizeOfQueue to: -1
[junit4:junit4] 2> 975 T354 oashc.HttpShardHandlerFactory.getParameter Setting fairnessPolicy to: false
[junit4:junit4] 2> 976 T354 oascsi.HttpClientUtil.createClient Creating new http client, config:maxConnectionsPerHost=20&maxConnections=10000&socketTimeout=0&connTimeout=0&retry=false
[junit4:junit4] 2> 984 T354 oasc.CoreContainer.register registering core: collection1
[junit4:junit4] 2> 985 T354 oass.SolrDispatchFilter.init user.dir=/mnt/ssd/jenkins/workspace/Lucene-Solr-4.x-Linux/solr/build/solr-core/test/J1
[junit4:junit4] 2> 985 T354 oass.SolrDispatchFilter.init SolrDispatchFilter.init() done
[junit4:junit4] 2> 986 T354 oascsi.HttpClientUtil.createClient Creating new http client, config:maxConnections=128&maxConnectionsPerHost=32&followRedirects=false
[junit4:junit4] 2> 990 T384 oasc.SolrCore.registerSearcher [collection1] Registered new searcher Searcher@f8ab157 main{StandardDirectoryReader(segments_1:1)}
[junit4:junit4] 2> 992 T354 oejs.Server.doStart jetty-8.1.2.v20120308
[junit4:junit4] 2> 994 T354 oejs.AbstractConnector.doStart Started SocketConnector@0.0.0.0:53295
[junit4:junit4] 2> 995 T354 oasc.SolrResourceLoader.locateSolrHome JNDI not configured for solr (NoInitialContextEx)
[junit4:junit4] 2> 995 T354 oasc.SolrResourceLoader.locateSolrHome using system property solr.solr.home: /mnt/ssd/jenkins/workspace/Lucene-Solr-4.x-Linux/solr/build/solr-core/test-files/solr
[junit4:junit4] 2> 996 T354 oasc.SolrResourceLoader.<init> new SolrResourceLoader for deduced Solr Home: '/mnt/ssd/jenkins/workspace/Lucene-Solr-4.x-Linux/solr/build/solr-core/test-files/solr/'
[junit4:junit4] 2> 1010 T354 oass.SolrDispatchFilter.init SolrDispatchFilter.init()
[junit4:junit4] 2> 1011 T354 oasc.SolrResourceLoader.locateSolrHome JNDI not configured for solr (NoInitialContextEx)
[junit4:junit4] 2> 1012 T354 oasc.SolrResourceLoader.locateSolrHome using system property solr.solr.home: /mnt/ssd/jenkins/workspace/Lucene-Solr-4.x-Linux/solr/build/solr-core/test-files/solr
[junit4:junit4] 2> 1012 T354 oasc.CoreContainer$Initializer.initialize looking for solr.xml: /mnt/ssd/jenkins/workspace/Lucene-Solr-4.x-Linux/solr/build/solr-core/test-files/solr/solr.xml
[junit4:junit4] 2> 1013 T354 oasc.CoreContainer.<init> New CoreContainer -1554656208
[junit4:junit4] 2> 1014 T354 oasc.CoreContainer.load Loading CoreContainer using Solr Home: '/mnt/ssd/jenkins/workspace/Lucene-Solr-4.x-Linux/solr/build/solr-core/test-files/solr/'
[junit4:junit4] 2> 1015 T354 oasc.SolrResourceLoader.<init> new SolrResourceLoader for directory: '/mnt/ssd/jenkins/workspace/Lucene-Solr-4.x-Linux/solr/build/solr-core/test-files/solr/'
[junit4:junit4] 2> 1034 T354 oasc.CoreContainer.load Registering Log Listener
[junit4:junit4] 2> 1052 T354 oasc.CoreContainer.create Creating SolrCore 'collection1' using instanceDir: /mnt/ssd/jenkins/workspace/Lucene-Solr-4.x-Linux/solr/build/solr-core/test-files/solr/collection1
[junit4:junit4] 2> 1053 T354 oasc.SolrResourceLoader.<init> new SolrResourceLoader for directory: '/mnt/ssd/jenkins/workspace/Lucene-Solr-4.x-Linux/solr/build/solr-core/test-files/solr/collection1/'
[junit4:junit4] 2> 1054 T354 oasc.SolrResourceLoader.replaceClassLoader Adding 'file:/mnt/ssd/jenkins/workspace/Lucene-Solr-4.x-Linux/solr/build/solr-core/test-files/solr/collection1/lib/README' to classloader
[junit4:junit4] 2> 1055 T354 oasc.SolrResourceLoader.replaceClassLoader Adding 'file:/mnt/ssd/jenkins/workspace/Lucene-Solr-4.x-Linux/solr/build/solr-core/test-files/solr/collection1/lib/classes/' to classloader
[junit4:junit4] 2> 1080 T354 oasc.SolrConfig.<init> Using Lucene MatchVersion: LUCENE_41
[junit4:junit4] 2> 1122 T354 oasc.SolrConfig.<init> Loaded SolrConfig: solrconfig-elevate.xml
[junit4:junit4] 2> 1123 T354 oass.IndexSchema.readSchema Reading Solr Schema
[junit4:junit4] 2> 1128 T354 oass.IndexSchema.readSchema Schema name=example
[junit4:junit4] 2> 1308 T354 oass.IndexSchema.readSchema default search field in schema is text
[junit4:junit4] 2> 1310 T354 oass.IndexSchema.readSchema unique key field: id
[junit4:junit4] 2> 1314 T354 oasc.SolrCore.<init> [collection1] Opening new SolrCore at /mnt/ssd/jenkins/workspace/Lucene-Solr-4.x-Linux/solr/build/solr-core/test-files/solr/collection1/, dataDir=./org.apache.solr.handler.component.DistributedQueryElevationComponentTest-1349273610156/shard2/data/
[junit4:junit4] 2> 1315 T354 oasc.JmxMonitoredMap.<init> JMX monitoring is enabled. Adding Solr mbeans to JMX Server: com.sun.jmx.mbeanserver.JmxMBeanServer@21f19e3
[junit4:junit4] 2> 1316 T354 oasc.SolrCore.getNewIndexDir New index directory detected: old=null new=./org.apache.solr.handler.component.DistributedQueryElevationComponentTest-1349273610156/shard2/data/index/
[junit4:junit4] 2> 1316 T354 oasc.SolrCore.initIndex WARNING [collection1] Solr index directory './org.apache.solr.handler.component.DistributedQueryElevationComponentTest-1349273610156/shard2/data/index' doesn't exist. Creating new index...
[junit4:junit4] 2> 1317 T354 oasc.CachingDirectoryFactory.get return new directory for /mnt/ssd/jenkins/workspace/Lucene-Solr-4.x-Linux/solr/build/solr-core/test/J1/./org.apache.solr.handler.component.DistributedQueryElevationComponentTest-1349273610156/shard2/data/index forceNew:false
[junit4:junit4] 2> 1318 T354 oasc.SolrDeletionPolicy.onCommit SolrDeletionPolicy.onCommit: commits:num=1
[junit4:junit4] 2> commit{dir=MockDirWrapper(org.apache.lucene.store.RAMDirectory@61d441f3 lockFactory=org.apache.lucene.store.SingleInstanceLockFactory@f2f13e0f),segFN=segments_1,generation=1,filenames=[segments_1]
[junit4:junit4] 2> 1319 T354 oasc.SolrDeletionPolicy.updateCommits newest commit = 1
[junit4:junit4] 2> 1321 T354 oasc.RequestHandlers.initHandlersFromConfig created /update: solr.UpdateRequestHandler
[junit4:junit4] 2> 1321 T354 oasc.RequestHandlers.initHandlersFromConfig created /elevate: org.apache.solr.handler.component.SearchHandler
[junit4:junit4] 2> 1322 T354 oasc.RequestHandlers.initHandlersFromConfig created /dataElevate: org.apache.solr.handler.component.SearchHandler
[junit4:junit4] 2> 1324 T354 oashl.XMLLoader.init xsltCacheLifetimeSeconds=60
[junit4:junit4] 2> 1324 T354 oasc.RequestHandlers.initHandlersFromConfig WARNING no default request handler is registered (either '/select' or 'standard')
[junit4:junit4] 2> 1326 T354 oasc.SolrCore.initDeprecatedSupport WARNING solrconfig.xml uses deprecated <admin/gettableFiles>, Please update your config to use the ShowFileRequestHandler.
[junit4:junit4] 2> 1327 T354 oasc.SolrCore.initDeprecatedSupport WARNING adding ShowFileRequestHandler with hidden files: [BAD-SCHEMA-NOT-INDEXED-BUT-TF.XML, SCHEMA-REQUIRED-FIELDS.XML, SOLRCONFIG-MASTER1-KEEPONEBACKUP.XML, BAD-SCHEMA-NONTEXT-ANALYZER.XML, SOLRCONFIG-PROPINJECT.XML, SOLRCONFIG-PROPINJECT-INDEXDEFAULT.XML, STOP-2.TXT, SCHEMA11.XML, BAD-SCHEMA-UNIQUEKEY-USES-DEFAULT.XML, SCHEMA15.XML, SOLRCONFIG-NATIVELOCK.XML, SCHEMA-SIM.XML, CONDITIONAL.UPDATEPROCESSOR.JS, BAD-SOLRCONFIG-MISSING-SCRIPTFILE.XML, SOLRCONFIG-SCRIPT-UPDATEPROCESSOR.XML, SOLRCONFIG-REPEATER.XML, SOLRCONFIG-SPELLCHECKER.XML, SOLRCONFIG-NOCACHE.XML, SCHEMA-CHARFILTERS.XML, SOLRCONFIG-SOLCOREPROPERTIES.XML, SOLRCONFIG_CODEC.XML, BAD-SCHEMA-EXTERNAL-FILEFIELD.XML, HYPHENATION.DTD, TRIVIAL.UPDATEPROCESSOR1.JS, SCHEMA.XML, SOLRCONFIG-MERGEPOLICY.XML, SOLRCONFIG-PHRASESUGGEST.XML, SOLRCONFIG-SLAVE1.XML, SOLRCONFIG-BASIC.XML, SCHEMA-LMJELINEKMERCER.XML, BAD-MP-SOLRCONFIG.XML, BAD-SCHEMA-DUP-FIELD.XML, BAD-SCHEMA-UNIQUEKEY-MULTIVALUED.XML, SOLRCONFIG-MASTER.XML, SOLRCONFIG-HIGHLIGHT.XML, SCHEMA-TFIDF.XML, SCHEMA-REPLICATION1.XML, SYNONYMS.TXT, SOLRCONFIG-ELEVATE.XML, STOPWITHBOM.TXT, SOLRCONFIG-QUERYSENDER.XML, WDFTYPES.TXT, SOLRCONFIG-SNIPPET-PROCESSOR.XML, SOLRCONFIG-DELPOLICY1.XML, BAD_SOLRCONFIG.XML, HUNSPELL-TEST.DIC, SCHEMA-NUMERIC.XML, SCHEMA-LUCENEMATCHVERSION.XML, KEEP-2.TXT, SCHEMA-STOP-KEEP.XML, SCHEMA-IB.XML, STOP-SNOWBALL.TXT, SOLRCONFIG-SLAVE.XML, BAD-SCHEMA-NOT-INDEXED-BUT-NORMS.XML, STOPWORDSWRONGENCODING.TXT, THROW.ERROR.ON.ADD.UPDATEPROCESSOR.JS, STOPTYPES-1.TXT, SOLRCONFIG-SPELLCHECKCOMPONENT.XML, SOLRCONFIG-TLOG.XML, COMPOUNDDICTIONARY.TXT, DA_COMPOUNDDICTIONARY.TXT, SOLRCONFIG-TERMINDEX.XML, BAD-SOLRCONFIG-INVALID-SCRIPTFILE.XML, SCHEMASURROUND.XML, OPEN-EXCHANGE-RATES.JSON, BAD-SCHEMA-DUP-FIELDTYPE.XML, PHRASESUGGEST.TXT, BAD-SCHEMA-CURRENCY-FT-MULTIVALUED.XML, SOLRCONFIG-MASTER2.XML, OLD_SYNONYMS.TXT, BAD-SCHEMA-UNIQUEKEY-IS-COPYFIELD-DEST.XML, SCHEMA-NOT-REQUIRED-UNIQUE-KEY.XML, BAD-SCHEMA-CODEC-GLOBAL-VS-FT-MISMATCH.XML, SCHEMA-LMDIRICHLET.XML, BAD-SCHEMA-NOT-INDEXED-BUT-POS.XML, SCHEMA-REVERSED.XML, BAD-SCHEMA-CURRENCY-MULTIVALUED.XML, SCHEMA-FOLDING.XML, SOLRCONFIG-CACHING.XML, MAPPING-ISOLATIN1ACCENT.TXT, ADDFIELDS.UPDATEPROCESSOR.JS, SCHEMA-BM25.XML, STOP-1.TXT, SOLRCONFIG-ENABLEPLUGIN.XML, MISSING.FUNCTIONS.UPDATEPROCESSOR.JS, SCHEMA12.XML, SOLRCONFIG-TRANSFORMERS.XML, SCHEMA-COPYFIELD-TEST.XML, SOLRCONFIG-BASIC-LUCENEVERSION31.XML, BAD-SCHEMA-DUP-DYNAMICFIELD.XML, CURRENCY.XML, DA_UTF8.XML, MISSLEADING.EXTENSION.UPDATEPROCESSOR.JS.TXT, SOLRCONFIG-SOLR-749.XML, STOPWORDS.TXT, HUNSPELL-TEST.AFF, SOLRCONFIG_PERF.XML, SOLRCONFIG-SIMPLELOCK.XML, FRENCHARTICLES.TXT, SOLRCONFIG-LAZYWRITER.XML, SOLRCONFIG-RESPONSE-LOG-COMPONENT.XML, SCHEMA-REPLICATION2.XML, SCHEMA-SNIPPET-TYPE.XML, SCHEMA-SPATIAL.XML, SOLRCONFIG-XINCLUDE.XML, SCHEMA-SPELLCHECKER.XML, XSLT, SOLRCONFIG-DELPOLICY2.XML, TRIVIAL.UPDATEPROCESSOR0.JS, KEEP-1.TXT, BAD-SCHEMA-CURRENCY-DYNAMIC-MULTIVALUED.XML, SCHEMA-TRIE.XML, SCHEMA-BINARYFIELD.XML, SCHEMA-COLLATEFILTER.XML, BAD-SCHEMA-OMIT-TF-BUT-NOT-POS.XML, SCHEMA-MINIMAL.XML, STOPTYPES-2.TXT, SCHEMA_CODEC.XML, STEMDICT.TXT, ELEVATE.XML, SCHEMA-COLLATE.XML, PROTWORDS.TXT, SCHEMA-XINCLUDE.XML, SCHEMA-SNIPPET-FIELD.XML, SOLRCONFIG-REQHANDLER.INCL, SCHEMA-PHRASESUGGEST.XML, SCHEMA-DFR.XML, BAD-SCHEMA-ANALYZER-CLASS-AND-NESTED.XML, SOLRCONFIG-MASTER1.XML, SOLRCONFIG-FUNCTIONQUERY.XML, SOLRCONFIG-MASTER3.XML, SOLRCONFIG-UPDATE-PROCESSOR-CHAINS.XML, SOLRCONFIG-ALTDIRECTORY.XML, BAD-SCHEMA-SIM-GLOBAL-VS-FT-MISMATCH.XML, SOLRCONFIG-QUERYSENDER-NOQUERY.XML, BAD-SOLRCONFIG-BOGUS-SCRIPTENGINE-NAME.XML]
[junit4:junit4] 2> 1329 T354 oass.SolrIndexSearcher.<init> Opening Searcher@78c926fa main
[junit4:junit4] 2> 1329 T354 oass.SolrIndexSearcher.getIndexDir WARNING WARNING: Directory impl does not support setting indexDir: org.apache.lucene.store.MockDirectoryWrapper
[junit4:junit4] 2> 1330 T354 oasu.CommitTracker.<init> Hard AutoCommit: disabled
[junit4:junit4] 2> 1331 T354 oasu.CommitTracker.<init> Soft AutoCommit: disabled
[junit4:junit4] 2> 1331 T354 oashc.QueryElevationComponent.inform Loading QueryElevation from: /mnt/ssd/jenkins/workspace/Lucene-Solr-4.x-Linux/solr/build/solr-core/test-files/solr/collection1/conf/elevate.xml
[junit4:junit4] 2> 1341 T354 oashc.QueryElevationComponent.inform Loading QueryElevation from: /mnt/ssd/jenkins/workspace/Lucene-Solr-4.x-Linux/solr/build/solr-core/test-files/solr/collection1/conf/elevate.xml
[junit4:junit4] 2> 1351 T354 oashc.HttpShardHandlerFactory.getParameter Setting socketTimeout to: 0
[junit4:junit4] 2> 1352 T354 oashc.HttpShardHandlerFactory.getParameter Setting urlScheme to: http://
[junit4:junit4] 2> 1352 T354 oashc.HttpShardHandlerFactory.getParameter Setting connTimeout to: 0
[junit4:junit4] 2> 1353 T354 oashc.HttpShardHandlerFactory.getParameter Setting maxConnectionsPerHost to: 20
[junit4:junit4] 2> 1353 T354 oashc.HttpShardHandlerFactory.getParameter Setting corePoolSize to: 0
[junit4:junit4] 2> 1354 T354 oashc.HttpShardHandlerFactory.getParameter Setting maximumPoolSize to: 2147483647
[junit4:junit4] 2> 1354 T354 oashc.HttpShardHandlerFactory.getParameter Setting maxThreadIdleTime to: 5
[junit4:junit4] 2> 1355 T354 oashc.HttpShardHandlerFactory.getParameter Setting sizeOfQueue to: -1
[junit4:junit4] 2> 1355 T354 oashc.HttpShardHandlerFactory.getParameter Setting fairnessPolicy to: false
[junit4:junit4] 2> 1356 T354 oascsi.HttpClientUtil.createClient Creating new http client, config:maxConnectionsPerHost=20&maxConnections=10000&socketTimeout=0&connTimeout=0&retry=false
[junit4:junit4] 2> 1361 T394 oasc.SolrCore.registerSearcher [collection1] Registered new searcher Searcher@78c926fa main{StandardDirectoryReader(segments_1:1)}
[junit4:junit4] 2> 1362 T354 oasc.CoreContainer.register registering core: collection1
[junit4:junit4] 2> 1362 T354 oass.SolrDispatchFilter.init user.dir=/mnt/ssd/jenkins/workspace/Lucene-Solr-4.x-Linux/solr/build/solr-core/test/J1
[junit4:junit4] 2> 1362 T354 oass.SolrDispatchFilter.init SolrDispatchFilter.init() done
[junit4:junit4] 2> 1363 T354 oascsi.HttpClientUtil.createClient Creating new http client, config:maxConnections=128&maxConnectionsPerHost=32&followRedirects=false
[junit4:junit4] 2> ASYNC NEW_CORE C20 name=collection1 org.apache.solr.core.SolrCore@f32fba75
[junit4:junit4] 2> 1370 T357 C20 oasu.DirectUpdateHandler2.deleteAll [collection1] REMOVING ALL DOCUMENTS FROM INDEX
[junit4:junit4] 2> 1372 T357 C20 oasc.SolrDeletionPolicy.onInit SolrDeletionPolicy.onInit: commits:num=1
[junit4:junit4] 2> commit{dir=MockDirWrapper(org.apache.lucene.store.RAMDirectory@b09780d1 lockFactory=org.apache.lucene.store.SingleInstanceLockFactory@2c57ff98),segFN=segments_1,generation=1,filenames=[segments_1]
[junit4:junit4] 2> 1373 T357 C20 oasc.SolrDeletionPolicy.updateCommits newest commit = 1
[junit4:junit4] 2> 1373 T357 C20 UPDATE [collection1] webapp=/solr path=/update params={version=2&wt=javabin} {deleteByQuery=*:*} 0 3
[junit4:junit4] 2> ASYNC NEW_CORE C21 name=collection1 org.apache.solr.core.SolrCore@758f39b8
[junit4:junit4] 2> 1377 T367 C21 oasu.DirectUpdateHandler2.deleteAll [collection1] REMOVING ALL DOCUMENTS FROM INDEX
[junit4:junit4] 2> 1378 T367 C21 oasc.SolrDeletionPolicy.onInit SolrDeletionPolicy.onInit: commits:num=1
[junit4:junit4] 2> commit{dir=MockDirWrapper(org.apache.lucene.store.RAMDirectory@45474d68 lockFactory=org.apache.lucene.store.SingleInstanceLockFactory@dbc15cd7),segFN=segments_1,generation=1,filenames=[segments_1]
[junit4:junit4] 2> 1379 T367 C21 oasc.SolrDeletionPolicy.updateCommits newest commit = 1
[junit4:junit4] 2> 1379 T367 C21 UPDATE [collection1] webapp=/solr path=/update params={version=2&wt=javabin} {deleteByQuery=*:*} 0 2
[junit4:junit4] 2> ASYNC NEW_CORE C22 name=collection1 org.apache.solr.core.SolrCore@c45fb204
[junit4:junit4] 2> 1384 T377 C22 oasu.DirectUpdateHandler2.deleteAll [collection1] REMOVING ALL DOCUMENTS FROM INDEX
[junit4:junit4] 2> 1386 T377 C22 oasc.SolrDeletionPolicy.onInit SolrDeletionPolicy.onInit: commits:num=1
[junit4:junit4] 2> commit{dir=MockDirWrapper(org.apache.lucene.store.RAMDirectory@b588982f lockFactory=org.apache.lucene.store.SingleInstanceLockFactory@87ccc098),segFN=segments_1,generation=1,filenames=[segments_1]
[junit4:junit4] 2> 1386 T377 C22 oasc.SolrDeletionPolicy.updateCommits newest commit = 1
[junit4:junit4] 2> 1387 T377 C22 UPDATE [collection1] webapp=/solr path=/update params={version=2&wt=javabin} {deleteByQuery=*:*} 0 3
[junit4:junit4] 2> ASYNC NEW_CORE C23 name=collection1 org.apache.solr.core.SolrCore@f12cc33d
[junit4:junit4] 2> 1392 T387 C23 oasu.DirectUpdateHandler2.deleteAll [collection1] REMOVING ALL DOCUMENTS FROM INDEX
[junit4:junit4] 2> 1394 T387 C23 oasc.SolrDeletionPolicy.onInit SolrDeletionPolicy.onInit: commits:num=1
[junit4:junit4] 2> commit{dir=MockDirWrapper(org.apache.lucene.store.RAMDirectory@61d441f3 lockFactory=org.apache.lucene.store.SingleInstanceLockFactory@f2f13e0f),segFN=segments_1,generation=1,filenames=[segments_1]
[junit4:junit4] 2> 1395 T387 C23 oasc.SolrDeletionPolicy.updateCommits newest commit = 1
[junit4:junit4] 2> 1395 T387 C23 UPDATE [collection1] webapp=/solr path=/update params={version=2&wt=javabin} {deleteByQuery=*:*} 0 3
[junit4:junit4] 2> 1399 T357 C20 UPDATE [collection1] webapp=/solr path=/update params={version=2&wt=javabin} {add=[1]} 0 1
[junit4:junit4] 2> 1403 T367 C21 UPDATE [collection1] webapp=/solr path=/update params={version=2&wt=javabin} {add=[1]} 0 1
[junit4:junit4] 2> 1406 T357 C20 UPDATE [collection1] webapp=/solr path=/update params={version=2&wt=javabin} {add=[2]} 0 0
[junit4:junit4] 2> 1410 T377 C22 UPDATE [collection1] webapp=/solr path=/update params={version=2&wt=javabin} {add=[2]} 0 1
[junit4:junit4] 2> 1413 T357 C20 UPDATE [collection1] webapp=/solr path=/update params={version=2&wt=javabin} {add=[3]} 0 0
[junit4:junit4] 2> 1417 T387 C23 UPDATE [collection1] webapp=/solr path=/update params={version=2&wt=javabin} {add=[3]} 0 1
[junit4:junit4] 2> 1420 T357 C20 UPDATE [collection1] webapp=/solr path=/update params={version=2&wt=javabin} {add=[4]} 0 1
[junit4:junit4] 2> 1423 T367 C21 UPDATE [collection1] webapp=/solr path=/update params={version=2&wt=javabin} {add=[4]} 0 1
[junit4:junit4] 2> 1426 T357 C20 UPDATE [collection1] webapp=/solr path=/update params={version=2&wt=javabin} {add=[5]} 0 1
[junit4:junit4] 2> 1429 T377 C22 UPDATE [collection1] webapp=/solr path=/update params={version=2&wt=javabin} {add=[5]} 0 1
[junit4:junit4] 2> 1431 T357 C20 UPDATE [collection1] webapp=/solr path=/update params={version=2&wt=javabin} {add=[6]} 0 0
[junit4:junit4] 2> 1434 T387 C23 UPDATE [collection1] webapp=/solr path=/update params={version=2&wt=javabin} {add=[6]} 0 0
[junit4:junit4] 2> 1437 T357 C20 UPDATE [collection1] webapp=/solr path=/update params={version=2&wt=javabin} {add=[7]} 0 0
[junit4:junit4] 2> 1440 T387 C23 UPDATE [collection1] webapp=/solr path=/update params={version=2&wt=javabin} {add=[7]} 0 0
[junit4:junit4] 2> 1443 T357 C20 oasu.DirectUpdateHandler2.commit start commit{flags=0,_version_=0,optimize=false,openSearcher=true,waitSearcher=true,expungeDeletes=false,softCommit=false}
[junit4:junit4] 2> 1445 T357 C20 oasc.SolrDeletionPolicy.onCommit SolrDeletionPolicy.onCommit: commits:num=2
[junit4:junit4] 2> commit{dir=MockDirWrapper(org.apache.lucene.store.RAMDirectory@b09780d1 lockFactory=org.apache.lucene.store.SingleInstanceLockFactory@2c57ff98),segFN=segments_1,generation=1,filenames=[segments_1]
[junit4:junit4] 2> commit{dir=MockDirWrapper(org.apache.lucene.store.RAMDirectory@b09780d1 lockFactory=org.apache.lucene.store.SingleInstanceLockFactory@2c57ff98),segFN=segments_2,generation=2,filenames=[_0.tis, _0.si, segments_2, _0.tii, _0.frq, _0.fnm, _0.fdt, _0.prx, _0.nrm, _0.fdx]
[junit4:junit4] 2> 1446 T357 C20 oasc.SolrDeletionPolicy.updateCommits newest commit = 2
[junit4:junit4] 2> 1448 T357 C20 oass.SolrIndexSearcher.<init> Opening Searcher@a56a392d main
[junit4:junit4] 2> 1448 T357 C20 oass.SolrIndexSearcher.getIndexDir WARNING WARNING: Directory impl does not support setting indexDir: org.apache.lucene.store.MockDirectoryWrapper
[junit4:junit4] 2> 1449 T357 C20 oasu.DirectUpdateHandler2.commit end_commit_flush
[junit4:junit4] 2> 1451 T364 oasc.SolrCore.registerSearcher [collection1] Registered new searcher Searcher@a56a392d main{StandardDirectoryReader(segments_2:4 _0(4.1):C7)}
[junit4:junit4] 2> 1451 T357 C20 UPDATE [collection1] webapp=/solr path=/update params={version=2&softCommit=false&waitSearcher=true&wt=javabin&commit=true} {commit=} 0 8
[junit4:junit4] 2> 1455 T367 C21 oasu.DirectUpdateHandler2.commit start commit{flags=0,_version_=0,optimize=false,openSearcher=true,waitSearcher=true,expungeDeletes=false,softCommit=false}
[junit4:junit4] 2> 1457 T367 C21 oasc.SolrDeletionPolicy.onCommit SolrDeletionPolicy.onCommit: commits:num=2
[junit4:junit4] 2> commit{dir=MockDirWrapper(org.apache.lucene.store.RAMDirectory@45474d68 lockFactory=org.apache.lucene.store.SingleInstanceLockFactory@dbc15cd7),segFN=segments_1,generation=1,filenames=[segments_1]
[junit4:junit4] 2> commit{dir=MockDirWrapper(org.apache.lucene.store.RAMDirectory@45474d68 lockFactory=org.apache.lucene.store.SingleInstanceLockFactory@dbc15cd7),segFN=segments_2,generation=2,filenames=[_0.tis, _0.si, segments_2, _0.tii, _0.frq, _0.fnm, _0.fdt, _0.prx, _0.nrm, _0.fdx]
[junit4:junit4] 2> 1458 T367 C21 oasc.SolrDeletionPolicy.updateCommits newest commit = 2
[junit4:junit4] 2> 1459 T367 C21 oass.SolrIndexSearcher.<init> Opening Searcher@ecdd62f6 main
[junit4:junit4] 2> 1459 T367 C21 oass.SolrIndexSearcher.getIndexDir WARNING WARNING: Directory impl does not support setting indexDir: org.apache.lucene.store.MockDirectoryWrapper
[junit4:junit4] 2> 1460 T367 C21 oasu.DirectUpdateHandler2.commit end_commit_flush
[junit4:junit4] 2> 1462 T374 oasc.SolrCore.registerSearcher [collection1] Registered new searcher Searcher@ecdd62f6 main{StandardDirectoryReader(segments_2:4 _0(4.1):C2)}
[junit4:junit4] 2> 1463 T367 C21 UPDATE [collection1] webapp=/solr path=/update params={version=2&softCommit=false&waitSearcher=true&wt=javabin&commit=true} {commit=} 0 8
[junit4:junit4] 2> 1465 T377 C22 oasu.DirectUpdateHandler2.commit start commit{flags=0,_version_=0,optimize=false,openSearcher=true,waitSearcher=true,expungeDeletes=false,softCommit=false}
[junit4:junit4] 2> 1467 T377 C22 oasc.SolrDeletionPolicy.onCommit SolrDeletionPolicy.onCommit: commits:num=2
[junit4:junit4] 2> commit{dir=MockDirWrapper(org.apache.lucene.store.RAMDirectory@b588982f lockFactory=org.apache.lucene.store.SingleInstanceLockFactory@87ccc098),segFN=segments_1,generation=1,filenames=[segments_1]
[junit4:junit4] 2> commit{dir=MockDirWrapper(org.apache.lucene.store.RAMDirectory@b588982f lockFactory=org.apache.lucene.store.SingleInstanceLockFactory@87ccc098),segFN=segments_2,generation=2,filenames=[_0.tis, _0.si, segments_2, _0.tii, _0.frq, _0.fnm, _0.fdt, _0.prx, _0.nrm, _0.fdx]
[junit4:junit4] 2> 1468 T377 C22 oasc.SolrDeletionPolicy.updateCommits newest commit = 2
[junit4:junit4] 2> 1469 T377 C22 oass.SolrIndexSearcher.<init> Opening Searcher@e657abd6 main
[junit4:junit4] 2> 1470 T377 C22 oass.SolrIndexSearcher.getIndexDir WARNING WARNING: Directory impl does not support setting indexDir: org.apache.lucene.store.MockDirectoryWrapper
[junit4:junit4] 2> 1471 T377 C22 oasu.DirectUpdateHandler2.commit end_commit_flush
[junit4:junit4] 2> 1472 T384 oasc.SolrCore.registerSearcher [collection1] Registered new searcher Searcher@e657abd6 main{StandardDirectoryReader(segments_2:4 _0(4.1):C2)}
[junit4:junit4] 2> 1473 T377 C22 UPDATE [collection1] webapp=/solr path=/update params={version=2&softCommit=false&waitSearcher=true&wt=javabin&commit=true} {commit=} 0 8
[junit4:junit4] 2> 1476 T387 C23 oasu.DirectUpdateHandler2.commit start commit{flags=0,_version_=0,optimize=false,openSearcher=true,waitSearcher=true,expungeDeletes=false,softCommit=false}
[junit4:junit4] 2> 1478 T387 C23 oasc.SolrDeletionPolicy.onCommit SolrDeletionPolicy.onCommit: commits:num=2
[junit4:junit4] 2> commit{dir=MockDirWrapper(org.apache.lucene.store.RAMDirectory@61d441f3 lockFactory=org.apache.lucene.store.SingleInstanceLockFactory@f2f13e0f),segFN=segments_1,generation=1,filenames=[segments_1]
[junit4:junit4] 2> commit{dir=MockDirWrapper(org.apache.lucene.store.RAMDirectory@61d441f3 lockFactory=org.apache.lucene.store.SingleInstanceLockFactory@f2f13e0f),segFN=segments_2,generation=2,filenames=[_0.tis, _0.si, segments_2, _0.tii, _0.frq, _0.fnm, _0.fdt, _0.prx, _0.nrm, _0.fdx]
[junit4:junit4] 2> 1479 T387 C23 oasc.SolrDeletionPolicy.updateCommits newest commit = 2
[junit4:junit4] 2> 1480 T387 C23 oass.SolrIndexSearcher.<init> Opening Searcher@112eda98 main
[junit4:junit4] 2> 1481 T387 C23 oass.SolrIndexSearcher.getIndexDir WARNING WARNING: Directory impl does not support setting indexDir: org.apache.lucene.store.MockDirectoryWrapper
[junit4:junit4] 2> 1482 T387 C23 oasu.DirectUpdateHandler2.commit end_commit_flush
[junit4:junit4] 2> 1484 T394 oasc.SolrCore.registerSearcher [collection1] Registered new searcher Searcher@112eda98 main{StandardDirectoryReader(segments_2:4 _0(4.1):C3)}
[junit4:junit4] 2> 1484 T387 C23 UPDATE [collection1] webapp=/solr path=/update params={version=2&softCommit=false&waitSearcher=true&wt=javabin&commit=true} {commit=} 0 8
[junit4:junit4] 2> 1490 T357 C20 REQ [collection1] webapp=/solr path=/elevate params={q=*:*&qt=/elevate&distrib=false&fl=id,+score,+[elevated]&version=2&rows=500&shards.qt=/elevate&wt=javabin&sort=id+desc} hits=7 status=0 QTime=2
[junit4:junit4] 2> 1497 T378 C22 REQ [collection1] webapp=/solr path=/elevate params={start=0&qt=/elevate&distrib=false&fl=id,score&fsv=true&q=*:*&isShard=true&NOW=1349273611646&version=2&rows=500&shards.qt=/elevate&wt=javabin&sort=id+desc&shard.url=127.0.0.1:44061/solr} hits=2 status=0 QTime=1
[junit4:junit4] 2> 1497 T388 C23 REQ [collection1] webapp=/solr path=/elevate params={start=0&qt=/elevate&distrib=false&fl=id,score&fsv=true&q=*:*&isShard=true&NOW=1349273611646&version=2&rows=500&shards.qt=/elevate&wt=javabin&sort=id+desc&shard.url=[ff01::083]:33332/solr|127.0.0.1:53295/solr} hits=3 status=0 QTime=1
[junit4:junit4] 2> 1500 T368 C21 REQ [collection1] webapp=/solr path=/elevate params={start=0&qt=/elevate&distrib=false&fl=id,score&fsv=true&q=*:*&isShard=true&NOW=1349273611646&version=2&rows=500&shards.qt=/elevate&wt=javabin&sort=id+desc&shard.url=[ff01::083]:33332/solr|127.0.0.1:38641/solr} hits=2 status=0 QTime=2
[junit4:junit4] 2> 1505 T378 C22 REQ [collection1] webapp=/solr path=/elevate params={qt=/elevate&distrib=false&fl=id,+score,+[elevated]&q=*:*&isShard=true&NOW=1349273611646&ids=2.0,5.0&version=2&rows=500&shards.qt=/elevate&wt=javabin&shard.url=127.0.0.1:44061/solr} status=0 QTime=1
[junit4:junit4] 2> 1505 T388 C23 REQ [collection1] webapp=/solr path=/elevate params={qt=/elevate&distrib=false&fl=id,+score,+[elevated]&q=*:*&isShard=true&NOW=1349273611646&ids=3.0,6.0,7.0&version=2&rows=500&shards.qt=/elevate&wt=javabin&shard.url=[ff01::083]:33332/solr|127.0.0.1:53295/solr} status=0 QTime=1
[junit4:junit4] 2> 1506 T368 C21 REQ [collection1] webapp=/solr path=/elevate params={qt=/elevate&distrib=false&fl=id,+score,+[elevated]&q=*:*&isShard=true&NOW=1349273611646&ids=1.0,4.0&version=2&rows=500&shards.qt=/elevate&wt=javabin&shard.url=[ff01::083]:33332/solr|127.0.0.1:38641/solr} status=0 QTime=1
[junit4:junit4] 2> 1507 T377 C22 REQ [collection1] webapp=/solr path=/elevate params={q=*:*&qt=/elevate&shards=[ff01::083]:33332/solr|127.0.0.1:38641/solr,127.0.0.1:44061/solr,[ff01::083]:33332/solr|127.0.0.1:53295/solr&fl=id,+score,+[elevated]&version=2&rows=500&shards.qt=/elevate&wt=javabin&sort=id+desc} hits=7 status=0 QTime=14
[junit4:junit4] 2> 1515 T357 C20 REQ [collection1] webapp=/solr path=/elevate params={q=ZZZZ&forceElevation=true&qt=/elevate&distrib=false&fl=*,+[elevated]&version=2&rows=500&shards.qt=/elevate&wt=javabin&sort=int_i+desc} hits=5 status=0 QTime=5
[junit4:junit4] 2> 1515 T357 C20 oasr.BinaryResponseWriter$Resolver.getDoc WARNING Error reading a field from document : SolrDocument{id=1.0} java.lang.NullPointerException
[junit4:junit4] 2> at org.apache.solr.util.NumberUtils.SortableStr2int(NumberUtils.java:162)
[junit4:junit4] 2> at org.apache.solr.schema.SortableIntField.toObject(SortableIntField.java:96)
[junit4:junit4] 2> at org.apache.solr.schema.SortableIntField.toObject(SortableIntField.java:55)
[junit4:junit4] 2> at org.apache.solr.response.BinaryResponseWriter$Resolver.getValue(BinaryResponseWriter.java:218)
[junit4:junit4] 2> at org.apache.solr.response.BinaryResponseWriter$Resolver.getDoc(BinaryResponseWriter.java:181)
[junit4:junit4] 2> at org.apache.solr.response.BinaryResponseWriter$Resolver.writeResultsBody(BinaryResponseWriter.java:142)
[junit4:junit4] 2> at org.apache.solr.response.BinaryResponseWriter$Resolver.writeResults(BinaryResponseWriter.java:168)
[junit4:junit4] 2> at org.apache.solr.response.BinaryResponseWriter$Resolver.resolve(BinaryResponseWriter.java:81)
[junit4:junit4] 2> at org.apache.solr.common.util.JavaBinCodec.writeVal(JavaBinCodec.java:154)
[junit4:junit4] 2> at org.apache.solr.common.util.JavaBinCodec.writeNamedList(JavaBinCodec.java:144)
[junit4:junit4] 2> at org.apache.solr.common.util.JavaBinCodec.writeKnownType(JavaBinCodec.java:234)
[junit4:junit4] 2> at org.apache.solr.common.util.JavaBinCodec.writeVal(JavaBinCodec.java:149)
[junit4:junit4] 2> at org.apache.solr.common.util.JavaBinCodec.marshal(JavaBinCodec.java:92)
[junit4:junit4] 2> at org.apache.solr.response.BinaryResponseWriter.write(BinaryResponseWriter.java:49)
[junit4:junit4] 2> at org.apache.solr.servlet.SolrDispatchFilter.writeResponse(SolrDispatchFilter.java:404)
[junit4:junit4] 2> at org.apache.solr.servlet.SolrDispatchFilter.doFilter(SolrDispatchFilter.java:289)
[junit4:junit4] 2> at org.eclipse.jetty.servlet.ServletHandler$CachedChain.doFilter(ServletHandler.java:1337)
[junit4:junit4] 2> at org.eclipse.jetty.servlet.ServletHandler.doHandle(ServletHandler.java:484)
[junit4:junit4] 2> at org.eclipse.jetty.server.session.SessionHandler.doHandle(SessionHandler.java:231)
[junit4:junit4] 2> at org.eclipse.jetty.server.handler.ScopedHandler.handle(ScopedHandler.java:119)
[junit4:junit4] 2> at org.eclipse.jetty.server.handler.GzipHandler.handle(GzipHandler.java:267)
[junit4:junit4] 2> at org.eclipse.jetty.server.handler.ContextHandler.doHandle(ContextHandler.java:1067)
[junit4:junit4] 2> at org.eclipse.jetty.servlet.ServletHandler.doScope(ServletHandler.java:413)
[junit4:junit4] 2> at org.eclipse.jetty.server.session.SessionHandler.doScope(SessionHandler.java:192)
[junit4:junit4] 2> at org.eclipse.jetty.server.handler.ContextHandler.doScope(ContextHandler.java:999)
[junit4:junit4] 2> at org.eclipse.jetty.server.handler.ScopedHandler.handle(ScopedHandler.java:117)
[junit4:junit4] 2> at org.eclipse.jetty.server.handler.HandlerWrapper.handle(HandlerWrapper.java:111)
[junit4:junit4] 2> at org.eclipse.jetty.server.Server.handle(Server.java:351)
[junit4:junit4] 2> at org.eclipse.jetty.server.AbstractHttpConnection.handleRequest(AbstractHttpConnection.java:454)
[junit4:junit4] 2> at org.eclipse.jetty.server.BlockingHttpConnection.handleRequest(BlockingHttpConnection.java:47)
[junit4:junit4] 2> at org.eclipse.jetty.server.AbstractHttpConnection.headerComplete(AbstractHttpConnection.java:890)
[junit4:junit4] 2> at org.eclipse.jetty.server.AbstractHttpConnection$RequestHandler.headerComplete(AbstractHttpConnection.java:944)
[junit4:junit4] 2> at org.eclipse.jetty.http.HttpParser.parseNext(HttpParser.java:634)
[junit4:junit4] 2> at org.eclipse.jetty.http.HttpParser.parseAvailable(HttpParser.java:230)
[junit4:junit4] 2> at org.eclipse.jetty.server.BlockingHttpConnection.handle(BlockingHttpConnection.java:66)
[junit4:junit4] 2> at org.eclipse.jetty.server.bio.SocketConnector$ConnectorEndPoint.run(SocketConnector.java:254)
[junit4:junit4] 2> at org.eclipse.jetty.util.thread.QueuedThreadPool.runJob(QueuedThreadPool.java:599)
[junit4:junit4] 2> at org.eclipse.jetty.util.thread.QueuedThreadPool$3.run(QueuedThreadPool.java:534)
[junit4:junit4] 2> at java.lang.Thread.run(Thread.java:777)
[junit4:junit4] 2>
[junit4:junit4] 2> 1517 T357 C20 oasr.BinaryResponseWriter$Resolver.getDoc WARNING Error reading a field from document : SolrDocument{id=2.0} java.lang.NullPointerException
[junit4:junit4] 2> at org.apache.solr.util.NumberUtils.SortableStr2int(NumberUtils.java:162)
[junit4:junit4] 2> at org.apache.solr.schema.SortableIntField.toObject(SortableIntField.java:96)
[junit4:junit4] 2> at org.apache.solr.schema.SortableIntField.toObject(SortableIntField.java:55)
[junit4:junit4] 2> at org.apache.solr.response.BinaryResponseWriter$Resolver.getValue(BinaryResponseWriter.java:218)
[junit4:junit4] 2> at org.apache.solr.response.BinaryResponseWriter$Resolver.getDoc(BinaryResponseWriter.java:181)
[junit4:junit4] 2> at org.apache.solr.response.BinaryResponseWriter$Resolver.writeResultsBody(BinaryResponseWriter.java:142)
[junit4:junit4] 2> at org.apache.solr.response.BinaryResponseWriter$Resolver.writeResults(BinaryResponseWriter.java:168)
[junit4:junit4] 2> at org.apache.solr.response.BinaryResponseWriter$Resolver.resolve(BinaryResponseWriter.java:81)
[junit4:junit4] 2> at org.apache.solr.common.util.JavaBinCodec.writeVal(JavaBinCodec.java:154)
[junit4:junit4] 2> at org.apache.solr.common.util.JavaBinCodec.writeNamedList(JavaBinCodec.java:144)
[junit4:junit4] 2> at org.apache.solr.common.util.JavaBinCodec.writeKnownType(JavaBinCodec.java:234)
[junit4:junit4] 2> at org.apache.solr.common.util.JavaBinCodec.writeVal(JavaBinCodec.java:149)
[junit4:junit4] 2> at org.apache.solr.common.util.JavaBinCodec.marshal(JavaBinCodec.java:92)
[junit4:junit4] 2> at org.apache.solr.response.BinaryResponseWriter.write(BinaryResponseWriter.java:49)
[junit4:junit4] 2> at org.apache.solr.servlet.SolrDispatchFilter.writeResponse(SolrDispatchFilter.java:404)
[junit4:junit4] 2> at org.apache.solr.servlet.SolrDispatchFilter.doFilter(SolrDispatchFilter.java:289)
[junit4:junit4] 2> at org.eclipse.jetty.servlet.ServletHandler$CachedChain.doFilter(ServletHandler.java:1337)
[junit4:junit4] 2> at org.eclipse.jetty.servlet.ServletHandler.doHandle(ServletHandler.java:484)
[junit4:junit4] 2> at org.eclipse.jetty.server.session.SessionHandler.doHandle(SessionHandler.java:231)
[junit4:junit4] 2> at org.eclipse.jetty.server.handler.ScopedHandler.handle(ScopedHandler.java:119)
[junit4:junit4] 2> at org.eclipse.jetty.server.handler.GzipHandler.handle(GzipHandler.java:267)
[junit4:junit4] 2> at org.eclipse.jetty.server.handler.ContextHandler.doHandle(ContextHandler.java:1067)
[junit4:junit4] 2> at org.eclipse.jetty.servlet.ServletHandler.doScope(ServletHandler.java:413)
[junit4:junit4] 2> at org.eclipse.jetty.server.session.SessionHandler.doScope(SessionHandler.java:192)
[junit4:junit4] 2> at org.eclipse.jetty.server.handler.ContextHandler.doScope(ContextHandler.java:999)
[junit4:junit4] 2> at org.eclipse.jetty.server.handler.ScopedHandler.handle(ScopedHandler.java:117)
[junit4:junit4] 2> at org.eclipse.jetty.server.handler.HandlerWrapper.handle(HandlerWrapper.java:111)
[junit4:junit4] 2> at org.eclipse.jetty.server.Server.handle(Server.java:351)
[junit4:junit4] 2> at org.eclipse.jetty.server.AbstractHttpConnection.handleRequest(AbstractHttpConnection.java:454)
[junit4:junit4] 2> at org.eclipse.jetty.server.BlockingHttpConnection.handleRequest(BlockingHttpConnection.java:47)
[junit4:junit4] 2> at org.eclipse.jetty.server.AbstractHttpConnection.headerComplete(AbstractHttpConnection.java:890)
[junit4:junit4] 2> at org.eclipse.jetty.server.AbstractHttpConnection$RequestHandler.headerComplete(AbstractHttpConnection.java:944)
[junit4:junit4] 2> at org.eclipse.jetty.http.HttpParser.parseNext(HttpParser.java:634)
[junit4:junit4] 2> at org.eclipse.jetty.http.HttpParser.parseAvailable(HttpParser.java:230)
[junit4:junit4] 2> at org.eclipse.jetty.server.BlockingHttpConnection.handle(BlockingHttpConnection.java:66)
[junit4:junit4] 2> at org.eclipse.jetty.server.bio.SocketConnector$ConnectorEndPoint.run(SocketConnector.java:254)
[junit4:junit4] 2> at org.eclipse.jetty.util.thread.QueuedThreadPool.runJob(QueuedThreadPool.java:599)
[junit4:junit4] 2> at org.eclipse.jetty.util.thread.QueuedThreadPool$3.run(QueuedThreadPool.java:534)
[junit4:junit4] 2> at java.lang.Thread.run(Thread.java:777)
[junit4:junit4] 2>
[junit4:junit4] 2> 1518 T357 C20 oasr.BinaryResponseWriter$Resolver.getDoc WARNING Error reading a field from document : SolrDocument{id=3.0} java.lang.NullPointerException
[junit4:junit4] 2> at org.apache.solr.util.NumberUtils.SortableStr2int(NumberUtils.java:162)
[junit4:junit4] 2> at org.apache.solr.schema.SortableIntField.toObject(SortableIntField.java:96)
[junit4:junit4] 2> at org.apache.solr.schema.SortableIntField.toObject(SortableIntField.java:55)
[junit4:junit4] 2> at org.apache.solr.response.BinaryResponseWriter$Resolver.getValue(BinaryResponseWriter.java:218)
[junit4:junit4] 2> at org.apache.solr.response.BinaryResponseWriter$Resolver.getDoc(BinaryResponseWriter.java:181)
[junit4:junit4] 2> at org.apache.solr.response.BinaryResponseWriter$Resolver.writeResultsBody(BinaryResponseWriter.java:142)
[junit4:junit4] 2> at org.apache.solr.response.BinaryResponseWriter$Resolver.writeResults(BinaryResponseWriter.java:168)
[junit4:junit4] 2> at org.apache.solr.response.BinaryResponseWriter$Resolver.resolve(BinaryResponseWriter.java:81)
[junit4:junit4] 2> at org.apache.solr.common.util.JavaBinCodec.writeVal(JavaBinCodec.java:154)
[junit4:junit4] 2> at org.apache.solr.common.util.JavaBinCodec.writeNamedList(JavaBinCodec.java:144)
[junit4:junit4] 2> at org.apache.solr.common.util.JavaBinCodec.writeKnownType(JavaBinCodec.java:234)
[junit4:junit4] 2> at org.apache.solr.common.util.JavaBinCodec.writeVal(JavaBinCodec.java:149)
[junit4:junit4] 2> at org.apache.solr.common.util.JavaBinCodec.marshal(JavaBinCodec.java:92)
[junit4:junit4] 2> at org.apache.solr.response.BinaryResponseWriter.write(BinaryResponseWriter.java:49)
[junit4:junit4] 2> at org.apache.solr.servlet.SolrDispatchFilter.writeResponse(SolrDispatchFilter.java:404)
[junit4:junit4] 2> at org.apache.solr.servlet.SolrDispatchFilter.doFilter(SolrDispatchFilter.java:289)
[junit4:junit4] 2> at org.eclipse.jetty.servlet.ServletHandler$CachedChain.doFilter(ServletHandler.java:1337)
[junit4:junit4] 2> at org.eclipse.jetty.servlet.ServletHandler.doHandle(ServletHandler.java:484)
[junit4:junit4] 2> at org.eclipse.jetty.server.session.SessionHandler.doHandle(SessionHandler.java:231)
[junit4:junit4] 2> at org.eclipse.jetty.server.handler.ScopedHandler.handle(ScopedHandler.java:119)
[junit4:junit4] 2> at org.eclipse.jetty.server.handler.GzipHandler.handle(GzipHandler.java:267)
[junit4:junit4] 2> at org.eclipse.jetty.server.handler.ContextHandler.doHandle(ContextHandler.java:1067)
[junit4:junit4] 2> at org.eclipse.jetty.servlet.ServletHandler.doScope(ServletHandler.java:413)
[junit4:junit4] 2> at org.eclipse.jetty.server.session.SessionHandler.doScope(SessionHandler.java:192)
[junit4:junit4] 2> at org.eclipse.jetty.server.handler.ContextHandler.doScope(ContextHandler.java:999)
[junit4:junit4] 2> at org.eclipse.jetty.server.handler.ScopedHandler.handle(ScopedHandler.java:117)
[junit4:junit4] 2> at org.eclipse.jetty.server.handler.HandlerWrapper.handle(HandlerWrapper.java:111)
[junit4:junit4] 2> at org.eclipse.jetty.server.Server.handle(Server.java:351)
[junit4:junit4] 2> at org.eclipse.jetty.server.AbstractHttpConnection.handleRequest(AbstractHttpConnection.java:454)
[junit4:junit4] 2> at org.eclipse.jetty.server.BlockingHttpConnection.handleRequest(BlockingHttpConnection.java:47)
[junit4:junit4] 2> at org.eclipse.jetty.server.AbstractHttpConnection.headerComplete(AbstractHttpConnection.java:890)
[junit4:junit4] 2> at org.eclipse.jetty.server.AbstractHttpConnection$RequestHandler.headerComplete(AbstractHttpConnection.java:944)
[junit4:junit4] 2> at org.eclipse.jetty.http.HttpParser.parseNext(HttpParser.java:634)
[junit4:junit4] 2> at org.eclipse.jetty.http.HttpParser.parseAvailable(HttpParser.java:230)
[junit4:junit4] 2> at org.eclipse.jetty.server.BlockingHttpConnection.handle(BlockingHttpConnection.java:66)
[junit4:junit4] 2> at org.eclipse.jetty.server.bio.SocketConnector$ConnectorEndPoint.run(SocketConnector.java:254)
[junit4:junit4] 2> at org.eclipse.jetty.util.thread.QueuedThreadPool.runJob(QueuedThreadPool.java:599)
[junit4:junit4] 2> at org.eclipse.jetty.util.thread.QueuedThreadPool$3.run(QueuedThreadPool.java:534)
[junit4:junit4] 2> at java.lang.Thread.run(Thread.java:777)
[junit4:junit4] 2>
[junit4:junit4] 2> 1519 T357 C20 oasr.BinaryResponseWriter$Resolver.getDoc WARNING Error reading a field from document : SolrDocument{id=6.0} java.lang.NullPointerException
[junit4:junit4] 2> at org.apache.solr.util.NumberUtils.SortableStr2int(NumberUtils.java:162)
[junit4:junit4] 2> at org.apache.solr.schema.SortableIntField.toObject(SortableIntField.java:96)
[junit4:junit4] 2> at org.apache.solr.schema.SortableIntField.toObject(SortableIntField.java:55)
[junit4:junit4] 2> at org.apache.solr.response.BinaryResponseWriter$Resolver.getValue(BinaryResponseWriter.java:218)
[junit4:junit4] 2> at org.apache.solr.response.BinaryResponseWriter$Resolver.getDoc(BinaryResponseWriter.java:181)
[junit4:junit4] 2> at org.apache.solr.response.BinaryResponseWriter$Resolver.writeResultsBody(BinaryResponseWriter.java:142)
[junit4:junit4] 2> at org.apache.solr.response.BinaryResponseWriter$Resolver.writeResults(BinaryResponseWriter.java:168)
[junit4:junit4] 2> at org.apache.solr.response.BinaryResponseWriter$Resolver.resolve(BinaryResponseWriter.java:81)
[junit4:junit4] 2> at org.apache.solr.common.util.JavaBinCodec.writeVal(JavaBinCodec.java:154)
[junit4:junit4] 2> at org.apache.solr.common.util.JavaBinCodec.writeNamedList(JavaBinCodec.java:144)
[junit4:junit4] 2> at org.apache.solr.common.util.JavaBinCodec.writeKnownType(JavaBinCodec.java:234)
[junit4:junit4] 2> at org.apache.solr.common.util.JavaBinCodec.writeVal(JavaBinCodec.java:149)
[junit4:junit4] 2> at org.apache.solr.common.util.JavaBinCodec.marshal(JavaBinCodec.java:92)
[junit4:junit4] 2> at org.apache.solr.response.BinaryResponseWriter.write(BinaryResponseWriter.java:49)
[junit4:junit4] 2> at org.apache.solr.servlet.SolrDispatchFilter.writeResponse(SolrDispatchFilter.java:404)
[junit4:junit4] 2> at org.apache.solr.servlet.SolrDispatchFilter.doFilter(SolrDispatchFilter.java:289)
[junit4:junit4] 2> at org.eclipse.jetty.servlet.ServletHandler$CachedChain.doFilter(ServletHandler.java:1337)
[junit4:junit4] 2> at org.eclipse.jetty.servlet.ServletHandler.doHandle(ServletHandler.java:484)
[junit4:junit4] 2> at org.eclipse.jetty.server.session.SessionHandler.doHandle(SessionHandler.java:231)
[junit4:junit4] 2> at org.eclipse.jetty.server.handler.ScopedHandler.handle(ScopedHandler.java:119)
[junit4:junit4] 2> at org.eclipse.jetty.server.handler.GzipHandler.handle(GzipHandler.java:267)
[junit4:junit4] 2> at org.eclipse.jetty.server.handler.ContextHandler.doHandle(ContextHandler.java:1067)
[junit4:junit4] 2> at org.eclipse.jetty.servlet.ServletHandler.doScope(ServletHandler.java:413)
[junit4:junit4] 2> at org.eclipse.jetty.server.session.SessionHandler.doScope(SessionHandler.java:192)
[junit4:junit4] 2> at org.eclipse.jetty.server.handler.ContextHandler.doScope(ContextHandler.java:999)
[junit4:junit4] 2> at org.eclipse.jetty.server.handler.ScopedHandler.handle(ScopedHandler.java:117)
[junit4:junit4] 2> at org.eclipse.jetty.server.handler.HandlerWrapper.handle(HandlerWrapper.java:111)
[junit4:junit4] 2> at org.eclipse.jetty.server.Server.handle(Server.java:351)
[junit4:junit4] 2> at org.eclipse.jetty.server.AbstractHttpConnection.handleRequest(AbstractHttpConnection.java:454)
[junit4:junit4] 2> at org.eclipse.jetty.server.BlockingHttpConnection.handleRequest(BlockingHttpConnection.java:47)
[junit4:junit4] 2> at org.eclipse.jetty.server.AbstractHttpConnection.headerComplete(AbstractHttpConnection.java:890)
[junit4:junit4] 2> at org.eclipse.jetty.server.AbstractHttpConnection$RequestHandler.headerComplete(AbstractHttpConnection.java:944)
[junit4:junit4] 2> at org.eclipse.jetty.http.HttpParser.parseNext(HttpParser.java:634)
[junit4:junit4] 2> at org.eclipse.jetty.http.HttpParser.parseAvailable(HttpParser.java:230)
[junit4:junit4] 2> at org.eclipse.jetty.server.BlockingHttpConnection.handle(BlockingHttpConnection.java:66)
[junit4:junit4] 2> at org.eclipse.jetty.server.bio.SocketConnector$ConnectorEndPoint.run(SocketConnector.java:254)
[junit4:junit4] 2> at org.eclipse.jetty.util.thread.QueuedThreadPool.runJob(QueuedThreadPool.java:599)
[junit4:junit4] 2> at org.eclipse.jetty.util.thread.QueuedThreadPool$3.run(QueuedThreadPool.java:534)
[junit4:junit4] 2> at java.lang.Thread.run(Thread.java:777)
[junit4:junit4] 2>
[junit4:junit4] 2> 1520 T357 C20 oasr.BinaryResponseWriter$Resolver.getDoc WARNING Error reading a field from document : SolrDocument{id=5.0} java.lang.NullPointerException
[junit4:junit4] 2> at org.apache.solr.util.NumberUtils.SortableStr2int(NumberUtils.java:162)
[junit4:junit4] 2> at org.apache.solr.schema.SortableIntField.toObject(SortableIntField.java:96)
[junit4:junit4] 2> at org.apache.solr.schema.SortableIntField.toObject(SortableIntField.java:55)
[junit4:junit4] 2> at org.apache.solr.response.BinaryResponseWriter$Resolver.getValue(BinaryResponseWriter.java:218)
[junit4:junit4] 2> at org.apache.solr.response.BinaryResponseWriter$Resolver.getDoc(BinaryResponseWriter.java:181)
[junit4:junit4] 2> at org.apache.solr.response.BinaryResponseWriter$Resolver.writeResultsBody(BinaryResponseWriter.java:142)
[junit4:junit4] 2> at org.apache.solr.response.BinaryResponseWriter$Resolver.writeResults(BinaryResponseWriter.java:168)
[junit4:junit4] 2> at org.apache.solr.response.BinaryResponseWriter$Resolver.resolve(BinaryResponseWriter.java:81)
[junit4:junit4] 2> at org.apache.solr.common.util.JavaBinCodec.writeVal(JavaBinCodec.java:154)
[junit4:junit4] 2> at org.apache.solr.common.util.JavaBinCodec.writeNamedList(JavaBinCodec.java:144)
[junit4:junit4] 2> at org.apache.solr.common.util.JavaBinCodec.writeKnownType(JavaBinCodec.java:234)
[junit4:junit4] 2> at org.apache.solr.common.util.JavaBinCodec.writeVal(JavaBinCodec.java:149)
[junit4:junit4] 2> at org.apache.solr.common.util.JavaBinCodec.marshal(JavaBinCodec.java:92)
[junit4:junit4] 2> at org.apache.solr.response.BinaryResponseWriter.write(BinaryResponseWriter.java:49)
[junit4:junit4] 2> at org.apache.solr.servlet.SolrDispatchFilter.writeResponse(SolrDispatchFilter.java:404)
[junit4:junit4] 2> at org.apache.solr.servlet.SolrDispatchFilter.doFilter(SolrDispatchFilter.java:289)
[junit4:junit4] 2> at org.eclipse.jetty.servlet.ServletHandler$CachedChain.doFilter(ServletHandler.java:1337)
[junit4:junit4] 2> at org.eclipse.jetty.servlet.ServletHandler.doHandle(ServletHandler.java:484)
[junit4:junit4] 2> at org.eclipse.jetty.server.session.SessionHandler.doHandle(SessionHandler.java:231)
[junit4:junit4] 2> at org.eclipse.jetty.server.handler.ScopedHandler.handle(ScopedHandler.java:119)
[junit4:junit4] 2> at org.eclipse.jetty.server.handler.GzipHandler.handle(GzipHandler.java:267)
[junit4:junit4] 2> at org.eclipse.jetty.server.handler.ContextHandler.doHandle(ContextHandler.java:1067)
[junit4:junit4] 2> at org.eclipse.jetty.servlet.ServletHandler.doScope(ServletHandler.java:413)
[junit4:junit4] 2> at org.eclipse.jetty.server.session.SessionHandler.doScope(SessionHandler.java:192)
[junit4:junit4] 2> at org.eclipse.jetty.server.handler.ContextHandler.doScope(ContextHandler.java:999)
[junit4:junit4] 2> at org.eclipse.jetty.server.handler.ScopedHandler.handle(ScopedHandler.java:117)
[junit4:junit4] 2> at org.eclipse.jetty.server.handler.HandlerWrapper.handle(HandlerWrapper.java:111)
[junit4:junit4] 2> at org.eclipse.jetty.server.Server.handle(Server.java:351)
[junit4:junit4] 2> at org.eclipse.jetty.server.AbstractHttpConnection.handleRequest(AbstractHttpConnection.java:454)
[junit4:junit4] 2> at org.eclipse.jetty.server.BlockingHttpConnection.handleRequest(BlockingHttpConnection.java:47)
[junit4:junit4] 2> at org.eclipse.jetty.server.AbstractHttpConnection.headerComplete(AbstractHttpConnection.java:890)
[junit4:junit4] 2> at org.eclipse.jetty.server.AbstractHttpConnection$RequestHandler.headerComplete(AbstractHttpConnection.java:944)
[junit4:junit4] 2> at org.eclipse.jetty.http.HttpParser.parseNext(HttpParser.java:634)
[junit4:junit4] 2> at org.eclipse.jetty.http.HttpParser.parseAvailable(HttpParser.java:230)
[junit4:junit4] 2> at org.eclipse.jetty.server.BlockingHttpConnection.handle(BlockingHttpConnection.java:66)
[junit4:junit4] 2> at org.eclipse.jetty.server.bio.SocketConnector$ConnectorEndPoint.run(SocketConnector.java:254)
[junit4:junit4] 2> at org.eclipse.jetty.util.thread.QueuedThreadPool.runJob(QueuedThreadPool.java:599)
[junit4:junit4] 2> at org.eclipse.jetty.util.thread.QueuedThreadPool$3.run(QueuedThreadPool.java:534)
[junit4:junit4] 2> at java.lang.Thread.run(Thread.java:777)
[junit4:junit4] 2>
[junit4:junit4] 2> 1530 T368 C21 oasc.SolrException.log SEVERE java.lang.NullPointerException
[junit4:junit4] 2> at org.apache.solr.util.NumberUtils.SortableStr2int(NumberUtils.java:162)
[junit4:junit4] 2> at org.apache.solr.schema.SortableIntField.toObject(SortableIntField.java:96)
[junit4:junit4] 2> at org.apache.solr.schema.SortableIntField.toObject(SortableIntField.java:55)
[junit4:junit4] 2> at org.apache.solr.handler.component.QueryComponent.doFieldSortValues(QueryComponent.java:514)
[junit4:junit4] 2> at org.apache.solr.handler.component.QueryComponent.process(QueryComponent.java:421)
[junit4:junit4] 2> at org.apache.solr.handler.component.SearchHandler.handleRequestBody(SearchHandler.java:206)
[junit4:junit4] 2> at org.apache.solr.handler.RequestHandlerBase.handleRequest(RequestHandlerBase.java:129)
[junit4:junit4] 2> at org.apache.solr.core.SolrCore.execute(SolrCore.java:1750)
[junit4:junit4] 2> at org.apache.solr.servlet.SolrDispatchFilter.execute(SolrDispatchFilter.java:455)
[junit4:junit4] 2> at org.apache.solr.servlet.SolrDispatchFilter.doFilter(SolrDispatchFilter.java:276)
[junit4:junit4] 2> at org.eclipse.jetty.servlet.ServletHandler$CachedChain.doFilter(ServletHandler.java:1337)
[junit4:junit4] 2> at org.eclipse.jetty.servlet.ServletHandler.doHandle(ServletHandler.java:484)
[junit4:junit4] 2> at org.eclipse.jetty.server.session.SessionHandler.doHandle(SessionHandler.java:231)
[junit4:junit4] 2> at org.eclipse.jetty.server.handler.ScopedHandler.handle(ScopedHandler.java:119)
[junit4:junit4] 2> at org.eclipse.jetty.server.handler.GzipHandler.handle(GzipHandler.java:267)
[junit4:junit4] 2> at org.eclipse.jetty.server.handler.ContextHandler.doHandle(ContextHandler.java:1067)
[junit4:junit4] 2> at org.eclipse.jetty.servlet.ServletHandler.doScope(ServletHandler.java:413)
[junit4:junit4] 2> at org.eclipse.jetty.server.session.SessionHandler.doScope(SessionHandler.java:192)
[junit4:junit4] 2> at org.eclipse.jetty.server.handler.ContextHandler.doScope(ContextHandler.java:999)
[junit4:junit4] 2> at org.eclipse.jetty.server.handler.ScopedHandler.handle(ScopedHandler.java:117)
[junit4:junit4] 2> at org.eclipse.jetty.server.handler.HandlerWrapper.handle(HandlerWrapper.java:111)
[junit4:junit4] 2> at org.eclipse.jetty.server.Server.handle(Server.java:351)
[junit4:junit4] 2> at org.eclipse.jetty.server.AbstractHttpConnection.handleRequest(AbstractHttpConnection.java:454)
[junit4:junit4] 2> at org.eclipse.jetty.server.BlockingHttpConnection.handleRequest(BlockingHttpConnection.java:47)
[junit4:junit4] 2> at org.eclipse.jetty.server.AbstractHttpConnection.content(AbstractHttpConnection.java:900)
[junit4:junit4] 2> at org.eclipse.jetty.server.AbstractHttpConnection$RequestHandler.content(AbstractHttpConnection.java:954)
[junit4:junit4] 2> at org.eclipse.jetty.http.HttpParser.parseNext(HttpParser.java:857)
[junit4:junit4] 2> at org.eclipse.jetty.http.HttpParser.parseAvailable(HttpParser.java:235)
[junit4:junit4] 2> at org.eclipse.jetty.server.BlockingHttpConnection.handle(BlockingHttpConnection.java:66)
[junit4:junit4] 2> at org.eclipse.jetty.server.bio.SocketConnector$ConnectorEndPoint.run(SocketConnector.java:254)
[junit4:junit4] 2> at org.eclipse.jetty.util.thread.QueuedThreadPool.runJob(QueuedThreadPool.java:599)
[junit4:junit4] 2> at org.eclipse.jetty.util.thread.QueuedThreadPool$3.run(QueuedThreadPool.java:534)
[junit4:junit4] 2> at java.lang.Thread.run(Thread.java:777)
[junit4:junit4] 2>
[junit4:junit4] 2> 1531 T368 C21 REQ [collection1] webapp=/solr path=/elevate params={start=0&qt=/elevate&distrib=false&fl=id&fsv=true&q=ZZZZ&forceElevation=true&isShard=true&NOW=1349273611677&version=2&rows=500&shards.qt=/elevate&wt=javabin&sort=int_i+desc&shard.url=127.0.0.1:38641/solr} hits=1 status=500 QTime=5
[junit4:junit4] 2> 1532 T368 C21 oasc.SolrException.log SEVERE null:java.lang.NullPointerException
[junit4:junit4] 2> at org.apache.solr.util.NumberUtils.SortableStr2int(NumberUtils.java:162)
[junit4:junit4] 2> at org.apache.solr.schema.SortableIntField.toObject(SortableIntField.java:96)
[junit4:junit4] 2> at org.apache.solr.schema.SortableIntField.toObject(SortableIntField.java:55)
[junit4:junit4] 2> at org.apache.solr.handler.component.QueryComponent.doFieldSortValues(QueryComponent.java:514)
[junit4:junit4] 2> at org.apache.solr.handler.component.QueryComponent.process(QueryComponent.java:421)
[junit4:junit4] 2> at org.apache.solr.handler.component.SearchHandler.handleRequestBody(SearchHandler.java:206)
[junit4:junit4] 2> at org.apache.solr.handler.RequestHandlerBase.handleRequest(RequestHandlerBase.java:129)
[junit4:junit4] 2> at org.apache.solr.core.SolrCore.execute(SolrCore.java:1750)
[junit4:junit4] 2> at org.apache.solr.servlet.SolrDispatchFilter.execute(SolrDispatchFilter.java:455)
[junit4:junit4] 2> at org.apache.solr.servlet.SolrDispatchFilter.doFilter(SolrDispatchFilter.java:276)
[junit4:junit4] 2> at org.eclipse.jetty.servlet.ServletHandler$CachedChain.doFilter(ServletHandler.java:1337)
[junit4:junit4] 2> at org.eclipse.jetty.servlet.ServletHandler.doHandle(ServletHandler.java:484)
[junit4:junit4] 2> at org.eclipse.jetty.server.session.SessionHandler.doHandle(SessionHandler.java:231)
[junit4:junit4] 2> at org.eclipse.jetty.server.handler.ScopedHandler.handle(ScopedHandler.java:119)
[junit4:junit4] 2> at org.eclipse.jetty.server.handler.GzipHandler.handle(GzipHandler.java:267)
[junit4:junit4] 2> at org.eclipse.jetty.server.handler.ContextHandler.doHandle(ContextHandler.java:1067)
[junit4:junit4] 2> at org.eclipse.jetty.servlet.ServletHandler.doScope(ServletHandler.java:413)
[junit4:junit4] 2> at org.eclipse.jetty.server.session.SessionHandler.doScope(SessionHandler.java:192)
[junit4:junit4] 2> at org.eclipse.jetty.server.handler.ContextHandler.doScope(ContextHandler.java:999)
[junit4:junit4] 2> at org.eclipse.jetty.server.handler.ScopedHandler.handle(ScopedHandler.java:117)
[junit4:junit4] 2> at org.eclipse.jetty.server.handler.HandlerWrapper.handle(HandlerWrapper.java:111)
[junit4:junit4] 2> at org.eclipse.jetty.server.Server.handle(Server.java:351)
[junit4:junit4] 2> at org.eclipse.jetty.server.AbstractHttpConnection.handleRequest(AbstractHttpConnection.java:454)
[junit4:junit4] 2> at org.eclipse.jetty.server.BlockingHttpConnection.handleRequest(BlockingHttpConnection.java:47)
[junit4:junit4] 2> at org.eclipse.jetty.server.AbstractHttpConnection.content(AbstractHttpConnection.java:900)
[junit4:junit4] 2> at org.eclipse.jetty.server.AbstractHttpConnection$RequestHandler.content(AbstractHttpConnection.java:954)
[junit4:junit4] 2> at org.eclipse.jetty.http.HttpParser.parseNext(HttpParser.java:857)
[junit4:junit4] 2> at org.eclipse.jetty.http.HttpParser.parseAvailable(HttpParser.java:235)
[junit4:junit4] 2> at org.eclipse.jetty.server.BlockingHttpConnection.handle(BlockingHttpConnection.java:66)
[junit4:junit4] 2> at org.eclipse.jetty.server.bio.SocketConnector$ConnectorEndPoint.run(SocketConnector.java:254)
[junit4:junit4] 2> at org.eclipse.jetty.util.thread.QueuedThreadPool.runJob(QueuedThreadPool.java:599)
[junit4:junit4] 2> at org.eclipse.jetty.util.thread.QueuedThreadPool$3.run(QueuedThreadPool.java:534)
[junit4:junit4] 2> at java.lang.Thread.run(Thread.java:777)
[junit4:junit4] 2>
[junit4:junit4] 2> 1533 T378 C22 oasc.SolrException.log SEVERE java.lang.NullPointerException
[junit4:junit4] 2> at org.apache.solr.util.NumberUtils.SortableStr2int(NumberUtils.java:162)
[junit4:junit4] 2> at org.apache.solr.schema.SortableIntField.toObject(SortableIntField.java:96)
[junit4:junit4] 2> at org.apache.solr.schema.SortableIntField.toObject(SortableIntField.java:55)
[junit4:junit4] 2> at org.apache.solr.handler.component.QueryComponent.doFieldSortValues(QueryComponent.java:514)
[junit4:junit4] 2> at org.apache.solr.handler.component.QueryComponent.process(QueryComponent.java:421)
[junit4:junit4] 2> at org.apache.solr.handler.component.SearchHandler.handleRequestBody(SearchHandler.java:206)
[junit4:junit4] 2> at org.apache.solr.handler.RequestHandlerBase.handleRequest(RequestHandlerBase.java:129)
[junit4:junit4] 2> at org.apache.solr.core.SolrCore.execute(SolrCore.java:1750)
[junit4:junit4] 2> at org.apache.solr.servlet.SolrDispatchFilter.execute(SolrDispatchFilter.java:455)
[junit4:junit4] 2> at org.apache.solr.servlet.SolrDispatchFilter.doFilter(SolrDispatchFilter.java:276)
[junit4:junit4] 2> at org.eclipse.jetty.servlet.ServletHandler$CachedChain.doFilter(ServletHandler.java:1337)
[junit4:junit4] 2> at org.eclipse.jetty.servlet.ServletHandler.doHandle(ServletHandler.java:484)
[junit4:junit4] 2> at org.eclipse.jetty.server.session.SessionHandler.doHandle(SessionHandler.java:231)
[junit4:junit4] 2> at org.eclipse.jetty.server.handler.ScopedHandler.handle(ScopedHandler.java:119)
[junit4:junit4] 2> at org.eclipse.jetty.server.handler.GzipHandler.handle(GzipHandler.java:267)
[junit4:junit4] 2> at org.eclipse.jetty.server.handler.ContextHandler.doHandle(ContextHandler.java:1067)
[junit4:junit4] 2> at org.eclipse.jetty.servlet.ServletHandler.doScope(ServletHandler.java:413)
[junit4:junit4] 2> at org.eclipse.jetty.server.session.SessionHandler.doScope(SessionHandler.java:192)
[junit4:junit4] 2> at org.eclipse.jetty.server.handler.ContextHandler.doScope(ContextHandler.java:999)
[junit4:junit4] 2> at org.eclipse.jetty.server.handler.ScopedHandler.handle(ScopedHandler.java:117)
[junit4:junit4] 2> at org.eclipse.jetty.server.handler.HandlerWrapper.handle(HandlerWrapper.java:111)
[junit4:junit4] 2> at org.eclipse.jetty.server.Server.handle(Server.java:351)
[junit4:junit4] 2> at org.eclipse.jetty.server.AbstractHttpConnection.handleRequest(AbstractHttpConnection.java:454)
[junit4:junit4] 2> at org.eclipse.jetty.server.BlockingHttpConnection.handleRequest(BlockingHttpConnection.java:47)
[junit4:junit4] 2> at org.eclipse.jetty.server.AbstractHttpConnection.content(AbstractHttpConnection.java:900)
[junit4:junit4] 2> at org.eclipse.jetty.server.AbstractHttpConnection$RequestHandler.content(AbstractHttpConnection.java:954)
[junit4:junit4] 2> at org.eclipse.jetty.http.HttpParser.parseNext(HttpParser.java:857)
[junit4:junit4] 2> at org.eclipse.jetty.http.HttpParser.parseAvailable(HttpParser.java:235)
[junit4:junit4] 2> at org.eclipse.jetty.server.BlockingHttpConnection.handle(BlockingHttpConnection.java:66)
[junit4:junit4] 2> at org.eclipse.jetty.server.bio.SocketConnector$ConnectorEndPoint.run(SocketConnector.java:254)
[junit4:junit4] 2> at org.eclipse.jetty.util.thread.QueuedThreadPool.runJob(QueuedThreadPool.java:599)
[junit4:junit4] 2> at org.eclipse.jetty.util.thread.QueuedThreadPool$3.run(QueuedThreadPool.java:534)
[junit4:junit4] 2> at java.lang.Thread.run(Thread.java:777)
[junit4:junit4] 2>
[junit4:junit4] 2> 1533 T388 C23 oasc.SolrException.log SEVERE java.lang.NullPointerException
[junit4:junit4] 2> at org.apache.solr.util.NumberUtils.SortableStr2int(NumberUtils.java:162)
[junit4:junit4] 2> at org.apache.solr.schema.SortableIntField.toObject(SortableIntField.java:96)
[junit4:junit4] 2> at org.apache.solr.schema.SortableIntField.toObject(SortableIntField.java:55)
[junit4:junit4] 2> at org.apache.solr.handler.component.QueryComponent.doFieldSortValues(QueryComponent.java:514)
[junit4:junit4] 2> at org.apache.solr.handler.component.QueryComponent.process(QueryComponent.java:421)
[junit4:junit4] 2> at org.apache.solr.handler.component.SearchHandler.handleRequestBody(SearchHandler.java:206)
[junit4:junit4] 2> at org.apache.solr.handler.RequestHandlerBase.handleRequest(RequestHandlerBase.java:129)
[junit4:junit4] 2> at org.apache.solr.core.SolrCore.execute(SolrCore.java:1750)
[junit4:junit4] 2> at org.apache.solr.servlet.SolrDispatchFilter.execute(SolrDispatchFilter.java:455)
[junit4:junit4] 2> at org.apache.solr.servlet.SolrDispatchFilter.doFilter(SolrDispatchFilter.java:276)
[junit4:junit4] 2> at org.eclipse.jetty.servlet.ServletHandler$CachedChain.doFilter(ServletHandler.java:1337)
[junit4:junit4] 2> at org.eclipse.jetty.servlet.ServletHandler.doHandle(ServletHandler.java:484)
[junit4:junit4] 2> at org.eclipse.jetty.server.session.SessionHandler.doHandle(SessionHandler.java:231)
[junit4:junit4] 2> at org.eclipse.jetty.server.handler.ScopedHandler.handle(ScopedHandler.java:119)
[junit4:junit4] 2> at org.eclipse.jetty.server.handler.GzipHandler.handle(GzipHandler.java:267)
[junit4:junit4] 2> at org.eclipse.jetty.server.handler.ContextHandler.doHandle(ContextHandler.java:1067)
[junit4:junit4] 2> at org.eclipse.jetty.servlet.ServletHandler.doScope(ServletHandler.java:413)
[junit4:junit4] 2> at org.eclipse.jetty.server.session.SessionHandler.doScope(SessionHandler.java:192)
[junit4:junit4] 2> at org.eclipse.jetty.server.handler.ContextHandler.doScope(ContextHandler.java:999)
[junit4:junit4] 2> at org.eclipse.jetty.server.handler.ScopedHandler.handle(ScopedHandler.java:117)
[junit4:junit4] 2> at org.eclipse.jetty.server.handler.HandlerWrapper.handle(HandlerWrapper.java:111)
[junit4:junit4] 2> at org.eclipse.jetty.server.Server.handle(Server.java:351)
[junit4:junit4] 2> at org.eclipse.jetty.server.AbstractHttpConnection.handleRequest(AbstractHttpConnection.java:454)
[junit4:junit4] 2> at org.eclipse.jetty.server.BlockingHttpConnection.handleRequest(BlockingHttpConnection.java:47)
[junit4:junit4] 2> at org.eclipse.jetty.server.AbstractHttpConnection.content(AbstractHttpConnection.java:900)
[junit4:junit4] 2> at org.eclipse.jetty.server.AbstractHttpConnection$RequestHandler.content(AbstractHttpConnection.java:954)
[junit4:junit4] 2> at org.eclipse.jetty.http.HttpParser.parseNext(HttpParser.java:857)
[junit4:junit4] 2> at org.eclipse.jetty.http.HttpParser.parseAvailable(HttpParser.java:235)
[junit4:junit4] 2> at org.eclipse.jetty.server.BlockingHttpConnection.handle(BlockingHttpConnection.java:66)
[junit4:junit4] 2> at org.eclipse.jetty.server.bio.SocketConnector$ConnectorEndPoint.run(SocketConnector.java:254)
[junit4:junit4] 2> at org.eclipse.jetty.util.thread.QueuedThreadPool.runJob(QueuedThreadPool.java:599)
[junit4:junit4] 2> at org.eclipse.jetty.util.thread.QueuedThreadPool$3.run(QueuedThreadPool.java:534)
[junit4:junit4] 2> at java.lang.Thread.run(Thread.java:777)
[junit4:junit4] 2>
[junit4:junit4] 2> 1534 T377 C22 oasc.SolrException.log SEVERE org.apache.solr.common.SolrException: Server at http://127.0.0.1:38641/solr returned non ok status:500, message:Server Error
[junit4:junit4] 2> at org.apache.solr.client.solrj.impl.HttpSolrServer.request(HttpSolrServer.java:372)
[junit4:junit4] 2> at org.apache.solr.client.solrj.impl.HttpSolrServer.request(HttpSolrServer.java:181)
[junit4:junit4] 2> at org.apache.solr.handler.component.HttpShardHandler$1.call(HttpShardHandler.java:166)
[junit4:junit4] 2> at org.apache.solr.handler.component.HttpShardHandler$1.call(HttpShardHandler.java:133)
[junit4:junit4] 2> at java.util.concurrent.FutureTask$Sync.innerRun(FutureTask.java:345)
[junit4:junit4] 2> at java.util.concurrent.FutureTask.run(FutureTask.java:177)
[junit4:junit4] 2> at java.util.concurrent.Executors$RunnableAdapter.call(Executors.java:482)
[junit4:junit4] 2> at java.util.concurrent.FutureTask$Sync.innerRun(FutureTask.java:345)
[junit4:junit4] 2> at java.util.concurrent.FutureTask.run(FutureTask.java:177)
[junit4:junit4] 2> at java.util.concurrent.ThreadPoolExecutor.runWorker(ThreadPoolExecutor.java:1121)
[junit4:junit4] 2> at java.util.concurrent.ThreadPoolExecutor$Worker.run(ThreadPoolExecutor.java:614)
[junit4:junit4] 2> at java.lang.Thread.run(Thread.java:777)
[junit4:junit4] 2>
[junit4:junit4] 2> 1534 T378 C22 REQ [collection1] webapp=/solr path=/elevate params={start=0&qt=/elevate&distrib=false&fl=id&fsv=true&q=ZZZZ&forceElevation=true&isShard=true&NOW=1349273611677&version=2&rows=500&shards.qt=/elevate&wt=javabin&sort=int_i+desc&shard.url=127.0.0.1:44061/solr|[ff01::083]:33332/solr|[ff01::213]:33332/solr} hits=2 status=500 QTime=6
[junit4:junit4] 2> 1534 T388 C23 REQ [collection1] webapp=/solr path=/elevate params={start=0&qt=/elevate&distrib=false&fl=id&fsv=true&q=ZZZZ&forceElevation=true&isShard=true&NOW=1349273611677&version=2&rows=500&shards.qt=/elevate&wt=javabin&sort=int_i+desc&shard.url=127.0.0.1:53295/solr|[ff01::213]:33332/solr|[ff01::083]:33332/solr} hits=2 status=500 QTime=5
[junit4:junit4] 2> 1535 T377 C22 REQ [collection1] webapp=/solr path=/elevate params={q=ZZZZ&forceElevation=true&qt=/elevate&shards=127.0.0.1:38641/solr,127.0.0.1:44061/solr|[ff01::083]:33332/solr|[ff01::213]:33332/solr,127.0.0.1:53295/solr|[ff01::213]:33332/solr|[ff01::083]:33332/solr&fl=*,+[elevated]&version=2&rows=500&shards.qt=/elevate&wt=javabin&sort=int_i+desc} status=500 QTime=11
[junit4:junit4] 2> 1535 T378 C22 oasc.SolrException.log SEVERE null:java.lang.NullPointerException
[junit4:junit4] 2> at org.apache.solr.util.NumberUtils.SortableStr2int(NumberUtils.java:162)
[junit4:junit4] 2> at org.apache.solr.schema.SortableIntField.toObject(SortableIntField.java:96)
[junit4:junit4] 2> at org.apache.solr.schema.SortableIntField.toObject(SortableIntField.java:55)
[junit4:junit4] 2> at org.apache.solr.handler.component.QueryComponent.doFieldSortValues(QueryComponent.java:514)
[junit4:junit4] 2> at org.apache.solr.handler.component.QueryComponent.process(QueryComponent.java:421)
[junit4:junit4] 2> at org.apache.solr.handler.component.SearchHandler.handleRequestBody(SearchHandler.java:206)
[junit4:junit4] 2> at org.apache.solr.handler.RequestHandlerBase.handleRequest(RequestHandlerBase.java:129)
[junit4:junit4] 2> at org.apache.solr.core.SolrCore.execute(SolrCore.java:1750)
[junit4:junit4] 2> at org.apache.solr.servlet.SolrDispatchFilter.execute(SolrDispatchFilter.java:455)
[junit4:junit4] 2> at org.apache.solr.servlet.SolrDispatchFilter.doFilter(SolrDispatchFilter.java:276)
[junit4:junit4] 2> at org.eclipse.jetty.servlet.ServletHandler$CachedChain.doFilter(ServletHandler.java:1337)
[junit4:junit4] 2> at org.eclipse.jetty.servlet.ServletHandler.doHandle(ServletHandler.java:484)
[junit4:junit4] 2> at org.eclipse.jetty.server.session.SessionHandler.doHandle(SessionHandler.java:231)
[junit4:junit4] 2> at org.eclipse.jetty.server.handler.ScopedHandler.handle(ScopedHandler.java:119)
[junit4:junit4] 2> at org.eclipse.jetty.server.handler.GzipHandler.handle(GzipHandler.java:267)
[junit4:junit4] 2> at org.eclipse.jetty.server.handler.ContextHandler.doHandle(ContextHandler.java:1067)
[junit4:junit4] 2> at org.eclipse.jetty.servlet.ServletHandler.doScope(ServletHandler.java:413)
[junit4:junit4] 2> at org.eclipse.jetty.server.session.SessionHandler.doScope(SessionHandler.java:192)
[junit4:junit4] 2> at org.eclipse.jetty.server.handler.ContextHandler.doScope(ContextHandler.java:999)
[junit4:junit4] 2> at org.eclipse.jetty.server.handler.ScopedHandler.handle(ScopedHandler.java:117)
[junit4:junit4] 2> at org.eclipse.jetty.server.handler.HandlerWrapper.handle(HandlerWrapper.java:111)
[junit4:junit4] 2> at org.eclipse.jetty.server.Server.handle(Server.java:351)
[junit4:junit4] 2> at org.eclipse.jetty.server.AbstractHttpConnection.handleRequest(AbstractHttpConnection.java:454)
[junit4:junit4] 2> at org.eclipse.jetty.server.BlockingHttpConnection.handleRequest(BlockingHttpConnection.java:47)
[junit4:junit4] 2> at org.eclipse.jetty.server.AbstractHttpConnection.content(AbstractHttpConnection.java:900)
[junit4:junit4] 2> at org.eclipse.jetty.server.AbstractHttpConnection$RequestHandler.content(AbstractHttpConnection.java:954)
[junit4:junit4] 2> at org.eclipse.jetty.http.HttpParser.parseNext(HttpParser.java:857)
[junit4:junit4] 2> at org.eclipse.jetty.http.HttpParser.parseAvailable(HttpParser.java:235)
[junit4:junit4] 2> at org.eclipse.jetty.server.BlockingHttpConnection.handle(BlockingHttpConnection.java:66)
[junit4:junit4] 2> at org.eclipse.jetty.server.bio.SocketConnector$ConnectorEndPoint.run(SocketConnector.java:254)
[junit4:junit4] 2> at org.eclipse.jetty.util.thread.QueuedThreadPool.runJob(QueuedThreadPool.java:599)
[junit4:junit4] 2> at org.eclipse.jetty.util.thread.QueuedThreadPool$3.run(QueuedThreadPool.java:534)
[junit4:junit4] 2> at java.lang.Thread.run(Thread.java:777)
[junit4:junit4] 2>
[junit4:junit4] 2> 1535 T388 C23 oasc.SolrException.log SEVERE null:java.lang.NullPointerException
[junit4:junit4] 2> at org.apache.solr.util.NumberUtils.SortableStr2int(NumberUtils.java:162)
[junit4:junit4] 2> at org.apache.solr.schema.SortableIntField.toObject(SortableIntField.java:96)
[junit4:junit4] 2> at org.apache.solr.schema.SortableIntField.toObject(SortableIntField.java:55)
[junit4:junit4] 2> at org.apache.solr.handler.component.QueryComponent.doFieldSortValues(QueryComponent.java:514)
[junit4:junit4] 2> at org.apache.solr.handler.component.QueryComponent.process(QueryComponent.java:421)
[junit4:junit4] 2> at org.apache.solr.handler.component.SearchHandler.handleRequestBody(SearchHandler.java:206)
[junit4:junit4] 2> at org.apache.solr.handler.RequestHandlerBase.handleRequest(RequestHandlerBase.java:129)
[junit4:junit4] 2> at org.apache.solr.core.SolrCore.execute(SolrCore.java:1750)
[junit4:junit4] 2> at org.apache.solr.servlet.SolrDispatchFilter.execute(SolrDispatchFilter.java:455)
[junit4:junit4] 2> at org.apache.solr.servlet.SolrDispatchFilter.doFilter(SolrDispatchFilter.java:276)
[junit4:junit4] 2> at org.eclipse.jetty.servlet.ServletHandler$CachedChain.doFilter(ServletHandler.java:1337)
[junit4:junit4] 2> at org.eclipse.jetty.servlet.ServletHandler.doHandle(ServletHandler.java:484)
[junit4:junit4] 2> at org.eclipse.jetty.server.session.SessionHandler.doHandle(SessionHandler.java:231)
[junit4:junit4] 2> at org.eclipse.jetty.server.handler.ScopedHandler.handle(ScopedHandler.java:119)
[junit4:junit4] 2> at org.eclipse.jetty.server.handler.GzipHandler.handle(GzipHandler.java:267)
[junit4:junit4] 2> at org.eclipse.jetty.server.handler.ContextHandler.doHandle(ContextHandler.java:1067)
[junit4:junit4] 2> at org.eclipse.jetty.servlet.ServletHandler.doScope(ServletHandler.java:413)
[junit4:junit4] 2> at org.eclipse.jetty.server.session.SessionHandler.doScope(SessionHandler.java:192)
[junit4:junit4] 2> at org.eclipse.jetty.server.handler.ContextHandler.doScope(ContextHandler.java:999)
[junit4:junit4] 2> at org.eclipse.jetty.server.handler.ScopedHandler.handle(ScopedHandler.java:117)
[junit4:junit4] 2> at org.eclipse.jetty.server.handler.HandlerWrapper.handle(HandlerWrapper.java:111)
[junit4:junit4] 2> at org.eclipse.jetty.server.Server.handle(Server.java:351)
[junit4:junit4] 2> at org.eclipse.jetty.server.AbstractHttpConnection.handleRequest(AbstractHttpConnection.java:454)
[junit4:junit4] 2> at org.eclipse.jetty.server.BlockingHttpConnection.handleRequest(BlockingHttpConnection.java:47)
[junit4:junit4] 2> at org.eclipse.jetty.server.AbstractHttpConnection.content(AbstractHttpConnection.java:900)
[junit4:junit4] 2> at org.eclipse.jetty.server.AbstractHttpConnection$RequestHandler.content(AbstractHttpConnection.java:954)
[junit4:junit4] 2> at org.eclipse.jetty.http.HttpParser.parseNext(HttpParser.java:857)
[junit4:junit4] 2> at org.eclipse.jetty.http.HttpParser.parseAvailable(HttpParser.java:235)
[junit4:junit4] 2> at org.eclipse.jetty.server.BlockingHttpConnection.handle(BlockingHttpConnection.java:66)
[junit4:junit4] 2> at org.eclipse.jetty.server.bio.SocketConnector$ConnectorEndPoint.run(SocketConnector.java:254)
[junit4:junit4] 2> at org.eclipse.jetty.util.thread.QueuedThreadPool.runJob(QueuedThreadPool.java:599)
[junit4:junit4] 2> at org.eclipse.jetty.util.thread.QueuedThreadPool$3.run(QueuedThreadPool.java:534)
[junit4:junit4] 2> at java.lang.Thread.run(Thread.java:777)
[junit4:junit4] 2>
[junit4:junit4] 2> 1535 T377 C22 oasc.SolrException.log SEVERE null:org.apache.solr.common.SolrException: Server at http://127.0.0.1:38641/solr returned non ok status:500, message:Server Error
[junit4:junit4] 2> at org.apache.solr.client.solrj.impl.HttpSolrServer.request(HttpSolrServer.java:372)
[junit4:junit4] 2> at org.apache.solr.client.solrj.impl.HttpSolrServer.request(HttpSolrServer.java:181)
[junit4:junit4] 2> at org.apache.solr.handler.component.HttpShardHandler$1.call(HttpShardHandler.java:166)
[junit4:junit4] 2> at org.apache.solr.handler.component.HttpShardHandler$1.call(HttpShardHandler.java:133)
[junit4:junit4] 2> at java.util.concurrent.FutureTask$Sync.innerRun(FutureTask.java:345)
[junit4:junit4] 2> at java.util.concurrent.FutureTask.run(FutureTask.java:177)
[junit4:junit4] 2> at java.util.concurrent.Executors$RunnableAdapter.call(Executors.java:482)
[junit4:junit4] 2> at java.util.concurrent.FutureTask$Sync.innerRun(FutureTask.java:345)
[junit4:junit4] 2> at java.util.concurrent.FutureTask.run(FutureTask.java:177)
[junit4:junit4] 2> at java.util.concurrent.ThreadPoolExecutor.runWorker(ThreadPoolExecutor.java:1121)
[junit4:junit4] 2> at java.util.concurrent.ThreadPoolExecutor$Worker.run(ThreadPoolExecutor.java:614)
[junit4:junit4] 2> at java.lang.Thread.run(Thread.java:777)
[junit4:junit4] 2>
[junit4:junit4] 2> 1537 T354 oasc.CoreContainer.shutdown Shutting down CoreContainer instance=1356408040
[junit4:junit4] 2> 1538 T354 oasc.SolrCore.close [collection1] CLOSING SolrCore org.apache.solr.core.SolrCore@f32fba75
[junit4:junit4] 2> 1542 T354 oasu.DirectUpdateHandler2.close closing DirectUpdateHandler2{commits=1,autocommits=0,soft autocommits=0,optimizes=0,rollbacks=0,expungeDeletes=0,docsPending=0,adds=0,deletesById=0,deletesByQuery=0,errors=0,cumulative_adds=7,cumulative_deletesById=0,cumulative_deletesByQuery=1,cumulative_errors=0}
[junit4:junit4] 2> 1543 T354 oasc.SolrCore.decrefSolrCoreState Closing SolrCoreState
[junit4:junit4] 2> 1543 T354 oasu.DefaultSolrCoreState.closeIndexWriter SolrCoreState ref count has reached 0 - closing IndexWriter
[junit4:junit4] 2> 1544 T354 oasu.DefaultSolrCoreState.closeIndexWriter closing IndexWriter with IndexWriterCloser
[junit4:junit4] 2> 1546 T354 oasc.SolrCore.closeSearcher [collection1] Closing main searcher on request.
[junit4:junit4] 2> 1552 T354 oejsh.ContextHandler.doStop stopped o.e.j.s.ServletContextHandler{/solr,null}
[junit4:junit4] 2> 1605 T354 oasc.CoreContainer.shutdown Shutting down CoreContainer instance=-1257125419
[junit4:junit4] 2> 1605 T354 oasc.SolrCore.close [collection1] CLOSING SolrCore org.apache.solr.core.SolrCore@758f39b8
[junit4:junit4] 2> 1608 T354 oasu.DirectUpdateHandler2.close closing DirectUpdateHandler2{commits=1,autocommits=0,soft autocommits=0,optimizes=0,rollbacks=0,expungeDeletes=0,docsPending=0,adds=0,deletesById=0,deletesByQuery=0,errors=0,cumulative_adds=2,cumulative_deletesById=0,cumulative_deletesByQuery=1,cumulative_errors=0}
[junit4:junit4] 2> 1609 T354 oasc.SolrCore.decrefSolrCoreState Closing SolrCoreState
[junit4:junit4] 2> 1609 T354 oasu.DefaultSolrCoreState.closeIndexWriter SolrCoreState ref count has reached 0 - closing IndexWriter
[junit4:junit4] 2> 1609 T354 oasu.DefaultSolrCoreState.closeIndexWriter closing IndexWriter with IndexWriterCloser
[junit4:junit4] 2> 1610 T354 oasc.SolrCore.closeSearcher [collection1] Closing main searcher on request.
[junit4:junit4] 2> 1614 T354 oejsh.ContextHandler.doStop stopped o.e.j.s.ServletContextHandler{/solr,null}
[junit4:junit4] 2> 1666 T354 oasc.CoreContainer.shutdown Shutting down CoreContainer instance=1424876057
[junit4:junit4] 2> 1667 T354 oasc.SolrCore.close [collection1] CLOSING SolrCore org.apache.solr.core.SolrCore@c45fb204
[junit4:junit4] 2> 1669 T354 oasu.DirectUpdateHandler2.close closing DirectUpdateHandler2{commits=1,autocommits=0,soft autocommits=0,optimizes=0,rollbacks=0,expungeDeletes=0,docsPending=0,adds=0,deletesById=0,deletesByQuery=0,errors=0,cumulative_adds=2,cumulative_deletesById=0,cumulative_deletesByQuery=1,cumulative_errors=0}
[junit4:junit4] 2> 1670 T354 oasc.SolrCore.decrefSolrCoreState Closing SolrCoreState
[junit4:junit4] 2> 1670 T354 oasu.DefaultSolrCoreState.closeIndexWriter SolrCoreState ref count has reached 0 - closing IndexWriter
[junit4:junit4] 2> 1671 T354 oasu.DefaultSolrCoreState.closeIndexWriter closing IndexWriter with IndexWriterCloser
[junit4:junit4] 2> 1672 T354 oasc.SolrCore.closeSearcher [collection1] Closing main searcher on request.
[junit4:junit4] 2> 1677 T354 oejsh.ContextHandler.doStop stopped o.e.j.s.ServletContextHandler{/solr,null}
[junit4:junit4] 2> 1729 T354 oasc.CoreContainer.shutdown Shutting down CoreContainer instance=-1554656208
[junit4:junit4] 2> 1730 T354 oasc.SolrCore.close [collection1] CLOSING SolrCore org.apache.solr.core.SolrCore@f12cc33d
[junit4:junit4] 2> 1734 T354 oasu.DirectUpdateHandler2.close closing DirectUpdateHandler2{commits=1,autocommits=0,soft autocommits=0,optimizes=0,rollbacks=0,expungeDeletes=0,docsPending=0,adds=0,deletesById=0,deletesByQuery=0,errors=0,cumulative_adds=3,cumulative_deletesById=0,cumulative_deletesByQuery=1,cumulative_errors=0}
[junit4:junit4] 2> 1735 T354 oasc.SolrCore.decrefSolrCoreState Closing SolrCoreState
[junit4:junit4] 2> 1735 T354 oasu.DefaultSolrCoreState.closeIndexWriter SolrCoreState ref count has reached 0 - closing IndexWriter
[junit4:junit4] 2> 1736 T354 oasu.DefaultSolrCoreState.closeIndexWriter closing IndexWriter with IndexWriterCloser
[junit4:junit4] 2> 1737 T354 oasc.SolrCore.closeSearcher [collection1] Closing main searcher on request.
[junit4:junit4] 2> 1741 T354 oejsh.ContextHandler.doStop stopped o.e.j.s.ServletContextHandler{/solr,null}
[junit4:junit4] 2> 1793 T354 oas.SolrTestCaseJ4.tearDown ###Ending testDistribSearch
[junit4:junit4] 2> NOTE: reproduce with: ant test -Dtestcase=DistributedQueryElevationComponentTest -Dtests.method=testDistribSearch -Dtests.seed=449E3BDC90C3041F -Dtests.multiplier=3 -Dtests.slow=true -Dtests.locale=ar_KW -Dtests.timezone=America/Dominica -Dtests.file.encoding=ISO-8859-1
[junit4:junit4] ERROR 1.81s J1 | DistributedQueryElevationComponentTest.testDistribSearch <<<
[junit4:junit4] > Throwable #1: org.apache.solr.common.SolrException: Server at http://127.0.0.1:44061/solr returned non ok status:500, message:Server Error
[junit4:junit4] > at __randomizedtesting.SeedInfo.seed([449E3BDC90C3041F:C578B5C4E79C6423]:0)
[junit4:junit4] > at org.apache.solr.client.solrj.impl.HttpSolrServer.request(HttpSolrServer.java:372)
[junit4:junit4] > at org.apache.solr.client.solrj.impl.HttpSolrServer.request(HttpSolrServer.java:181)
[junit4:junit4] > at org.apache.solr.client.solrj.request.QueryRequest.process(QueryRequest.java:90)
[junit4:junit4] > at org.apache.solr.client.solrj.SolrServer.query(SolrServer.java:301)
[junit4:junit4] > at org.apache.solr.BaseDistributedSearchTestCase.queryServer(BaseDistributedSearchTestCase.java:371)
[junit4:junit4] > at org.apache.solr.BaseDistributedSearchTestCase.query(BaseDistributedSearchTestCase.java:394)
[junit4:junit4] > at org.apache.solr.BaseDistributedSearchTestCase.query(BaseDistributedSearchTestCase.java:376)
[junit4:junit4] > at org.apache.solr.handler.component.DistributedQueryElevationComponentTest.doTest(DistributedQueryElevationComponentTest.java:83)
[junit4:junit4] > at org.apache.solr.BaseDistributedSearchTestCase.testDistribSearch(BaseDistributedSearchTestCase.java:695)
[junit4:junit4] > at sun.reflect.NativeMethodAccessorImpl.invoke0(Native Method)
[junit4:junit4] > at sun.reflect.NativeMethodAccessorImpl.invoke(NativeMethodAccessorImpl.java:88)
[junit4:junit4] > at sun.reflect.DelegatingMethodAccessorImpl.invoke(DelegatingMethodAccessorImpl.java:55)
[junit4:junit4] > at java.lang.reflect.Method.invoke(Method.java:613)
[junit4:junit4] > at com.carrotsearch.randomizedtesting.RandomizedRunner.invoke(RandomizedRunner.java:1559)
[junit4:junit4] > at com.carrotsearch.randomizedtesting.RandomizedRunner.access$600(RandomizedRunner.java:79)
[junit4:junit4] > at com.carrotsearch.randomizedtesting.RandomizedRunner$6.evaluate(RandomizedRunner.java:737)
[junit4:junit4] > at com.carrotsearch.randomizedtesting.RandomizedRunner$7.evaluate(RandomizedRunner.java:773)
[junit4:junit4] > at com.carrotsearch.randomizedtesting.RandomizedRunner$8.evaluate(RandomizedRunner.java:787)
[junit4:junit4] > at com.carrotsearch.randomizedtesting.rules.SystemPropertiesRestoreRule$1.evaluate(SystemPropertiesRestoreRule.java:53)
[junit4:junit4] > at org.apache.lucene.util.TestRuleSetupTeardownChained$1.evaluate(TestRuleSetupTeardownChained.java:50)
[junit4:junit4] > at org.apache.lucene.util.TestRuleFieldCacheSanity$1.evaluate(TestRuleFieldCacheSanity.java:51)
[junit4:junit4] > at org.apache.lucene.util.AbstractBeforeAfterRule$1.evaluate(AbstractBeforeAfterRule.java:45)
[junit4:junit4] > at com.carrotsearch.randomizedtesting.rules.SystemPropertiesInvariantRule$1.evaluate(SystemPropertiesInvariantRule.java:55)
[junit4:junit4] > at org.apache.lucene.util.TestRuleThreadAndTestName$1.evaluate(TestRuleThreadAndTestName.java:48)
[junit4:junit4] > at org.apache.lucene.util.TestRuleIgnoreAfterMaxFailures$1.evaluate(TestRuleIgnoreAfterMaxFailures.java:70)
[junit4:junit4] > at org.apache.lucene.util.TestRuleMarkFailure$1.evaluate(TestRuleMarkFailure.java:48)
[junit4:junit4] > at com.carrotsearch.randomizedtesting.rules.StatementAdapter.evaluate(StatementAdapter.java:36)
[junit4:junit4] > at com.carrotsearch.randomizedtesting.ThreadLeakControl$StatementRunner.run(ThreadLeakControl.java:358)
[junit4:junit4] > at com.carrotsearch.randomizedtesting.ThreadLeakControl.forkTimeoutingTask(ThreadLeakControl.java:782)
[junit4:junit4] > at com.carrotsearch.randomizedtesting.ThreadLeakControl$3.evaluate(ThreadLeakControl.java:442)
[junit4:junit4] > at com.carrotsearch.randomizedtesting.RandomizedRunner.runSingleTest(RandomizedRunner.java:746)
[junit4:junit4] > at com.carrotsearch.randomizedtesting.RandomizedRunner$3.evaluate(RandomizedRunner.java:648)
[junit4:junit4] > at com.carrotsearch.randomizedtesting.RandomizedRunner$4.evaluate(RandomizedRunner.java:682)
[junit4:junit4] > at com.carrotsearch.randomizedtesting.RandomizedRunner$5.evaluate(RandomizedRunner.java:693)
[junit4:junit4] > at com.carrotsearch.randomizedtesting.rules.StatementAdapter.evaluate(StatementAdapter.java:36)
[junit4:junit4] > at com.carrotsearch.randomizedtesting.rules.SystemPropertiesRestoreRule$1.evaluate(SystemPropertiesRestoreRule.java:53)
[junit4:junit4] > at org.apache.lucene.util.AbstractBeforeAfterRule$1.evaluate(AbstractBeforeAfterRule.java:45)
[junit4:junit4] > at org.apache.lucene.util.TestRuleStoreClassName$1.evaluate(TestRuleStoreClassName.java:42)
[junit4:junit4] > at com.carrotsearch.randomizedtesting.rules.SystemPropertiesInvariantRule$1.evaluate(SystemPropertiesInvariantRule.java:55)
[junit4:junit4] > at com.carrotsearch.randomizedtesting.rules.NoShadowingOrOverridesOnMethodsRule$1.evaluate(NoShadowingOrOverridesOnMethodsRule.java:39)
[junit4:junit4] > at com.carrotsearch.randomizedtesting.rules.NoShadowingOrOverridesOnMethodsRule$1.evaluate(NoShadowingOrOverridesOnMethodsRule.java:39)
[junit4:junit4] > at com.carrotsearch.randomizedtesting.rules.StatementAdapter.evaluate(StatementAdapter.java:36)
[junit4:junit4] > at org.apache.lucene.util.TestRuleAssertionsRequired$1.evaluate(TestRuleAssertionsRequired.java:43)
[junit4:junit4] > at org.apache.lucene.util.TestRuleMarkFailure$1.evaluate(TestRuleMarkFailure.java:48)
[junit4:junit4] > at org.apache.lucene.util.TestRuleIgnoreAfterMaxFailures$1.evaluate(TestRuleIgnoreAfterMaxFailures.java:70)
[junit4:junit4] > at org.apache.lucene.util.TestRuleIgnoreTestSuites$1.evaluate(TestRuleIgnoreTestSuites.java:55)
[junit4:junit4] > at com.carrotsearch.randomizedtesting.rules.StatementAdapter.evaluate(StatementAdapter.java:36)
[junit4:junit4] > at com.carrotsearch.randomizedtesting.ThreadLeakControl$StatementRunner.run(ThreadLeakControl.java:358)
[junit4:junit4] > at java.lang.Thread.run(Thread.java:777)
[junit4:junit4] 2> 1810 T354 oas.SolrTestCaseJ4.deleteCore ###deleteCore
[junit4:junit4] 2> NOTE: test params are: codec=Lucene3x, sim=DefaultSimilarity, locale=ar_KW, timezone=America/Dominica
[junit4:junit4] 2> NOTE: Linux 3.2.0-31-generic amd64/IBM Corporation 1.7.0 (64-bit)/cpus=8,threads=1,free=20112568,total=95092736
[junit4:junit4] 2> NOTE: All tests run in this JVM: [SuggesterTSTTest, TestCSVResponseWriter, TestSolrXMLSerializer, SimplePostToolTest, ClusterStateUpdateTest, TestSurroundQueryParser, TimeZoneUtilsTest, ScriptEngineTest, SignatureUpdateProcessorFactoryTest, TestUpdate, BasicDistributedZk2Test, DOMUtilTest, TestPropInject, TestCSVLoader, HighlighterTest, PeerSyncTest, DebugComponentTest, TestFoldingMultitermQuery, TestPluginEnable, QueryEqualityTest, DistributedQueryElevationComponentTest]
[junit4:junit4] Completed on J1 in 1.84s, 1 test, 1 error <<< FAILURES!
[...truncated 190 lines...]
[junit4:junit4] Suite: org.apache.solr.cloud.BasicDistributedZkTest
[junit4:junit4] 2> 3 T1065 oas.SolrTestCaseJ4.setUp ###Starting testDistribSearch
[junit4:junit4] 2> Creating dataDir: /mnt/ssd/jenkins/workspace/Lucene-Solr-4.x-Linux/solr/build/solr-core/test/J1/./solrtest-BasicDistributedZkTest-1349273701736
[junit4:junit4] 2> 4 T1065 oasc.ZkTestServer.run STARTING ZK TEST SERVER
[junit4:junit4] 2> 6 T1066 oazs.ZooKeeperServer.setTickTime tickTime set to 1000
[junit4:junit4] 2> 7 T1066 oazs.NIOServerCnxn$Factory.<init> binding to port 0.0.0.0/0.0.0.0:0
[junit4:junit4] 2> 7 T1066 oazsp.FileTxnSnapLog.save Snapshotting: 0
[junit4:junit4] 2> 105 T1065 oasc.ZkTestServer.run start zk server on port:57368
[junit4:junit4] 2> 106 T1065 oaz.ZooKeeper.<init> Initiating client connection, connectString=127.0.0.1:57368 sessionTimeout=10000 watcher=org.apache.solr.common.cloud.ConnectionManager@cfbab3a2
[junit4:junit4] 2> 107 T1071 oaz.ClientCnxn$SendThread.startConnect Opening socket connection to server /127.0.0.1:57368
[junit4:junit4] 2> 107 T1065 oascc.ConnectionManager.waitForConnected Waiting for client to connect to ZooKeeper
[junit4:junit4] 2> 108 T1071 oaz.ClientCnxn$SendThread.primeConnection Socket connection established to localhost.localdomain/127.0.0.1:57368, initiating session
[junit4:junit4] 2> 108 T1067 oazs.NIOServerCnxn$Factory.run Accepted socket connection from /127.0.0.1:47286
[junit4:junit4] 2> 108 T1067 oazs.NIOServerCnxn.readConnectRequest Client attempting to establish new session at /127.0.0.1:47286
[junit4:junit4] 2> 109 T1069 oazsp.FileTxnLog.append Creating new log file: log.1
[junit4:junit4] 2> 209 T1069 oazs.NIOServerCnxn.finishSessionInit Established session 0x13a26facd6c0000 with negotiated timeout 10000 for client /127.0.0.1:47286
[junit4:junit4] 2> 209 T1071 oaz.ClientCnxn$SendThread.readConnectResult Session establishment complete on server localhost.localdomain/127.0.0.1:57368, sessionid = 0x13a26facd6c0000, negotiated timeout = 10000
[junit4:junit4] 2> 210 T1072 oascc.ConnectionManager.process Watcher org.apache.solr.common.cloud.ConnectionManager@cfbab3a2 name:ZooKeeperConnection Watcher:127.0.0.1:57368 got event WatchedEvent state:SyncConnected type:None path:null path:null type:None
[junit4:junit4] 2> 210 T1065 oascc.ConnectionManager.waitForConnected Client is connected to ZooKeeper
[junit4:junit4] 2> 211 T1065 oascc.SolrZkClient.makePath makePath: /solr
[junit4:junit4] 2> 213 T1070 oazs.PrepRequestProcessor.pRequest Processed session termination for sessionid: 0x13a26facd6c0000
[junit4:junit4] 2> 214 T1067 oazs.NIOServerCnxn.closeSock Closed socket connection for client /127.0.0.1:47286 which had sessionid 0x13a26facd6c0000
[junit4:junit4] 2> 214 T1072 oaz.ClientCnxn$EventThread.run EventThread shut down
[junit4:junit4] 2> 214 T1065 oaz.ZooKeeper.close Session: 0x13a26facd6c0000 closed
[junit4:junit4] 2> 215 T1065 oaz.ZooKeeper.<init> Initiating client connection, connectString=127.0.0.1:57368/solr sessionTimeout=10000 watcher=org.apache.solr.common.cloud.ConnectionManager@e36ae655
[junit4:junit4] 2> 216 T1073 oaz.ClientCnxn$SendThread.startConnect Opening socket connection to server /127.0.0.1:57368
[junit4:junit4] 2> 216 T1065 oascc.ConnectionManager.waitForConnected Waiting for client to connect to ZooKeeper
[junit4:junit4] 2> 217 T1073 oaz.ClientCnxn$SendThread.primeConnection Socket connection established to localhost.localdomain/127.0.0.1:57368, initiating session
[junit4:junit4] 2> 217 T1067 oazs.NIOServerCnxn$Factory.run Accepted socket connection from /127.0.0.1:47287
[junit4:junit4] 2> 218 T1067 oazs.NIOServerCnxn.readConnectRequest Client attempting to establish new session at /127.0.0.1:47287
[junit4:junit4] 2> 219 T1069 oazs.NIOServerCnxn.finishSessionInit Established session 0x13a26facd6c0001 with negotiated timeout 10000 for client /127.0.0.1:47287
[junit4:junit4] 2> 219 T1073 oaz.ClientCnxn$SendThread.readConnectResult Session establishment complete on server localhost.localdomain/127.0.0.1:57368, sessionid = 0x13a26facd6c0001, negotiated timeout = 10000
[junit4:junit4] 2> 220 T1074 oascc.ConnectionManager.process Watcher org.apache.solr.common.cloud.ConnectionManager@e36ae655 name:ZooKeeperConnection Watcher:127.0.0.1:57368/solr got event WatchedEvent state:SyncConnected type:None path:null path:null type:None
[junit4:junit4] 2> 221 T1065 oascc.ConnectionManager.waitForConnected Client is connected to ZooKeeper
[junit4:junit4] 2> 221 T1065 oascc.SolrZkClient.makePath makePath: /collections/collection1
[junit4:junit4] 2> 223 T1065 oascc.SolrZkClient.makePath makePath: /collections/collection1/shards
[junit4:junit4] 2> 225 T1065 oascc.SolrZkClient.makePath makePath: /collections/control_collection
[junit4:junit4] 2> 226 T1065 oascc.SolrZkClient.makePath makePath: /collections/control_collection/shards
[junit4:junit4] 2> 228 T1065 oasc.AbstractZkTestCase.putConfig put /mnt/ssd/jenkins/workspace/Lucene-Solr-4.x-Linux/solr/build/solr-core/test-files/solr/collection1/conf/solrconfig.xml to /configs/conf1/solrconfig.xml
[junit4:junit4] 2> 234 T1065 oascc.SolrZkClient.makePath makePath: /configs/conf1/solrconfig.xml
[junit4:junit4] 2> 264 T1065 oasc.AbstractZkTestCase.putConfig put /mnt/ssd/jenkins/workspace/Lucene-Solr-4.x-Linux/solr/build/solr-core/test-files/solr/collection1/conf/schema.xml to /configs/conf1/schema.xml
[junit4:junit4] 2> 268 T1065 oascc.SolrZkClient.makePath makePath: /configs/conf1/schema.xml
[junit4:junit4] 2> 270 T1065 oasc.AbstractZkTestCase.putConfig put /mnt/ssd/jenkins/workspace/Lucene-Solr-4.x-Linux/solr/build/solr-core/test-files/solr/collection1/conf/solrconfig.xml to /configs/conf1/solrconfig.xml
[junit4:junit4] 2> 273 T1065 oascc.SolrZkClient.makePath makePath: /configs/conf1/solrconfig.xml
[junit4:junit4] 2> 279 T1065 oasc.AbstractZkTestCase.putConfig put /mnt/ssd/jenkins/workspace/Lucene-Solr-4.x-Linux/solr/build/solr-core/test-files/solr/collection1/conf/stopwords.txt to /configs/conf1/stopwords.txt
[junit4:junit4] 2> 279 T1065 oascc.SolrZkClient.makePath makePath: /configs/conf1/stopwords.txt
[junit4:junit4] 2> 281 T1065 oasc.AbstractZkTestCase.putConfig put /mnt/ssd/jenkins/workspace/Lucene-Solr-4.x-Linux/solr/build/solr-core/test-files/solr/collection1/conf/protwords.txt to /configs/conf1/protwords.txt
[junit4:junit4] 2> 282 T1065 oascc.SolrZkClient.makePath makePath: /configs/conf1/protwords.txt
[junit4:junit4] 2> 284 T1065 oasc.AbstractZkTestCase.putConfig put /mnt/ssd/jenkins/workspace/Lucene-Solr-4.x-Linux/solr/build/solr-core/test-files/solr/collection1/conf/currency.xml to /configs/conf1/currency.xml
[junit4:junit4] 2> 285 T1065 oascc.SolrZkClient.makePath makePath: /configs/conf1/currency.xml
[junit4:junit4] 2> 286 T1065 oasc.AbstractZkTestCase.putConfig put /mnt/ssd/jenkins/workspace/Lucene-Solr-4.x-Linux/solr/build/solr-core/test-files/solr/collection1/conf/open-exchange-rates.json to /configs/conf1/open-exchange-rates.json
[junit4:junit4] 2> 287 T1065 oascc.SolrZkClient.makePath makePath: /configs/conf1/open-exchange-rates.json
[junit4:junit4] 2> 289 T1065 oasc.AbstractZkTestCase.putConfig put /mnt/ssd/jenkins/workspace/Lucene-Solr-4.x-Linux/solr/build/solr-core/test-files/solr/collection1/conf/mapping-ISOLatin1Accent.txt to /configs/conf1/mapping-ISOLatin1Accent.txt
[junit4:junit4] 2> 290 T1065 oascc.SolrZkClient.makePath makePath: /configs/conf1/mapping-ISOLatin1Accent.txt
[junit4:junit4] 2> 292 T1065 oasc.AbstractZkTestCase.putConfig put /mnt/ssd/jenkins/workspace/Lucene-Solr-4.x-Linux/solr/build/solr-core/test-files/solr/collection1/conf/old_synonyms.txt to /configs/conf1/old_synonyms.txt
[junit4:junit4] 2> 293 T1065 oascc.SolrZkClient.makePath makePath: /configs/conf1/old_synonyms.txt
[junit4:junit4] 2> 294 T1065 oasc.AbstractZkTestCase.putConfig put /mnt/ssd/jenkins/workspace/Lucene-Solr-4.x-Linux/solr/build/solr-core/test-files/solr/collection1/conf/synonyms.txt to /configs/conf1/synonyms.txt
[junit4:junit4] 2> 296 T1065 oascc.SolrZkClient.makePath makePath: /configs/conf1/synonyms.txt
[junit4:junit4] 2> 299 T1070 oazs.PrepRequestProcessor.pRequest Processed session termination for sessionid: 0x13a26facd6c0001
[junit4:junit4] 2> 299 T1074 oaz.ClientCnxn$EventThread.run EventThread shut down
[junit4:junit4] 2> 299 T1067 oazs.NIOServerCnxn.closeSock Closed socket connection for client /127.0.0.1:47287 which had sessionid 0x13a26facd6c0001
[junit4:junit4] 2> 299 T1065 oaz.ZooKeeper.close Session: 0x13a26facd6c0001 closed
[junit4:junit4] 2> 302 T1065 oejs.Server.doStart jetty-8.1.2.v20120308
[junit4:junit4] 2> 306 T1065 oejs.AbstractConnector.doStart Started SocketConnector@0.0.0.0:54527
[junit4:junit4] 2> 307 T1065 oasc.SolrResourceLoader.locateSolrHome JNDI not configured for solr (NoInitialContextEx)
[junit4:junit4] 2> 308 T1065 oasc.SolrResourceLoader.locateSolrHome using system property solr.solr.home: /mnt/ssd/jenkins/workspace/Lucene-Solr-4.x-Linux/solr/build/solr-core/test-files/solr
[junit4:junit4] 2> 308 T1065 oasc.SolrResourceLoader.<init> new SolrResourceLoader for deduced Solr Home: '/mnt/ssd/jenkins/workspace/Lucene-Solr-4.x-Linux/solr/build/solr-core/test-files/solr/'
[junit4:junit4] 2> 322 T1065 oass.SolrDispatchFilter.init SolrDispatchFilter.init()
[junit4:junit4] 2> 322 T1065 oasc.SolrResourceLoader.locateSolrHome JNDI not configured for solr (NoInitialContextEx)
[junit4:junit4] 2> 323 T1065 oasc.SolrResourceLoader.locateSolrHome using system property solr.solr.home: /mnt/ssd/jenkins/workspace/Lucene-Solr-4.x-Linux/solr/build/solr-core/test-files/solr
[junit4:junit4] 2> 324 T1065 oasc.CoreContainer$Initializer.initialize looking for solr.xml: /mnt/ssd/jenkins/workspace/Lucene-Solr-4.x-Linux/solr/build/solr-core/test-files/solr/solr.xml
[junit4:junit4] 2> 324 T1065 oasc.CoreContainer.<init> New CoreContainer 2090615559
[junit4:junit4] 2> 325 T1065 oasc.CoreContainer.load Loading CoreContainer using Solr Home: '/mnt/ssd/jenkins/workspace/Lucene-Solr-4.x-Linux/solr/build/solr-core/test-files/solr/'
[junit4:junit4] 2> 325 T1065 oasc.SolrResourceLoader.<init> new SolrResourceLoader for directory: '/mnt/ssd/jenkins/workspace/Lucene-Solr-4.x-Linux/solr/build/solr-core/test-files/solr/'
[junit4:junit4] 2> 343 T1065 oasc.CoreContainer.load Registering Log Listener
[junit4:junit4] 2> 354 T1065 oasc.CoreContainer.initZooKeeper Zookeeper client=127.0.0.1:57368/solr
[junit4:junit4] 2> 355 T1065 oaz.ZooKeeper.<init> Initiating client connection, connectString=127.0.0.1:57368/solr sessionTimeout=5000 watcher=org.apache.solr.common.cloud.ConnectionManager@5a7adcb0
[junit4:junit4] 2> 356 T1084 oaz.ClientCnxn$SendThread.startConnect Opening socket connection to server /127.0.0.1:57368
[junit4:junit4] 2> 356 T1065 oascc.ConnectionManager.waitForConnected Waiting for client to connect to ZooKeeper
[junit4:junit4] 2> 361 T1067 oazs.NIOServerCnxn$Factory.run Accepted socket connection from /127.0.0.1:47288
[junit4:junit4] 2> 361 T1084 oaz.ClientCnxn$SendThread.primeConnection Socket connection established to localhost.localdomain/127.0.0.1:57368, initiating session
[junit4:junit4] 2> 362 T1067 oazs.NIOServerCnxn.readConnectRequest Client attempting to establish new session at /127.0.0.1:47288
[junit4:junit4] 2> 363 T1069 oazs.NIOServerCnxn.finishSessionInit Established session 0x13a26facd6c0002 with negotiated timeout 5000 for client /127.0.0.1:47288
[junit4:junit4] 2> 363 T1084 oaz.ClientCnxn$SendThread.readConnectResult Session establishment complete on server localhost.localdomain/127.0.0.1:57368, sessionid = 0x13a26facd6c0002, negotiated timeout = 5000
[junit4:junit4] 2> 364 T1085 oascc.ConnectionManager.process Watcher org.apache.solr.common.cloud.ConnectionManager@5a7adcb0 name:ZooKeeperConnection Watcher:127.0.0.1:57368/solr got event WatchedEvent state:SyncConnected type:None path:null path:null type:None
[junit4:junit4] 2> 364 T1065 oascc.ConnectionManager.waitForConnected Client is connected to ZooKeeper
[junit4:junit4] 2> 366 T1070 oazs.PrepRequestProcessor.pRequest Got user-level KeeperException when processing sessionid:0x13a26facd6c0002 type:create cxid:0x2 zxid:0xfffffffffffffffe txntype:unknown reqpath:n/a Error Path:/solr/overseer Error:KeeperErrorCode = NodeExists for /solr/overseer
[junit4:junit4] 2> 367 T1065 oascc.SolrZkClient.makePath makePath: /live_nodes
[junit4:junit4] 2> 370 T1065 oasc.ZkController.createEphemeralLiveNode Register node as live in ZooKeeper:/live_nodes/127.0.0.1:54527_solr
[junit4:junit4] 2> 371 T1070 oazs.PrepRequestProcessor.pRequest Got user-level KeeperException when processing sessionid:0x13a26facd6c0002 type:delete cxid:0x7 zxid:0xfffffffffffffffe txntype:unknown reqpath:n/a Error Path:/solr/live_nodes/127.0.0.1:54527_solr Error:KeeperErrorCode = NoNode for /solr/live_nodes/127.0.0.1:54527_solr
[junit4:junit4] 2> 372 T1065 oascc.SolrZkClient.makePath makePath: /live_nodes/127.0.0.1:54527_solr
[junit4:junit4] 2> 374 T1065 oashc.HttpShardHandlerFactory.getParameter Setting socketTimeout to: 0
[junit4:junit4] 2> 374 T1065 oashc.HttpShardHandlerFactory.getParameter Setting urlScheme to: http://
[junit4:junit4] 2> 375 T1065 oashc.HttpShardHandlerFactory.getParameter Setting connTimeout to: 0
[junit4:junit4] 2> 376 T1065 oashc.HttpShardHandlerFactory.getParameter Setting maxConnectionsPerHost to: 20
[junit4:junit4] 2> 376 T1065 oashc.HttpShardHandlerFactory.getParameter Setting corePoolSize to: 0
[junit4:junit4] 2> 377 T1065 oashc.HttpShardHandlerFactory.getParameter Setting maximumPoolSize to: 2147483647
[junit4:junit4] 2> 378 T1065 oashc.HttpShardHandlerFactory.getParameter Setting maxThreadIdleTime to: 5
[junit4:junit4] 2> 378 T1065 oashc.HttpShardHandlerFactory.getParameter Setting sizeOfQueue to: -1
[junit4:junit4] 2> 379 T1065 oashc.HttpShardHandlerFactory.getParameter Setting fairnessPolicy to: false
[junit4:junit4] 2> 380 T1065 oascsi.HttpClientUtil.createClient Creating new http client, config:maxConnectionsPerHost=20&maxConnections=10000&socketTimeout=0&connTimeout=0&retry=false
[junit4:junit4] 2> 385 T1065 oascc.SolrZkClient.makePath makePath: /overseer_elect/election
[junit4:junit4] 2> 389 T1070 oazs.PrepRequestProcessor.pRequest Got user-level KeeperException when processing sessionid:0x13a26facd6c0002 type:delete cxid:0x15 zxid:0xfffffffffffffffe txntype:unknown reqpath:n/a Error Path:/solr/overseer_elect/leader Error:KeeperErrorCode = NoNode for /solr/overseer_elect/leader
[junit4:junit4] 2> 390 T1065 oascc.SolrZkClient.makePath makePath: /overseer_elect/leader
[junit4:junit4] 2> 392 T1065 oasc.Overseer.start Overseer (id=88426001317232642-127.0.0.1:54527_solr-n_0000000000) starting
[junit4:junit4] 2> 393 T1070 oazs.PrepRequestProcessor.pRequest Got user-level KeeperException when processing sessionid:0x13a26facd6c0002 type:create cxid:0x1a zxid:0xfffffffffffffffe txntype:unknown reqpath:n/a Error Path:/solr/overseer Error:KeeperErrorCode = NodeExists for /solr/overseer
[junit4:junit4] 2> 393 T1070 oazs.PrepRequestProcessor.pRequest Got user-level KeeperException when processing sessionid:0x13a26facd6c0002 type:create cxid:0x1b zxid:0xfffffffffffffffe txntype:unknown reqpath:n/a Error Path:/solr/overseer Error:KeeperErrorCode = NodeExists for /solr/overseer
[junit4:junit4] 2> 394 T1070 oazs.PrepRequestProcessor.pRequest Got user-level KeeperException when processing sessionid:0x13a26facd6c0002 type:create cxid:0x1c zxid:0xfffffffffffffffe txntype:unknown reqpath:n/a Error Path:/solr/overseer Error:KeeperErrorCode = NodeExists for /solr/overseer
[junit4:junit4] 2> 395 T1070 oazs.PrepRequestProcessor.pRequest Got user-level KeeperException when processing sessionid:0x13a26facd6c0002 type:create cxid:0x1d zxid:0xfffffffffffffffe txntype:unknown reqpath:n/a Error Path:/solr/overseer Error:KeeperErrorCode = NodeExists for /solr/overseer
[junit4:junit4] 2> 396 T1087 oasc.OverseerCollectionProcessor.run Process current queue of collection creations
[junit4:junit4] 2> 397 T1065 oascc.SolrZkClient.makePath makePath: /clusterstate.json
[junit4:junit4] 2> 399 T1065 oascc.ZkStateReader.createClusterStateWatchersAndUpdate Updating cluster state from ZooKeeper...
[junit4:junit4] 2> 403 T1086 oasc.Overseer$ClusterStateUpdater.run Starting to work on the main queue
[junit4:junit4] 2> 404 T1065 oasc.CoreContainer.create Creating SolrCore 'collection1' using instanceDir: /mnt/ssd/jenkins/workspace/Lucene-Solr-4.x-Linux/solr/build/solr-core/test-files/solr/collection1
[junit4:junit4] 2> 405 T1065 oasc.ZkController.createCollectionZkNode Check for collection zkNode:control_collection
[junit4:junit4] 2> 406 T1065 oasc.ZkController.createCollectionZkNode Collection zkNode exists
[junit4:junit4] 2> 407 T1065 oasc.ZkController.readConfigName Load collection config from:/collections/control_collection
[junit4:junit4] 2> 410 T1065 oasc.SolrResourceLoader.<init> new SolrResourceLoader for directory: '/mnt/ssd/jenkins/workspace/Lucene-Solr-4.x-Linux/solr/build/solr-core/test-files/solr/collection1/'
[junit4:junit4] 2> 416 T1065 oasc.SolrResourceLoader.replaceClassLoader Adding 'file:/mnt/ssd/jenkins/workspace/Lucene-Solr-4.x-Linux/solr/build/solr-core/test-files/solr/collection1/lib/README' to classloader
[junit4:junit4] 2> 417 T1065 oasc.SolrResourceLoader.replaceClassLoader Adding 'file:/mnt/ssd/jenkins/workspace/Lucene-Solr-4.x-Linux/solr/build/solr-core/test-files/solr/collection1/lib/classes/' to classloader
[junit4:junit4] 2> 448 T1065 oasc.SolrConfig.<init> Using Lucene MatchVersion: LUCENE_41
[junit4:junit4] 2> 482 T1065 oasc.SolrConfig.<init> Loaded SolrConfig: solrconfig.xml
[junit4:junit4] 2> 483 T1065 oass.IndexSchema.readSchema Reading Solr Schema
[junit4:junit4] 2> 487 T1065 oass.IndexSchema.readSchema Schema name=test
[junit4:junit4] 2> 813 T1065 oass.OpenExchangeRatesOrgProvider.init Initialized with rates=open-exchange-rates.json, refreshInterval=1440.
[junit4:junit4] 2> 817 T1065 oass.IndexSchema.readSchema default search field in schema is text
[junit4:junit4] 2> 820 T1065 oass.IndexSchema.readSchema unique key field: id
[junit4:junit4] 2> 827 T1065 oass.FileExchangeRateProvider.reload Reloading exchange rates from file currency.xml
[junit4:junit4] 2> 830 T1065 oass.FileExchangeRateProvider.reload Reloading exchange rates from file currency.xml
[junit4:junit4] 2> 834 T1065 oass.OpenExchangeRatesOrgProvider.reload Reloading exchange rates from open-exchange-rates.json
[junit4:junit4] 2> 834 T1065 oass.OpenExchangeRatesOrgProvider.reload Reloading exchange rates from open-exchange-rates.json
[junit4:junit4] 2> 835 T1065 oasc.SolrCore.<init> [collection1] Opening new SolrCore at /mnt/ssd/jenkins/workspace/Lucene-Solr-4.x-Linux/solr/build/solr-core/test-files/solr/collection1/, dataDir=./org.apache.solr.cloud.BasicDistributedZkTest-1349273701736/control/data/
[junit4:junit4] 2> 836 T1065 oasc.JmxMonitoredMap.<init> JMX monitoring is enabled. Adding Solr mbeans to JMX Server: com.sun.jmx.mbeanserver.JmxMBeanServer@21f19e3
[junit4:junit4] 2> 837 T1065 oasc.SolrCore.getNewIndexDir New index directory detected: old=null new=./org.apache.solr.cloud.BasicDistributedZkTest-1349273701736/control/data/index/
[junit4:junit4] 2> 837 T1065 oasc.SolrCore.initIndex WARNING [collection1] Solr index directory './org.apache.solr.cloud.BasicDistributedZkTest-1349273701736/control/data/index' doesn't exist. Creating new index...
[junit4:junit4] 2> 838 T1065 oasc.CachingDirectoryFactory.get return new directory for /mnt/ssd/jenkins/workspace/Lucene-Solr-4.x-Linux/solr/build/solr-core/test/J1/./org.apache.solr.cloud.BasicDistributedZkTest-1349273701736/control/data/index forceNew:false
[junit4:junit4] 2> 842 T1065 oasc.SolrDeletionPolicy.onCommit SolrDeletionPolicy.onCommit: commits:num=1
[junit4:junit4] 2> commit{dir=NRTCachingDirectory(org.apache.lucene.store.MMapDirectory@/mnt/ssd/jenkins/workspace/Lucene-Solr-4.x-Linux/solr/build/solr-core/test/J1/org.apache.solr.cloud.BasicDistributedZkTest-1349273701736/control/data/index lockFactory=org.apache.lucene.store.NativeFSLockFactory@fdad79b7; maxCacheMB=48.0 maxMergeSizeMB=4.0),segFN=segments_1,generation=1,filenames=[segments_1]
[junit4:junit4] 2> 842 T1065 oasc.SolrDeletionPolicy.updateCommits newest commit = 1
[junit4:junit4] 2> 843 T1065 oasc.SolrCore.initWriters created xml: solr.XMLResponseWriter
[junit4:junit4] 2> 844 T1065 oasup.UpdateRequestProcessorChain.init inserting DistributedUpdateProcessorFactory into updateRequestProcessorChain "dedupe"
[junit4:junit4] 2> 845 T1065 oasup.UpdateRequestProcessorChain.init inserting DistributedUpdateProcessorFactory into updateRequestProcessorChain "dedupe-allfields"
[junit4:junit4] 2> 845 T1065 oasup.UpdateRequestProcessorChain.init inserting DistributedUpdateProcessorFactory into updateRequestProcessorChain "stored_sig"
[junit4:junit4] 2> 846 T1065 oasup.UpdateRequestProcessorChain.init inserting DistributedUpdateProcessorFactory into updateRequestProcessorChain "uniq-fields"
[junit4:junit4] 2> 846 T1065 oasup.UpdateRequestProcessorChain.init inserting DistributedUpdateProcessorFactory into updateRequestProcessorChain "distrib-dup-test-chain-implicit"
[junit4:junit4] 2> 847 T1065 oasc.RequestHandlers.initHandlersFromConfig adding lazy requestHandler: solr.ReplicationHandler
[junit4:junit4] 2> 847 T1065 oasc.RequestHandlers.initHandlersFromConfig created /replication: solr.ReplicationHandler
[junit4:junit4] 2> 848 T1065 oasc.RequestHandlers.initHandlersFromConfig created standard: solr.StandardRequestHandler
[junit4:junit4] 2> 848 T1065 oasc.RequestHandlers.initHandlersFromConfig created /get: solr.RealTimeGetHandler
[junit4:junit4] 2> 849 T1065 oasc.RequestHandlers.initHandlersFromConfig created dismax: solr.SearchHandler
[junit4:junit4] 2> 849 T1065 oasc.RequestHandlers.initHandlersFromConfig created mock: org.apache.solr.core.MockQuerySenderListenerReqHandler
[junit4:junit4] 2> 850 T1065 oasc.RequestHandlers.initHandlersFromConfig created /admin/: org.apache.solr.handler.admin.AdminHandlers
[junit4:junit4] 2> 850 T1065 oasc.RequestHandlers.initHandlersFromConfig created defaults: solr.StandardRequestHandler
[junit4:junit4] 2> 851 T1065 oasc.RequestHandlers.initHandlersFromConfig adding lazy requestHandler: solr.StandardRequestHandler
[junit4:junit4] 2> 851 T1065 oasc.RequestHandlers.initHandlersFromConfig created lazy: solr.StandardRequestHandler
[junit4:junit4] 2> 852 T1065 oasc.RequestHandlers.initHandlersFromConfig created /update: solr.UpdateRequestHandler
[junit4:junit4] 2> 852 T1065 oasc.RequestHandlers.initHandlersFromConfig created /terms: org.apache.solr.handler.component.SearchHandler
[junit4:junit4] 2> 853 T1065 oasc.RequestHandlers.initHandlersFromConfig created spellCheckCompRH: org.apache.solr.handler.component.SearchHandler
[junit4:junit4] 2> 853 T1065 oasc.RequestHandlers.initHandlersFromConfig created spellCheckCompRH_Direct: org.apache.solr.handler.component.SearchHandler
[junit4:junit4] 2> 854 T1065 oasc.RequestHandlers.initHandlersFromConfig created spellCheckWithWordbreak: org.apache.solr.handler.component.SearchHandler
[junit4:junit4] 2> 854 T1065 oasc.RequestHandlers.initHandlersFromConfig created spellCheckWithWordbreak_Direct: org.apache.solr.handler.component.SearchHandler
[junit4:junit4] 2> 855 T1065 oasc.RequestHandlers.initHandlersFromConfig created spellCheckCompRH1: org.apache.solr.handler.component.SearchHandler
[junit4:junit4] 2> 855 T1065 oasc.RequestHandlers.initHandlersFromConfig created tvrh: org.apache.solr.handler.component.SearchHandler
[junit4:junit4] 2> 856 T1065 oasc.RequestHandlers.initHandlersFromConfig created /mlt: solr.MoreLikeThisHandler
[junit4:junit4] 2> 856 T1065 oasc.RequestHandlers.initHandlersFromConfig created /debug/dump: solr.DumpRequestHandler
[junit4:junit4] 2> 857 T1065 oashl.XMLLoader.init xsltCacheLifetimeSeconds=60
[junit4:junit4] 2> 859 T1065 oasc.SolrCore.initDeprecatedSupport WARNING solrconfig.xml uses deprecated <admin/gettableFiles>, Please update your config to use the ShowFileRequestHandler.
[junit4:junit4] 2> 860 T1065 oasc.SolrCore.initDeprecatedSupport WARNING adding ShowFileRequestHandler with hidden files: [OLD_SYNONYMS.TXT, PROTWORDS.TXT, STOPWORDS.TXT, OPEN-EXCHANGE-RATES.JSON, CURRENCY.XML, SCHEMA.XML, SYNONYMS.TXT, MAPPING-ISOLATIN1ACCENT.TXT]
[junit4:junit4] 2> 862 T1065 oass.SolrIndexSearcher.<init> Opening Searcher@7f370cf2 main
[junit4:junit4] 2> 862 T1065 oasu.CommitTracker.<init> Hard AutoCommit: disabled
[junit4:junit4] 2> 863 T1065 oasu.CommitTracker.<init> Soft AutoCommit: disabled
[junit4:junit4] 2> 864 T1065 oashc.SpellCheckComponent.inform Initializing spell checkers
[junit4:junit4] 2> 869 T1065 oass.DirectSolrSpellChecker.init init: {name=direct,classname=DirectSolrSpellChecker,field=lowerfilt,minQueryLength=3}
[junit4:junit4] 2> 888 T1088 oasc.SolrCore.registerSearcher [collection1] Registered new searcher Searcher@7f370cf2 main{StandardDirectoryReader(segments_1:1)}
[junit4:junit4] 2> 891 T1070 oazs.PrepRequestProcessor.pRequest Got user-level KeeperException when processing sessionid:0x13a26facd6c0002 type:create cxid:0x50 zxid:0xfffffffffffffffe txntype:unknown reqpath:n/a Error Path:/solr/overseer/queue Error:KeeperErrorCode = NoNode for /solr/overseer/queue
[junit4:junit4] 2> 892 T1065 oasc.CoreContainer.register registering core: collection1
[junit4:junit4] 2> 893 T1065 oasc.ZkController.register Register shard - core:collection1 address:http://127.0.0.1:54527/solr shardId:control_shard
[junit4:junit4] 2> 893 T1065 oascc.SolrZkClient.makePath makePath: /collections/control_collection/leader_elect/control_shard/election
[junit4:junit4] 2> 897 T1070 oazs.PrepRequestProcessor.pRequest Got user-level KeeperException when processing sessionid:0x13a26facd6c0002 type:delete cxid:0x5f zxid:0xfffffffffffffffe txntype:unknown reqpath:n/a Error Path:/solr/collections/control_collection/leaders Error:KeeperErrorCode = NoNode for /solr/collections/control_collection/leaders
[junit4:junit4] 2> 897 T1065 oasc.ShardLeaderElectionContext.runLeaderProcess Running the leader process.
[junit4:junit4] 2> 898 T1070 oazs.PrepRequestProcessor.pRequest Got user-level KeeperException when processing sessionid:0x13a26facd6c0002 type:create cxid:0x60 zxid:0xfffffffffffffffe txntype:unknown reqpath:n/a Error Path:/solr/overseer Error:KeeperErrorCode = NodeExists for /solr/overseer
[junit4:junit4] 2> 910 T1086 oascc.ZkStateReader.updateClusterState Updating cloud state from ZooKeeper...
[junit4:junit4] 2> 911 T1070 oazs.PrepRequestProcessor.pRequest Got user-level KeeperException when processing sessionid:0x13a26facd6c0002 type:create cxid:0x67 zxid:0xfffffffffffffffe txntype:unknown reqpath:n/a Error Path:/solr/overseer/queue-work Error:KeeperErrorCode = NoNode for /solr/overseer/queue-work
[junit4:junit4] 2> 915 T1085 oascc.ZkStateReader$2.process A cluster state change has occurred - updating...
[junit4:junit4] 2> 1399 T1065 oasc.ShardLeaderElectionContext.waitForReplicasToComeUp Enough replicas found to continue.
[junit4:junit4] 2> 1400 T1065 oasc.ShardLeaderElectionContext.runLeaderProcess I may be the new leader - try and sync
[junit4:junit4] 2> 1400 T1065 oasc.SyncStrategy.sync Sync replicas to http://127.0.0.1:54527/solr/collection1/
[junit4:junit4] 2> 1401 T1065 oasc.SyncStrategy.syncReplicas Sync Success - now sync replicas to me
[junit4:junit4] 2> 1402 T1065 oasc.SyncStrategy.syncToMe http://127.0.0.1:54527/solr/collection1/ has no replicas
[junit4:junit4] 2> 1402 T1065 oasc.ShardLeaderElectionContext.runLeaderProcess I am the new leader: http://127.0.0.1:54527/solr/collection1/
[junit4:junit4] 2> 1402 T1065 oascc.SolrZkClient.makePath makePath: /collections/control_collection/leaders/control_shard
[junit4:junit4] 2> 1405 T1070 oazs.PrepRequestProcessor.pRequest Got user-level KeeperException when processing sessionid:0x13a26facd6c0002 type:create cxid:0x85 zxid:0xfffffffffffffffe txntype:unknown reqpath:n/a Error Path:/solr/overseer Error:KeeperErrorCode = NodeExists for /solr/overseer
[junit4:junit4] 2> 1417 T1086 oascc.ZkStateReader.updateClusterState Updating cloud state from ZooKeeper...
[junit4:junit4] 2> 1420 T1085 oascc.ZkStateReader$2.process A cluster state change has occurred - updating...
[junit4:junit4] 2> 1456 T1065 oasc.ZkController.register We are http://127.0.0.1:54527/solr/collection1/ and leader is http://127.0.0.1:54527/solr/collection1/
[junit4:junit4] 2> 1457 T1065 oasc.ZkController.register No LogReplay needed for core=collection1 baseURL=http://127.0.0.1:54527/solr
[junit4:junit4] 2> 1457 T1065 oasc.ZkController.checkRecovery I am the leader, no recovery necessary
[junit4:junit4] 2> 1458 T1065 oascc.ZkStateReader.updateClusterState Updating cloud state from ZooKeeper...
[junit4:junit4] 2> 1459 T1065 oass.SolrDispatchFilter.init user.dir=/mnt/ssd/jenkins/workspace/Lucene-Solr-4.x-Linux/solr/build/solr-core/test/J1
[junit4:junit4] 2> 1460 T1065 oass.SolrDispatchFilter.init SolrDispatchFilter.init() done
[junit4:junit4] 2> 1460 T1065 oascsi.HttpClientUtil.createClient Creating new http client, config:maxConnections=128&maxConnectionsPerHost=32&followRedirects=false
[junit4:junit4] 2> 1509 T1065 oejs.Server.doStart jetty-8.1.2.v20120308
[junit4:junit4] 2> 1510 T1065 oejs.AbstractConnector.doStart Started SocketConnector@0.0.0.0:59309
[junit4:junit4] 2> 1511 T1065 oasc.SolrResourceLoader.locateSolrHome JNDI not configured for solr (NoInitialContextEx)
[junit4:junit4] 2> 1511 T1065 oasc.SolrResourceLoader.locateSolrHome using system property solr.solr.home: /mnt/ssd/jenkins/workspace/Lucene-Solr-4.x-Linux/solr/build/solr-core/test/J1/./solrtest-jetty1-1349273703195
[junit4:junit4] 2> 1511 T1065 oasc.SolrResourceLoader.<init> new SolrResourceLoader for deduced Solr Home: '/mnt/ssd/jenkins/workspace/Lucene-Solr-4.x-Linux/solr/build/solr-core/test/J1/./solrtest-jetty1-1349273703195/'
[junit4:junit4] 2> 1519 T1065 oass.SolrDispatchFilter.init SolrDispatchFilter.init()
[junit4:junit4] 2> 1520 T1065 oasc.SolrResourceLoader.locateSolrHome JNDI not configured for solr (NoInitialContextEx)
[junit4:junit4] 2> 1520 T1065 oasc.SolrResourceLoader.locateSolrHome using system property solr.solr.home: /mnt/ssd/jenkins/workspace/Lucene-Solr-4.x-Linux/solr/build/solr-core/test/J1/./solrtest-jetty1-1349273703195
[junit4:junit4] 2> 1521 T1065 oasc.CoreContainer$Initializer.initialize looking for solr.xml: /mnt/ssd/jenkins/workspace/Lucene-Solr-4.x-Linux/solr/build/solr-core/test/J1/./solrtest-jetty1-1349273703195/solr.xml
[junit4:junit4] 2> 1521 T1065 oasc.CoreContainer.<init> New CoreContainer 658115913
[junit4:junit4] 2> 1522 T1065 oasc.CoreContainer.load Loading CoreContainer using Solr Home: '/mnt/ssd/jenkins/workspace/Lucene-Solr-4.x-Linux/solr/build/solr-core/test/J1/./solrtest-jetty1-1349273703195/'
[junit4:junit4] 2> 1522 T1065 oasc.SolrResourceLoader.<init> new SolrResourceLoader for directory: '/mnt/ssd/jenkins/workspace/Lucene-Solr-4.x-Linux/solr/build/solr-core/test/J1/./solrtest-jetty1-1349273703195/'
[junit4:junit4] 2> 1533 T1065 oasc.CoreContainer.load Registering Log Listener
[junit4:junit4] 2> 1540 T1065 oasc.CoreContainer.initZooKeeper Zookeeper client=127.0.0.1:57368/solr
[junit4:junit4] 2> 1540 T1065 oaz.ZooKeeper.<init> Initiating client connection, connectString=127.0.0.1:57368/solr sessionTimeout=5000 watcher=org.apache.solr.common.cloud.ConnectionManager@9559110c
[junit4:junit4] 2> 1541 T1098 oaz.ClientCnxn$SendThread.startConnect Opening socket connection to server /127.0.0.1:57368
[junit4:junit4] 2> 1541 T1065 oascc.ConnectionManager.waitForConnected Waiting for client to connect to ZooKeeper
[junit4:junit4] 2> 1542 T1098 oaz.ClientCnxn$SendThread.primeConnection Socket connection established to localhost.localdomain/127.0.0.1:57368, initiating session
[junit4:junit4] 2> 1542 T1067 oazs.NIOServerCnxn$Factory.run Accepted socket connection from /127.0.0.1:47289
[junit4:junit4] 2> 1542 T1067 oazs.NIOServerCnxn.readConnectRequest Client attempting to establish new session at /127.0.0.1:47289
[junit4:junit4] 2> 1544 T1069 oazs.NIOServerCnxn.finishSessionInit Established session 0x13a26facd6c0003 with negotiated timeout 5000 for client /127.0.0.1:47289
[junit4:junit4] 2> 1544 T1098 oaz.ClientCnxn$SendThread.readConnectResult Session establishment complete on server localhost.localdomain/127.0.0.1:57368, sessionid = 0x13a26facd6c0003, negotiated timeout = 5000
[junit4:junit4] 2> 1545 T1099 oascc.ConnectionManager.process Watcher org.apache.solr.common.cloud.ConnectionManager@9559110c name:ZooKeeperConnection Watcher:127.0.0.1:57368/solr got event WatchedEvent state:SyncConnected type:None path:null path:null type:None
[junit4:junit4] 2> 1545 T1065 oascc.ConnectionManager.waitForConnected Client is connected to ZooKeeper
[junit4:junit4] 2> 1545 T1070 oazs.PrepRequestProcessor.pRequest Got user-level KeeperException when processing sessionid:0x13a26facd6c0003 type:create cxid:0x1 zxid:0xfffffffffffffffe txntype:unknown reqpath:n/a Error Path:/solr/overseer Error:KeeperErrorCode = NodeExists for /solr/overseer
[junit4:junit4] 2> 1546 T1070 oazs.PrepRequestProcessor.pRequest Got user-level KeeperException when processing sessionid:0x13a26facd6c0003 type:create cxid:0x2 zxid:0xfffffffffffffffe txntype:unknown reqpath:n/a Error Path:/solr/overseer Error:KeeperErrorCode = NodeExists for /solr/overseer
[junit4:junit4] 2> 1547 T1065 oasc.ZkController.createEphemeralLiveNode Register node as live in ZooKeeper:/live_nodes/127.0.0.1:59309_solr
[junit4:junit4] 2> 1547 T1070 oazs.PrepRequestProcessor.pRequest Got user-level KeeperException when processing sessionid:0x13a26facd6c0003 type:delete cxid:0x4 zxid:0xfffffffffffffffe txntype:unknown reqpath:n/a Error Path:/solr/live_nodes/127.0.0.1:59309_solr Error:KeeperErrorCode = NoNode for /solr/live_nodes/127.0.0.1:59309_solr
[junit4:junit4] 2> 1547 T1065 oascc.SolrZkClient.makePath makePath: /live_nodes/127.0.0.1:59309_solr
[junit4:junit4] 2> 1548 T1085 oascc.ZkStateReader$3.process Updating live nodes
[junit4:junit4] 2> 1549 T1065 oashc.HttpShardHandlerFactory.getParameter Setting socketTimeout to: 0
[junit4:junit4] 2> 1549 T1065 oashc.HttpShardHandlerFactory.getParameter Setting urlScheme to: http://
[junit4:junit4] 2> 1550 T1065 oashc.HttpShardHandlerFactory.getParameter Setting connTimeout to: 0
[junit4:junit4] 2> 1550 T1065 oashc.HttpShardHandlerFactory.getParameter Setting maxConnectionsPerHost to: 20
[junit4:junit4] 2> 1551 T1065 oashc.HttpShardHandlerFactory.getParameter Setting corePoolSize to: 0
[junit4:junit4] 2> 1551 T1065 oashc.HttpShardHandlerFactory.getParameter Setting maximumPoolSize to: 2147483647
[junit4:junit4] 2> 1551 T1065 oashc.HttpShardHandlerFactory.getParameter Setting maxThreadIdleTime to: 5
[junit4:junit4] 2> 1552 T1065 oashc.HttpShardHandlerFactory.getParameter Setting sizeOfQueue to: -1
[junit4:junit4] 2> 1552 T1065 oashc.HttpShardHandlerFactory.getParameter Setting fairnessPolicy to: false
[junit4:junit4] 2> 1553 T1065 oascsi.HttpClientUtil.createClient Creating new http client, config:maxConnectionsPerHost=20&maxConnections=10000&socketTimeout=0&connTimeout=0&retry=false
[junit4:junit4] 2> 1557 T1065 oascc.ZkStateReader.createClusterStateWatchersAndUpdate Updating cluster state from ZooKeeper...
[junit4:junit4] 2> 1560 T1065 oasc.CoreContainer.create Creating SolrCore 'collection1' using instanceDir: /mnt/ssd/jenkins/workspace/Lucene-Solr-4.x-Linux/solr/build/solr-core/test/J1/./solrtest-jetty1-1349273703195/collection1
[junit4:junit4] 2> 1561 T1065 oasc.ZkController.createCollectionZkNode Check for collection zkNode:collection1
[junit4:junit4] 2> 1561 T1065 oasc.ZkController.createCollectionZkNode Collection zkNode exists
[junit4:junit4] 2> 1562 T1065 oasc.ZkController.readConfigName Load collection config from:/collections/collection1
[junit4:junit4] 2> 1563 T1065 oasc.SolrResourceLoader.<init> new SolrResourceLoader for directory: '/mnt/ssd/jenkins/workspace/Lucene-Solr-4.x-Linux/solr/build/solr-core/test/J1/./solrtest-jetty1-1349273703195/collection1/'
[junit4:junit4] 2> 1563 T1065 oasc.SolrResourceLoader.replaceClassLoader Adding 'file:/mnt/ssd/jenkins/workspace/Lucene-Solr-4.x-Linux/solr/build/solr-core/test/J1/solrtest-jetty1-1349273703195/collection1/lib/README' to classloader
[junit4:junit4] 2> 1564 T1065 oasc.SolrResourceLoader.replaceClassLoader Adding 'file:/mnt/ssd/jenkins/workspace/Lucene-Solr-4.x-Linux/solr/build/solr-core/test/J1/solrtest-jetty1-1349273703195/collection1/lib/classes/' to classloader
[junit4:junit4] 2> 1586 T1065 oasc.SolrConfig.<init> Using Lucene MatchVersion: LUCENE_41
[junit4:junit4] 2> 1637 T1065 oasc.SolrConfig.<init> Loaded SolrConfig: solrconfig.xml
[junit4:junit4] 2> 1638 T1065 oass.IndexSchema.readSchema Reading Solr Schema
[junit4:junit4] 2> 1642 T1065 oass.IndexSchema.readSchema Schema name=test
[junit4:junit4] 2> 1922 T1086 oascc.ZkStateReader.updateClusterState Updating cloud state from ZooKeeper...
[junit4:junit4] 2> 1924 T1099 oascc.ZkStateReader$2.process A cluster state change has occurred - updating...
[junit4:junit4] 2> 1925 T1085 oascc.ZkStateReader$2.process A cluster state change has occurred - updating...
[junit4:junit4] 2> 1949 T1065 oass.OpenExchangeRatesOrgProvider.init Initialized with rates=open-exchange-rates.json, refreshInterval=1440.
[junit4:junit4] 2> 1953 T1065 oass.IndexSchema.readSchema default search field in schema is text
[junit4:junit4] 2> 1956 T1065 oass.IndexSchema.readSchema unique key field: id
[junit4:junit4] 2> 1963 T1065 oass.FileExchangeRateProvider.reload Reloading exchange rates from file currency.xml
[junit4:junit4] 2> 1966 T1065 oass.FileExchangeRateProvider.reload Reloading exchange rates from file currency.xml
[junit4:junit4] 2> 1969 T1065 oass.OpenExchangeRatesOrgProvider.reload Reloading exchange rates from open-exchange-rates.json
[junit4:junit4] 2> 1970 T1065 oass.OpenExchangeRatesOrgProvider.reload Reloading exchange rates from open-exchange-rates.json
[junit4:junit4] 2> 1971 T1065 oasc.SolrCore.<init> [collection1] Opening new SolrCore at /mnt/ssd/jenkins/workspace/Lucene-Solr-4.x-Linux/solr/build/solr-core/test/J1/./solrtest-jetty1-1349273703195/collection1/, dataDir=./org.apache.solr.cloud.BasicDistributedZkTest-1349273701736/jetty1/
[junit4:junit4] 2> 1971 T1065 oasc.JmxMonitoredMap.<init> JMX monitoring is enabled. Adding Solr mbeans to JMX Server: com.sun.jmx.mbeanserver.JmxMBeanServer@21f19e3
[junit4:junit4] 2> 1972 T1065 oasc.SolrCore.getNewIndexDir New index directory detected: old=null new=./org.apache.solr.cloud.BasicDistributedZkTest-1349273701736/jetty1/index/
[junit4:junit4] 2> 1973 T1065 oasc.SolrCore.initIndex WARNING [collection1] Solr index directory './org.apache.solr.cloud.BasicDistributedZkTest-1349273701736/jetty1/index' doesn't exist. Creating new index...
[junit4:junit4] 2> 1973 T1065 oasc.CachingDirectoryFactory.get return new directory for /mnt/ssd/jenkins/workspace/Lucene-Solr-4.x-Linux/solr/build/solr-core/test/J1/./org.apache.solr.cloud.BasicDistributedZkTest-1349273701736/jetty1/index forceNew:false
[junit4:junit4] 2> 1977 T1065 oasc.SolrDeletionPolicy.onCommit SolrDeletionPolicy.onCommit: commits:num=1
[junit4:junit4] 2> commit{dir=NRTCachingDirectory(org.apache.lucene.store.MMapDirectory@/mnt/ssd/jenkins/workspace/Lucene-Solr-4.x-Linux/solr/build/solr-core/test/J1/org.apache.solr.cloud.BasicDistributedZkTest-1349273701736/jetty1/index lockFactory=org.apache.lucene.store.NativeFSLockFactory@72b85dc8; maxCacheMB=48.0 maxMergeSizeMB=4.0),segFN=segments_1,generation=1,filenames=[segments_1]
[junit4:junit4] 2> 1977 T1065 oasc.SolrDeletionPolicy.updateCommits newest commit = 1
[junit4:junit4] 2> 1978 T1065 oasc.SolrCore.initWriters created xml: solr.XMLResponseWriter
[junit4:junit4] 2> 1981 T1065 oasup.UpdateRequestProcessorChain.init inserting DistributedUpdateProcessorFactory into updateRequestProcessorChain "dedupe"
[junit4:junit4] 2> 1982 T1065 oasup.UpdateRequestProcessorChain.init inserting DistributedUpdateProcessorFactory into updateRequestProcessorChain "dedupe-allfields"
[junit4:junit4] 2> 1983 T1065 oasup.UpdateRequestProcessorChain.init inserting DistributedUpdateProcessorFactory into updateRequestProcessorChain "stored_sig"
[junit4:junit4] 2> 1984 T1065 oasup.UpdateRequestProcessorChain.init inserting DistributedUpdateProcessorFactory into updateRequestProcessorChain "uniq-fields"
[junit4:junit4] 2> 1985 T1065 oasup.UpdateRequestProcessorChain.init inserting DistributedUpdateProcessorFactory into updateRequestProcessorChain "distrib-dup-test-chain-implicit"
[junit4:junit4] 2> 1985 T1065 oasc.RequestHandlers.initHandlersFromConfig adding lazy requestHandler: solr.ReplicationHandler
[junit4:junit4] 2> 1986 T1065 oasc.RequestHandlers.initHandlersFromConfig created /replication: solr.ReplicationHandler
[junit4:junit4] 2> 1987 T1065 oasc.RequestHandlers.initHandlersFromConfig created standard: solr.StandardRequestHandler
[junit4:junit4] 2> 1987 T1065 oasc.RequestHandlers.initHandlersFromConfig created /get: solr.RealTimeGetHandler
[junit4:junit4] 2> 1988 T1065 oasc.RequestHandlers.initHandlersFromConfig created dismax: solr.SearchHandler
[junit4:junit4] 2> 1988 T1065 oasc.RequestHandlers.initHandlersFromConfig created mock: org.apache.solr.core.MockQuerySenderListenerR
[...truncated too long message...]
ESTED.XML, SOLRCONFIG-MASTER1.XML, SOLRCONFIG-FUNCTIONQUERY.XML, SOLRCONFIG-MASTER3.XML, SOLRCONFIG-UPDATE-PROCESSOR-CHAINS.XML, SOLRCONFIG-ALTDIRECTORY.XML, BAD-SCHEMA-SIM-GLOBAL-VS-FT-MISMATCH.XML, SOLRCONFIG-QUERYSENDER-NOQUERY.XML, BAD-SOLRCONFIG-BOGUS-SCRIPTENGINE-NAME.XML]
[junit4:junit4] 2> 16802 T1905 oass.SolrIndexSearcher.<init> Opening Searcher@132d4d1b main
[junit4:junit4] 2> 16803 T1905 oass.SolrIndexSearcher.getIndexDir WARNING WARNING: Directory impl does not support setting indexDir: org.apache.lucene.store.MockDirectoryWrapper
[junit4:junit4] 2> 16803 T1905 oasu.CommitTracker.<init> Hard AutoCommit: disabled
[junit4:junit4] 2> 16804 T1905 oasu.CommitTracker.<init> Soft AutoCommit: disabled
[junit4:junit4] 2> 16804 T1905 oashc.SpellCheckComponent.inform Initializing spell checkers
[junit4:junit4] 2> 16882 T1905 oass.DirectSolrSpellChecker.init init: {name=direct,classname=DirectSolrSpellChecker,field=lowerfilt,minQueryLength=3}
[junit4:junit4] 2> 16898 T1905 oashc.HttpShardHandlerFactory.getParameter Setting socketTimeout to: 0
[junit4:junit4] 2> 16898 T1905 oashc.HttpShardHandlerFactory.getParameter Setting urlScheme to: http://
[junit4:junit4] 2> 16898 T1905 oashc.HttpShardHandlerFactory.getParameter Setting connTimeout to: 0
[junit4:junit4] 2> 16899 T1905 oashc.HttpShardHandlerFactory.getParameter Setting maxConnectionsPerHost to: 20
[junit4:junit4] 2> 16899 T1905 oashc.HttpShardHandlerFactory.getParameter Setting corePoolSize to: 0
[junit4:junit4] 2> 16900 T1905 oashc.HttpShardHandlerFactory.getParameter Setting maximumPoolSize to: 2147483647
[junit4:junit4] 2> 16900 T1905 oashc.HttpShardHandlerFactory.getParameter Setting maxThreadIdleTime to: 5
[junit4:junit4] 2> 16900 T1905 oashc.HttpShardHandlerFactory.getParameter Setting sizeOfQueue to: -1
[junit4:junit4] 2> 16901 T1905 oashc.HttpShardHandlerFactory.getParameter Setting fairnessPolicy to: false
[junit4:junit4] 2> 16901 T1905 oascsi.HttpClientUtil.createClient Creating new http client, config:maxConnectionsPerHost=20&maxConnections=10000&socketTimeout=0&connTimeout=0&retry=false
[junit4:junit4] 2> 16908 T1912 oasc.SolrCore.registerSearcher [collection1] Registered new searcher Searcher@132d4d1b main{StandardDirectoryReader(segments_1:1)}
[junit4:junit4] 2> 16908 T1905 oasc.CoreContainer.register registering core: collection1
[junit4:junit4] 2> 16909 T1905 oasu.AbstractSolrTestCase.setUp ####SETUP_END testFieldStatisticsResultsStringField
[junit4:junit4] 2> ASYNC NEW_CORE C96 name=collection1 org.apache.solr.core.SolrCore@593f6f92
[junit4:junit4] 2> 16913 T1905 C96 oasc.SolrDeletionPolicy.onInit SolrDeletionPolicy.onInit: commits:num=1
[junit4:junit4] 2> commit{dir=MockDirWrapper(NRTCachingDirectory(org.apache.lucene.store.RAMDirectory@e90cb78a lockFactory=org.apache.lucene.store.NativeFSLockFactory@bab81f07; maxCacheMB=0.982421875 maxMergeSizeMB=0.96875)),segFN=segments_1,generation=1,filenames=[segments_1]
[junit4:junit4] 2> 16913 T1905 C96 oasc.SolrDeletionPolicy.updateCommits newest commit = 1
[junit4:junit4] 2> 16914 T1905 C96 UPDATE [collection1] webapp=null path=null params={} {add=[1]} 0 2
[junit4:junit4] 2> 16919 T1905 C96 UPDATE [collection1] webapp=null path=null params={} {add=[2]} 0 0
[junit4:junit4] 2> 16923 T1905 C96 UPDATE [collection1] webapp=null path=null params={} {add=[3]} 0 0
[junit4:junit4] 2> 16926 T1905 C96 UPDATE [collection1] webapp=null path=null params={} {add=[4]} 0 0
[junit4:junit4] 2> 16929 T1905 C96 oasu.DirectUpdateHandler2.commit start commit{flags=0,_version_=0,optimize=false,openSearcher=true,waitSearcher=true,expungeDeletes=false,softCommit=false}
[junit4:junit4] 2> 16932 T1905 C96 oasc.SolrDeletionPolicy.onCommit SolrDeletionPolicy.onCommit: commits:num=2
[junit4:junit4] 2> commit{dir=MockDirWrapper(NRTCachingDirectory(org.apache.lucene.store.RAMDirectory@e90cb78a lockFactory=org.apache.lucene.store.NativeFSLockFactory@bab81f07; maxCacheMB=0.982421875 maxMergeSizeMB=0.96875)),segFN=segments_1,generation=1,filenames=[segments_1]
[junit4:junit4] 2> commit{dir=MockDirWrapper(NRTCachingDirectory(org.apache.lucene.store.RAMDirectory@e90cb78a lockFactory=org.apache.lucene.store.NativeFSLockFactory@bab81f07; maxCacheMB=0.982421875 maxMergeSizeMB=0.96875)),segFN=segments_2,generation=2,filenames=[_0_MockFixedIntBlock_0.pyl, _0_MockFixedIntBlock_0.frq, _0_MockVariableIntBlock_0.tib, _0.fnm, _0_MockVariableIntBlock_0.tii, _0_MockVariableIntBlock_0.pos, _0_MockFixedIntBlock_0.tib, _0_MockVariableIntBlock_0.doc, _0_MockVariableIntBlock_0.skp, _0_MockFixedIntBlock_0.tii, _0_MockFixedIntBlock_0.pos, _0.si, segments_2, _0_MockFixedIntBlock_0.skp, _0_MockFixedIntBlock_0.doc, _0_MockVariableIntBlock_0.pyl, _0.fdt, _0_MockVariableIntBlock_0.frq, _0.fdx]
[junit4:junit4] 2> 16932 T1905 C96 oasc.SolrDeletionPolicy.updateCommits newest commit = 2
[junit4:junit4] 2> 16933 T1905 C96 oass.SolrIndexSearcher.<init> Opening Searcher@c2171399 main
[junit4:junit4] 2> 16934 T1905 C96 oass.SolrIndexSearcher.getIndexDir WARNING WARNING: Directory impl does not support setting indexDir: org.apache.lucene.store.MockDirectoryWrapper
[junit4:junit4] 2> 16935 T1905 C96 oasu.DirectUpdateHandler2.commit end_commit_flush
[junit4:junit4] 2> 16937 T1912 oasc.SolrCore.registerSearcher [collection1] Registered new searcher Searcher@c2171399 main{StandardDirectoryReader(segments_2:3 _0(4.1):C4)}
[junit4:junit4] 2> 16937 T1905 C96 UPDATE [collection1] webapp=null path=null params={} {commit=} 0 8
[junit4:junit4] 2> 16939 T1905 C96 REQ [collection1] webapp=null path=null params={q=*:*&stats.field=active_s&indent=true&stats=true} hits=4 status=0 QTime=0
[junit4:junit4] 2> 16942 T1905 oasu.AbstractSolrTestCase.tearDown ####TEARDOWN_START testFieldStatisticsResultsStringField
[junit4:junit4] 2> 16942 T1905 oasc.CoreContainer.shutdown Shutting down CoreContainer instance=-2110274494
[junit4:junit4] 2> 16943 T1905 oasc.SolrCore.close [collection1] CLOSING SolrCore org.apache.solr.core.SolrCore@593f6f92
[junit4:junit4] 2> 16949 T1905 oasu.DirectUpdateHandler2.close closing DirectUpdateHandler2{commits=1,autocommits=0,soft autocommits=0,optimizes=0,rollbacks=0,expungeDeletes=0,docsPending=0,adds=0,deletesById=0,deletesByQuery=0,errors=0,cumulative_adds=4,cumulative_deletesById=0,cumulative_deletesByQuery=0,cumulative_errors=0}
[junit4:junit4] 2> 16950 T1905 oasc.SolrCore.decrefSolrCoreState Closing SolrCoreState
[junit4:junit4] 2> 16950 T1905 oasu.DefaultSolrCoreState.closeIndexWriter SolrCoreState ref count has reached 0 - closing IndexWriter
[junit4:junit4] 2> 16950 T1905 oasu.DefaultSolrCoreState.closeIndexWriter closing IndexWriter with IndexWriterCloser
[junit4:junit4] 2> 16951 T1905 oasc.SolrCore.closeSearcher [collection1] Closing main searcher on request.
[junit4:junit4] 2> NOTE: test params are: codec=Lucene40: {active_i=Block(blocksize=128), other_s=Block(blocksize=128), stats_i=MockVariableIntBlock(baseBlockSize=47), foo_ss=MockVariableIntBlock(baseBlockSize=47), active_dt=PostingsFormat(name=Memory doPackFST= false), active_s=MockFixedIntBlock(blockSize=1583), id=MockVariableIntBlock(baseBlockSize=47)}, sim=RandomSimilarityProvider(queryNorm=false,coord=no): {}, locale=cs_CZ, timezone=Asia/Taipei
[junit4:junit4] 2> NOTE: Linux 3.2.0-31-generic amd64/IBM Corporation 1.7.0 (64-bit)/cpus=8,threads=1,free=74052064,total=184483840
[junit4:junit4] 2> NOTE: All tests run in this JVM: [SuggesterTSTTest, TestCSVResponseWriter, TestSolrXMLSerializer, SimplePostToolTest, ClusterStateUpdateTest, TestSurroundQueryParser, TimeZoneUtilsTest, ScriptEngineTest, SignatureUpdateProcessorFactoryTest, TestUpdate, BasicDistributedZk2Test, DOMUtilTest, TestPropInject, TestCSVLoader, HighlighterTest, PeerSyncTest, DebugComponentTest, TestFoldingMultitermQuery, TestPluginEnable, QueryEqualityTest, DistributedQueryElevationComponentTest, LegacyHTMLStripCharFilterTest, PingRequestHandlerTest, CoreContainerCoreInitFailuresTest, FieldMutatingUpdateProcessorTest, PolyFieldTest, StandardRequestHandlerTest, FileUtilsTest, TestMergePolicyConfig, DisMaxRequestHandlerTest, DocumentBuilderTest, TestJmxIntegration, ConvertedLegacyTest, TestOmitPositions, ShowFileRequestHandlerTest, TermVectorComponentTest, SolrInfoMBeanTest, TestPhraseSuggestions, TestCollationKeyRangeQueries, TestHashPartitioner, TestDocumentBuilder, TestArbitraryIndexDir, EchoParamsTest, SpellingQueryConverterTest, UpdateParamsTest, OverseerTest, TestStressLucene, TestPropInjectDefaults, OutputWriterTest, MultiTermTest, ClusterStateTest, TestRTGBase, TestDocSet, SoftAutoCommitTest, TestFastWriter, LukeRequestHandlerTest, BasicDistributedZkTest, RecoveryZkTest, FullSolrCloudDistribCmdsTest, TestReplicationHandler, TestRealTimeGet, TestDistributedSearch, TestExtendedDismaxParser, BasicZkTest, ZkSolrClientTest, StatsComponentTest]
[junit4:junit4] Completed on J1 in 2.92s, 7 tests, 1 error <<< FAILURES!
[...truncated 314 lines...]
BUILD FAILED
/mnt/ssd/jenkins/workspace/Lucene-Solr-4.x-Linux/build.xml:38: The following error occurred while executing this line:
/mnt/ssd/jenkins/workspace/Lucene-Solr-4.x-Linux/solr/build.xml:180: The following error occurred while executing this line:
/mnt/ssd/jenkins/workspace/Lucene-Solr-4.x-Linux/lucene/module-build.xml:61: The following error occurred while executing this line:
/mnt/ssd/jenkins/workspace/Lucene-Solr-4.x-Linux/lucene/common-build.xml:1143: The following error occurred while executing this line:
/mnt/ssd/jenkins/workspace/Lucene-Solr-4.x-Linux/lucene/common-build.xml:816: There were test failures: 231 suites, 959 tests, 5 errors, 7 ignored (2 assumptions)
Total time: 24 minutes 36 seconds
Build step 'Invoke Ant' marked build as failure
Recording test results
Description set: Java: 64bit/ibm-j9-jdk7 -Xjit:exclude={org/apache/lucene/util/fst/FST.pack(IIF)Lorg/apache/lucene/util/fst/FST;}
Email was triggered for: Failure
Sending email for trigger: Failure