You are viewing a plain text version of this content. The canonical link for it is here.
Posted to builds@mesos.apache.org by Apache Jenkins Server <je...@builds.apache.org> on 2019/02/27 05:19:13 UTC

Branch: origin/master Mesos-Buildbot - Build # 6174 - Still Failing

Branch: origin/master

The Apache Jenkins build system has built Mesos-Buildbot (build #6174)

Status: Still Failing

Check console output at https://builds.apache.org/job/Mesos-Buildbot/6174/ to view the results.

1 tests failed.
FAILED:  StorageLocalResourceProviderTest.RetryRpcWithExponentialBackoff

Error Message:
/tmp/SRC/src/tests/storage_local_resource_provider_tests.cpp:5027
Failed to wait 1mins for offers

Stack Trace:
/tmp/SRC/src/tests/storage_local_resource_provider_tests.cpp:5027
Failed to wait 1mins for offers

Branch: origin/master Mesos-Buildbot - Build # 6180 - Still Failing

Posted by Apache Jenkins Server <je...@builds.apache.org>.
Branch: origin/master

The Apache Jenkins build system has built Mesos-Buildbot (build #6180)

Status: Still Failing

Check console output at https://builds.apache.org/job/Mesos-Buildbot/6180/ to view the results.

1 tests failed.
FAILED:  StorageLocalResourceProviderTest.RetryOperationStatusUpdateToScheduler

Error Message:
/tmp/SRC/src/tests/storage_local_resource_provider_tests.cpp:4486
Failed to wait 1mins for offers

Stack Trace:
/tmp/SRC/src/tests/storage_local_resource_provider_tests.cpp:4486
Failed to wait 1mins for offers

Branch: origin/master Mesos-Buildbot - Build # 6179 - Still Failing

Posted by Apache Jenkins Server <je...@builds.apache.org>.
Branch: origin/master

The Apache Jenkins build system has built Mesos-Buildbot (build #6179)

Status: Still Failing

Check console output at https://builds.apache.org/job/Mesos-Buildbot/6179/ to view the results.

All tests passed

Branch: origin/master Mesos-Buildbot - Build # 6178 - Still Failing

Posted by Apache Jenkins Server <je...@builds.apache.org>.
Branch: origin/master

The Apache Jenkins build system has built Mesos-Buildbot (build #6178)

Status: Still Failing

Check console output at https://builds.apache.org/job/Mesos-Buildbot/6178/ to view the results.

1 tests failed.
FAILED:  ExamplesTest.DynamicReservationFramework

Error Message:
../../src/tests/script.cpp:86
Failed
dynamic_reservation_framework_test.sh terminated with signal Aborted (core dumped)

Stack Trace:
../../src/tests/script.cpp:86
Failed
dynamic_reservation_framework_test.sh terminated with signal Aborted (core dumped)

Branch: origin/master Mesos-Buildbot - Build # 6177 - Still Failing

Posted by Apache Jenkins Server <je...@builds.apache.org>.
Branch: origin/master

The Apache Jenkins build system has built Mesos-Buildbot (build #6177)

Status: Still Failing

Check console output at https://builds.apache.org/job/Mesos-Buildbot/6177/ to view the results.

1 tests failed.
FAILED:  ExamplesTest.DynamicReservationFramework

Error Message:
../../../src/tests/script.cpp:86
Failed
dynamic_reservation_framework_test.sh terminated with signal Aborted (core dumped)

Stack Trace:
../../../src/tests/script.cpp:86
Failed
dynamic_reservation_framework_test.sh terminated with signal Aborted (core dumped)

Branch: origin/master Mesos-Buildbot - Build # 6176 - Still Failing

Posted by Apache Jenkins Server <je...@builds.apache.org>.
Branch: origin/master

The Apache Jenkins build system has built Mesos-Buildbot (build #6176)

Status: Still Failing

Check console output at https://builds.apache.org/job/Mesos-Buildbot/6176/ to view the results.

1 tests failed.
FAILED:  ExamplesTest.DynamicReservationFramework

Error Message:
/tmp/SRC/src/tests/script.cpp:86
Failed
dynamic_reservation_framework_test.sh terminated with signal Aborted (core dumped)

Stack Trace:
/tmp/SRC/src/tests/script.cpp:86
Failed
dynamic_reservation_framework_test.sh terminated with signal Aborted (core dumped)