You are viewing a plain text version of this content. The canonical link for it is here.
Posted to dev@ambari.apache.org by Dmitro Lisnichenko <dl...@hortonworks.com> on 2014/10/21 15:49:32 UTC

Review Request 26869: TestActionScheduler fails occasionally on builds.a.o stating expected: but was:

-----------------------------------------------------------
This is an automatically generated e-mail. To reply, visit:
https://reviews.apache.org/r/26869/
-----------------------------------------------------------

Review request for Ambari, Andrew Onischuk and Sid Wagle.


Repository: ambari


Description
-------

Running org.apache.ambari.server.actionmanager.TestActionScheduler
Tests run: 19, Failures: 1, Errors: 0, Skipped: 1, Time elapsed: 3.492 sec <<< FAILURE!


Diffs
-----

  ambari-server/src/test/java/org/apache/ambari/server/actionmanager/TestActionScheduler.java b9a38a4 

Diff: https://reviews.apache.org/r/26869/diff/


Testing
-------

in progress


Thanks,

Dmitro Lisnichenko


Re: Review Request 26869: TestActionScheduler fails occasionally on builds.a.o stating expected: but was:

Posted by Sid Wagle <sw...@hortonworks.com>.
-----------------------------------------------------------
This is an automatically generated e-mail. To reply, visit:
https://reviews.apache.org/r/26869/#review58022
-----------------------------------------------------------

Ship it!


Ship It!

- Sid Wagle


On Oct. 21, 2014, 2:17 p.m., Dmitro Lisnichenko wrote:
> 
> -----------------------------------------------------------
> This is an automatically generated e-mail. To reply, visit:
> https://reviews.apache.org/r/26869/
> -----------------------------------------------------------
> 
> (Updated Oct. 21, 2014, 2:17 p.m.)
> 
> 
> Review request for Ambari, Andrew Onischuk and Sid Wagle.
> 
> 
> Bugs: AMBARI-7828
>     https://issues.apache.org/jira/browse/AMBARI-7828
> 
> 
> Repository: ambari
> 
> 
> Description
> -------
> 
> Running org.apache.ambari.server.actionmanager.TestActionScheduler
> Tests run: 19, Failures: 1, Errors: 0, Skipped: 1, Time elapsed: 3.492 sec <<< FAILURE!
> 
> 
> Diffs
> -----
> 
>   ambari-server/src/test/java/org/apache/ambari/server/actionmanager/TestActionScheduler.java b9a38a4 
> 
> Diff: https://reviews.apache.org/r/26869/diff/
> 
> 
> Testing
> -------
> 
> [INFO] ------------------------------------------------------------------------
> [INFO] Reactor Summary:
> [INFO] 
> [INFO] Ambari Main ....................................... SUCCESS [5.171s]
> [INFO] Apache Ambari Project POM ......................... SUCCESS [0.328s]
> [INFO] Ambari Web ........................................ SUCCESS [43.141s]
> [INFO] Ambari Views ...................................... SUCCESS [3.570s]
> [INFO] Ambari Admin View ................................. SUCCESS [10.413s]
> [INFO] Ambari Server ..................................... SUCCESS [21:01.577s]
> [INFO] Ambari Agent ...................................... SUCCESS [7.637s]
> [INFO] Ambari Client ..................................... SUCCESS [0.042s]
> [INFO] Ambari Python Client .............................. SUCCESS [0.267s]
> [INFO] Ambari Groovy Client .............................. SUCCESS [9.730s]
> [INFO] Ambari Shell ...................................... SUCCESS [0.040s]
> [INFO] Ambari Python Shell ............................... SUCCESS [0.058s]
> [INFO] Ambari Groovy Shell ............................... SUCCESS [6.756s]
> [INFO] ------------------------------------------------------------------------
> [INFO] BUILD SUCCESS
> [INFO] ------------------------------------------------------------------------
> [INFO] Total time: 22:29.476s
> [INFO] Finished at: Tue Oct 21 17:12:41 FET 2014
> [INFO] Final Memory: 46M/201M
> [INFO] ------------------------------------------------------------------------
> 
> 
> Thanks,
> 
> Dmitro Lisnichenko
> 
>


Re: Review Request 26869: TestActionScheduler fails occasionally on builds.a.o stating expected: but was:

Posted by Dmitro Lisnichenko <dl...@hortonworks.com>.
-----------------------------------------------------------
This is an automatically generated e-mail. To reply, visit:
https://reviews.apache.org/r/26869/
-----------------------------------------------------------

(Updated Oct. 21, 2014, 2:17 p.m.)


Review request for Ambari, Andrew Onischuk and Sid Wagle.


Bugs: AMBARI-7828
    https://issues.apache.org/jira/browse/AMBARI-7828


Repository: ambari


Description
-------

Running org.apache.ambari.server.actionmanager.TestActionScheduler
Tests run: 19, Failures: 1, Errors: 0, Skipped: 1, Time elapsed: 3.492 sec <<< FAILURE!


Diffs
-----

  ambari-server/src/test/java/org/apache/ambari/server/actionmanager/TestActionScheduler.java b9a38a4 

Diff: https://reviews.apache.org/r/26869/diff/


Testing (updated)
-------

[INFO] ------------------------------------------------------------------------
[INFO] Reactor Summary:
[INFO] 
[INFO] Ambari Main ....................................... SUCCESS [5.171s]
[INFO] Apache Ambari Project POM ......................... SUCCESS [0.328s]
[INFO] Ambari Web ........................................ SUCCESS [43.141s]
[INFO] Ambari Views ...................................... SUCCESS [3.570s]
[INFO] Ambari Admin View ................................. SUCCESS [10.413s]
[INFO] Ambari Server ..................................... SUCCESS [21:01.577s]
[INFO] Ambari Agent ...................................... SUCCESS [7.637s]
[INFO] Ambari Client ..................................... SUCCESS [0.042s]
[INFO] Ambari Python Client .............................. SUCCESS [0.267s]
[INFO] Ambari Groovy Client .............................. SUCCESS [9.730s]
[INFO] Ambari Shell ...................................... SUCCESS [0.040s]
[INFO] Ambari Python Shell ............................... SUCCESS [0.058s]
[INFO] Ambari Groovy Shell ............................... SUCCESS [6.756s]
[INFO] ------------------------------------------------------------------------
[INFO] BUILD SUCCESS
[INFO] ------------------------------------------------------------------------
[INFO] Total time: 22:29.476s
[INFO] Finished at: Tue Oct 21 17:12:41 FET 2014
[INFO] Final Memory: 46M/201M
[INFO] ------------------------------------------------------------------------


Thanks,

Dmitro Lisnichenko


Re: Review Request 26869: TestActionScheduler fails occasionally on builds.a.o stating expected: but was:

Posted by Andrew Onischuk <ao...@hortonworks.com>.
-----------------------------------------------------------
This is an automatically generated e-mail. To reply, visit:
https://reviews.apache.org/r/26869/#review57576
-----------------------------------------------------------

Ship it!


Ship It!

- Andrew Onischuk


On Oct. 21, 2014, 1:49 p.m., Dmitro Lisnichenko wrote:
> 
> -----------------------------------------------------------
> This is an automatically generated e-mail. To reply, visit:
> https://reviews.apache.org/r/26869/
> -----------------------------------------------------------
> 
> (Updated Oct. 21, 2014, 1:49 p.m.)
> 
> 
> Review request for Ambari, Andrew Onischuk and Sid Wagle.
> 
> 
> Bugs: AMBARI-7828
>     https://issues.apache.org/jira/browse/AMBARI-7828
> 
> 
> Repository: ambari
> 
> 
> Description
> -------
> 
> Running org.apache.ambari.server.actionmanager.TestActionScheduler
> Tests run: 19, Failures: 1, Errors: 0, Skipped: 1, Time elapsed: 3.492 sec <<< FAILURE!
> 
> 
> Diffs
> -----
> 
>   ambari-server/src/test/java/org/apache/ambari/server/actionmanager/TestActionScheduler.java b9a38a4 
> 
> Diff: https://reviews.apache.org/r/26869/diff/
> 
> 
> Testing
> -------
> 
> in progress
> 
> 
> Thanks,
> 
> Dmitro Lisnichenko
> 
>


Re: Review Request 26869: TestActionScheduler fails occasionally on builds.a.o stating expected: but was:

Posted by Dmitro Lisnichenko <dl...@hortonworks.com>.
-----------------------------------------------------------
This is an automatically generated e-mail. To reply, visit:
https://reviews.apache.org/r/26869/
-----------------------------------------------------------

(Updated Oct. 21, 2014, 1:49 p.m.)


Review request for Ambari, Andrew Onischuk and Sid Wagle.


Bugs: AMBARI-7828
    https://issues.apache.org/jira/browse/AMBARI-7828


Repository: ambari


Description
-------

Running org.apache.ambari.server.actionmanager.TestActionScheduler
Tests run: 19, Failures: 1, Errors: 0, Skipped: 1, Time elapsed: 3.492 sec <<< FAILURE!


Diffs
-----

  ambari-server/src/test/java/org/apache/ambari/server/actionmanager/TestActionScheduler.java b9a38a4 

Diff: https://reviews.apache.org/r/26869/diff/


Testing
-------

in progress


Thanks,

Dmitro Lisnichenko