You are viewing a plain text version of this content. The canonical link for it is here.
Posted to builds@cassandra.apache.org by Apache Jenkins Server <je...@builds.apache.org> on 2025/08/29 02:18:28 UTC
Build complete: Cassandra-trunk #2258 [UNSTABLE] f53c0511184cdbae7bbed1aaa68ec955f8f8f27a
-------------------------------------------------------------------------------
Build Cassandra-trunk #2258 Still Unstable
URL: https://ci-cassandra.apache.org/job/Cassandra-trunk/2258/
-------------------------------------------------------------------------------
Changes:
No changes
-------------------------------------------------------------------------------
Failed Tests:
33 tests failed.
FAILED: dtest-large-latest.snitch_test.TestDynamicEndpointSnitch.Tests / dtest-large-latest jdk17 6/6 / test_multidatacenter_local_quorum
FAILED: dtest-latest.materialized_views_test.TestMaterializedViews.Tests / dtest-latest jdk11 36/64 / test_view_metadata_cleanup
FAILED: dtest-upgrade-large.upgrade_tests.upgrade_through_versions_test.TestUpgrade_indev_4_0_x_To_indev_trunk.Tests / dtest-upgrade-large jdk11 8/40 / test_bootstrap_multidc
FAILED: dtest-upgrade-novnode.upgrade_tests.cql_tests.TestCQLNodes2RF1_Upgrade_indev_4_0_x_To_indev_trunk.Tests / dtest-upgrade-novnode jdk11 5/160 / test_empty_in
FAILED: dtest.disk_balance_test.TestDiskBalance.Tests / dtest jdk17 48/64 / test_disk_balance_after_boundary_change_stcs
FAILED: org.apache.cassandra.db.compaction.CompactionsBytemanTest.Tests / test-cdc jdk11 14/20 / testSSTableNotEnoughDiskSpaceForCompactionGetsDropped-cdc_jdk11_x86_64
FAILED: org.apache.cassandra.db.memtable.MemtableSizeOffheapObjectsTest.Tests / test-compression jdk17 8/20 / testSize[skiplist_sharded]-compression_jdk17_x86_64
FAILED: org.apache.cassandra.distributed.test.log.InProgressSequenceCoordinationTest.Tests / jvm-dtest jdk17 12/16 / bootstrapProgressTest-_jdk17_x86_64
FAILED: org.apache.cassandra.distributed.test.log.InProgressSequenceCoordinationTest.Tests / jvm-dtest jdk17 12/16 / decommissionProgressTest-_jdk17_x86_64
FAILED: org.apache.cassandra.distributed.test.log.InProgressSequenceCoordinationTest.Tests / jvm-dtest jdk17 12/16 / inProgressSequenceRetryTest-_jdk17_x86_64
FAILED: org.apache.cassandra.service.accord.serializers.CommandsForKeySerializerTest.Tests / test-cdc jdk11 7/20 / test-cassandra.testtag_IS_UNDEFINED
FAILED: org.apache.cassandra.fuzz.sai.AccordFullSingleNodeSAITest.Tests / jvm-dtest jdk17 13/16 / indexOnlySaiTest-cassandra.testtag_IS_UNDEFINED
FAILED: org.apache.cassandra.fuzz.topology.AccordBootstrapTest.Tests / jvm-dtest jdk11 4/16 / bootstrapFuzzTest-_jdk11_x86_64
FAILED: org.apache.cassandra.service.accord.EpochSyncTest.Tests / test-oa jdk11 17/20 / test-oa_jdk11_x86_64
FAILED: org.apache.cassandra.db.compaction.CompactionAccordIteratorsTest.Tests / test jdk17 9/20 / testAccordCommandsForKeyPurgerSingleCompaction-cassandra.testtag_IS_UNDEFINED
FAILED: org.apache.cassandra.db.compaction.CompactionAccordIteratorsTest.Tests / test-latest jdk11 9/20 / testAccordCommandsForKeyPurgerSingleCompaction-cassandra.testtag_IS_UNDEFINED
FAILED: org.apache.cassandra.service.accord.EpochSyncTest.Tests / test jdk11 17/20 / test-_jdk11_x86_64
FAILED: org.apache.cassandra.service.accord.EpochSyncTest.Tests / test jdk17 17/20 / test-_jdk17_x86_64
FAILED: org.apache.cassandra.service.accord.EpochSyncTest.Tests / test-cdc jdk11 17/20 / test-cdc_jdk11_x86_64
FAILED: org.apache.cassandra.service.accord.EpochSyncTest.Tests / test-cdc jdk17 17/20 / test-cdc_jdk17_x86_64
FAILED: org.apache.cassandra.service.accord.EpochSyncTest.Tests / test-compression jdk11 17/20 / test-compression_jdk11_x86_64
FAILED: org.apache.cassandra.service.accord.EpochSyncTest.Tests / test-compression jdk17 17/20 / test-compression_jdk17_x86_64
FAILED: org.apache.cassandra.service.accord.EpochSyncTest.Tests / test-latest jdk11 17/20 / test-latest_jdk11_x86_64
FAILED: org.apache.cassandra.service.accord.EpochSyncTest.Tests / test-latest jdk17 17/20 / test-latest_jdk17_x86_64
FAILED: org.apache.cassandra.service.accord.EpochSyncTest.Tests / test-oa jdk17 17/20 / test-oa_jdk17_x86_64
FAILED: org.apache.cassandra.service.accord.EpochSyncTest.Tests / test-system-keyspace-directory jdk11 17/20 / test-system_keyspace_directory_jdk11_x86_64
FAILED: org.apache.cassandra.service.accord.EpochSyncTest.Tests / test-system-keyspace-directory jdk17 17/20 / test-system_keyspace_directory_jdk17_x86_64
FAILED: org.apache.cassandra.transport.DriverBurnTest.Tests / test-burn jdk17 1/2 / measureLargeV5-cassandra.testtag_IS_UNDEFINED
FAILED: org.apache.cassandra.simulator.test.AccordHarrySimulationTest.Tests / simulator-dtest jdk11 / test-cassandra.testtag_IS_UNDEFINED
FAILED: org.apache.cassandra.io.sstable.indexsummary.IndexSummaryTest.Tests / test-cdc jdk11 18/20 / testLargeIndexSummary-cassandra.testtag_IS_UNDEFINED
FAILED: org.apache.cassandra.io.sstable.indexsummary.IndexSummaryTest.Tests / test-system-keyspace-directory jdk17 18/20 / testLargeIndexSummary-cassandra.testtag_IS_UNDEFINED
FAILED: org.apache.cassandra.distributed.upgrade.ClusterMetadataUpgradeHarryTest.Tests / jvm-dtest-upgrade jdk11 6/6 / simpleUpgradeTest-cassandra.testtag_IS_UNDEFINED
FAILED: org.apache.cassandra.fuzz.sai.MultiNodeSAITest.Tests / jvm-dtest jdk17 16/16 / indexOnlySaiTest-cassandra.testtag_IS_UNDEFINED
-------------------------------------------------------------------------------
For complete test report and logs see https://nightlies.apache.org/cassandra/Cassandra-trunk/2258/