You are viewing a plain text version of this content. The canonical link for it is here.
Posted to builds@beam.apache.org by Apache Jenkins Server <je...@builds.apache.org> on 2022/09/07 18:37:51 UTC
Build failed in Jenkins: beam_PostCommit_XVR_Samza #1640
See <https://ci-beam.apache.org/job/beam_PostCommit_XVR_Samza/1640/display/redirect?page=changes>
Changes:
[noreply] Bump github.com/lib/pq from 1.10.6 to 1.10.7 in /sdks (#23061)
[noreply] Allowing more flexible precision for TIMESTAMP, DATETIME fields in
[noreply] Reenable run-inference tests on windows (#23044)
[noreply] [BEAM-12164] Support new value capture types NEW_ROW NEW_VALUES for s…
[noreply] Fix example registration input arity (#23059)
[noreply] Clarify inference example docs (#23018)
[noreply] [Playground] [Backend] Datastore queries and mappers to get examples
------------------------------------------
[...truncated 1.30 MB...]
INFO apache_beam.utils.subprocess_server:subprocess_server.py:126 Sep 07, 2022 6:35:33 PM org.apache.beam.sdk.expansion.service.ExpansionService$ExternalTransformRegistrarLoader payloadToConfig
INFO apache_beam.utils.subprocess_server:subprocess_server.py:126 WARNING: Configuration class 'org.apache.beam.sdk.extensions.sql.expansion.ExternalSqlTransformRegistrar$Configuration' has no schema registered. Attempting to construct with setter approach.
INFO apache_beam.utils.subprocess_server:subprocess_server.py:126 Sep 07, 2022 6:35:34 PM org.apache.beam.sdk.expansion.service.ExpansionService$ExternalTransformRegistrarLoader payloadToConfig
INFO apache_beam.utils.subprocess_server:subprocess_server.py:126 WARNING: Configuration class 'org.apache.beam.sdk.extensions.sql.expansion.ExternalSqlTransformRegistrar$Configuration' has no schema registered. Attempting to construct with setter approach.
INFO apache_beam.utils.subprocess_server:subprocess_server.py:126 Sep 07, 2022 6:35:36 PM org.apache.beam.sdk.extensions.sql.impl.CalciteQueryPlanner convertToBeamRel
INFO apache_beam.utils.subprocess_server:subprocess_server.py:126 INFO: SQL:
INFO apache_beam.utils.subprocess_server:subprocess_server.py:126 SELECT `PCOLLECTION`.`a` * `PCOLLECTION`.`a` AS `s`, `LENGTH`(`PCOLLECTION`.`b`) AS `c`
INFO apache_beam.utils.subprocess_server:subprocess_server.py:126 FROM `beam`.`PCOLLECTION` AS `PCOLLECTION`
INFO apache_beam.utils.subprocess_server:subprocess_server.py:126 Sep 07, 2022 6:35:36 PM org.apache.beam.sdk.extensions.sql.impl.CalciteQueryPlanner convertToBeamRel
INFO apache_beam.utils.subprocess_server:subprocess_server.py:126 INFO: SQLPlan>
INFO apache_beam.utils.subprocess_server:subprocess_server.py:126 LogicalProject(s=[*($0, $0)], c=[LENGTH($1)])
INFO apache_beam.utils.subprocess_server:subprocess_server.py:126 BeamIOSourceRel(table=[[beam, PCOLLECTION]])
INFO apache_beam.utils.subprocess_server:subprocess_server.py:126
INFO apache_beam.utils.subprocess_server:subprocess_server.py:126 Sep 07, 2022 6:35:36 PM org.apache.beam.sdk.extensions.sql.impl.CalciteQueryPlanner convertToBeamRel
INFO apache_beam.utils.subprocess_server:subprocess_server.py:126 INFO: BEAMPlan>
INFO apache_beam.utils.subprocess_server:subprocess_server.py:126 BeamCalcRel(expr#0..1=[{inputs}], expr#2=[*($t0, $t0)], expr#3=[LENGTH($t1)], s=[$t2], c=[$t3])
INFO apache_beam.utils.subprocess_server:subprocess_server.py:126 BeamIOSourceRel(table=[[beam, PCOLLECTION]])
INFO apache_beam.utils.subprocess_server:subprocess_server.py:126
INFO root:environments.py:376 Default Python SDK image for environment is apache/beam_python3.7_sdk:2.42.0.dev
INFO root:environments.py:299 No image given, using default Python SDK image
INFO root:environments.py:376 Default Python SDK image for environment is apache/beam_python3.7_sdk:2.42.0.dev
INFO root:environments.py:304 Python SDK container image set to "apache/beam_python3.7_sdk:2.42.0.dev" for Docker environment
INFO apache_beam.runners.portability.fn_api_runner.translations:translations.py:714 ==================== <function pack_combiners at 0x7fa939251cb0> ====================
INFO apache_beam.runners.portability.fn_api_runner.translations:translations.py:714 ==================== <function lift_combiners at 0x7fa939251d40> ====================
INFO apache_beam.runners.portability.fn_api_runner.translations:translations.py:714 ==================== <function sort_stages at 0x7fa9392524d0> ====================
INFO apache_beam.runners.portability.portable_runner:portable_runner.py:583 Job state changed to STOPPED
INFO apache_beam.runners.portability.portable_runner:portable_runner.py:583 Job state changed to STARTING
INFO apache_beam.runners.portability.portable_runner:portable_runner.py:583 Job state changed to RUNNING
INFO apache_beam.runners.portability.portable_runner:portable_runner.py:583 Job state changed to DONE
PASSED [ 66%]
apache_beam/transforms/sql_test.py::SqlTransformTest::test_tagged_join
-------------------------------- live log call ---------------------------------
INFO apache_beam.utils.subprocess_server:subprocess_server.py:239 Using pre-built snapshot at <https://ci-beam.apache.org/job/beam_PostCommit_XVR_Samza/ws/src/sdks/java/extensions/sql/expansion-service/build/libs/beam-sdks-java-extensions-sql-expansion-service-2.42.0-SNAPSHOT.jar>
INFO root:external.py:773 Starting a JAR-based expansion service from JAR <https://ci-beam.apache.org/job/beam_PostCommit_XVR_Samza/ws/src/sdks/java/extensions/sql/expansion-service/build/libs/beam-sdks-java-extensions-sql-expansion-service-2.42.0-SNAPSHOT.jar>
INFO apache_beam.utils.subprocess_server:subprocess_server.py:116 Starting service with ['java' '-jar' '<https://ci-beam.apache.org/job/beam_PostCommit_XVR_Samza/ws/src/sdks/java/extensions/sql/expansion-service/build/libs/beam-sdks-java-extensions-sql-expansion-service-2.42.0-SNAPSHOT.jar'> '54915' '--filesToStage=<https://ci-beam.apache.org/job/beam_PostCommit_XVR_Samza/ws/src/sdks/java/extensions/sql/expansion-service/build/libs/beam-sdks-java-extensions-sql-expansion-service-2.42.0-SNAPSHOT.jar']>
INFO apache_beam.utils.subprocess_server:subprocess_server.py:126 Starting expansion service at localhost:54915
INFO apache_beam.utils.subprocess_server:subprocess_server.py:126 Sep 07, 2022 6:36:03 PM org.apache.beam.sdk.expansion.service.ExpansionService loadRegisteredTransforms
INFO apache_beam.utils.subprocess_server:subprocess_server.py:126 INFO: Registering external transforms: [beam:external:java:sql:v1, beam:transform:org.apache.beam:pubsub_read:v1, beam:transform:org.apache.beam:pubsub_write:v1, beam:transform:org.apache.beam:pubsublite_write:v1, beam:transform:org.apache.beam:pubsublite_read:v1, beam:transform:org.apache.beam:spanner_insert:v1, beam:transform:org.apache.beam:spanner_update:v1, beam:transform:org.apache.beam:spanner_replace:v1, beam:transform:org.apache.beam:spanner_insert_or_update:v1, beam:transform:org.apache.beam:spanner_delete:v1, beam:transform:org.apache.beam:spanner_read:v1, beam:transform:org.apache.beam:kafka_read_with_metadata:v1, beam:transform:org.apache.beam:kafka_read_without_metadata:v1, beam:transform:org.apache.beam:kafka_write:v1, beam:external:java:generate_sequence:v1]
INFO apache_beam.utils.subprocess_server:subprocess_server.py:126 beam:external:java:sql:v1: org.apache.beam.sdk.expansion.service.ExpansionService$ExternalTransformRegistrarLoader$1@47eaca72
INFO apache_beam.utils.subprocess_server:subprocess_server.py:126 beam:transform:org.apache.beam:pubsub_read:v1: org.apache.beam.sdk.expansion.service.ExpansionService$ExternalTransformRegistrarLoader$1@55141def
INFO apache_beam.utils.subprocess_server:subprocess_server.py:126 beam:transform:org.apache.beam:pubsub_write:v1: org.apache.beam.sdk.expansion.service.ExpansionService$ExternalTransformRegistrarLoader$1@55182842
INFO apache_beam.utils.subprocess_server:subprocess_server.py:126 beam:transform:org.apache.beam:pubsublite_write:v1: org.apache.beam.sdk.expansion.service.ExpansionService$ExternalTransformRegistrarLoader$1@3270d194
INFO apache_beam.utils.subprocess_server:subprocess_server.py:126 beam:transform:org.apache.beam:pubsublite_read:v1: org.apache.beam.sdk.expansion.service.ExpansionService$ExternalTransformRegistrarLoader$1@235834f2
INFO apache_beam.utils.subprocess_server:subprocess_server.py:126 beam:transform:org.apache.beam:spanner_insert:v1: org.apache.beam.sdk.expansion.service.ExpansionService$ExternalTransformRegistrarLoader$1@5656be13
INFO apache_beam.utils.subprocess_server:subprocess_server.py:126 beam:transform:org.apache.beam:spanner_update:v1: org.apache.beam.sdk.expansion.service.ExpansionService$ExternalTransformRegistrarLoader$1@4218d6a3
INFO apache_beam.utils.subprocess_server:subprocess_server.py:126 beam:transform:org.apache.beam:spanner_replace:v1: org.apache.beam.sdk.expansion.service.ExpansionService$ExternalTransformRegistrarLoader$1@76505305
INFO apache_beam.utils.subprocess_server:subprocess_server.py:126 beam:transform:org.apache.beam:spanner_insert_or_update:v1: org.apache.beam.sdk.expansion.service.ExpansionService$ExternalTransformRegistrarLoader$1@14cd1699
INFO apache_beam.utils.subprocess_server:subprocess_server.py:126 beam:transform:org.apache.beam:spanner_delete:v1: org.apache.beam.sdk.expansion.service.ExpansionService$ExternalTransformRegistrarLoader$1@77888435
INFO apache_beam.utils.subprocess_server:subprocess_server.py:126 beam:transform:org.apache.beam:spanner_read:v1: org.apache.beam.sdk.expansion.service.ExpansionService$ExternalTransformRegistrarLoader$1@73a1e9a9
INFO apache_beam.utils.subprocess_server:subprocess_server.py:126 beam:transform:org.apache.beam:kafka_read_with_metadata:v1: org.apache.beam.sdk.expansion.service.ExpansionService$ExternalTransformRegistrarLoader$1@71d44a3
INFO apache_beam.utils.subprocess_server:subprocess_server.py:126 beam:transform:org.apache.beam:kafka_read_without_metadata:v1: org.apache.beam.sdk.expansion.service.ExpansionService$ExternalTransformRegistrarLoader$1@7b98f307
INFO apache_beam.utils.subprocess_server:subprocess_server.py:126 beam:transform:org.apache.beam:kafka_write:v1: org.apache.beam.sdk.expansion.service.ExpansionService$ExternalTransformRegistrarLoader$1@4802796d
INFO apache_beam.utils.subprocess_server:subprocess_server.py:126 beam:external:java:generate_sequence:v1: org.apache.beam.sdk.expansion.service.ExpansionService$ExternalTransformRegistrarLoader$1@34123d65
INFO apache_beam.utils.subprocess_server:subprocess_server.py:126 Sep 07, 2022 6:36:04 PM org.apache.beam.sdk.expansion.service.ExpansionService expand
INFO apache_beam.utils.subprocess_server:subprocess_server.py:126 INFO: Expanding 'SqlTransform(beam:external:java:sql:v1)' with URN 'beam:external:java:sql:v1'
INFO apache_beam.utils.subprocess_server:subprocess_server.py:126 Sep 07, 2022 6:36:04 PM org.apache.beam.sdk.expansion.service.ExpansionService$ExternalTransformRegistrarLoader payloadToConfig
INFO apache_beam.utils.subprocess_server:subprocess_server.py:126 WARNING: Configuration class 'org.apache.beam.sdk.extensions.sql.expansion.ExternalSqlTransformRegistrar$Configuration' has no schema registered. Attempting to construct with setter approach.
INFO apache_beam.utils.subprocess_server:subprocess_server.py:126 Sep 07, 2022 6:36:04 PM org.apache.beam.sdk.expansion.service.ExpansionService$ExternalTransformRegistrarLoader payloadToConfig
INFO apache_beam.utils.subprocess_server:subprocess_server.py:126 WARNING: Configuration class 'org.apache.beam.sdk.extensions.sql.expansion.ExternalSqlTransformRegistrar$Configuration' has no schema registered. Attempting to construct with setter approach.
INFO apache_beam.utils.subprocess_server:subprocess_server.py:126 Sep 07, 2022 6:36:06 PM org.apache.beam.sdk.extensions.sql.impl.CalciteQueryPlanner convertToBeamRel
INFO apache_beam.utils.subprocess_server:subprocess_server.py:126 INFO: SQL:
INFO apache_beam.utils.subprocess_server:subprocess_server.py:126 SELECT `simple`.`id` AS `id`, `enrich`.`metadata` AS `metadata`
INFO apache_beam.utils.subprocess_server:subprocess_server.py:126 FROM `beam`.`simple` AS `simple`
INFO apache_beam.utils.subprocess_server:subprocess_server.py:126 INNER JOIN `beam`.`enrich` AS `enrich` ON `simple`.`id` = `enrich`.`id`
INFO apache_beam.utils.subprocess_server:subprocess_server.py:126 Sep 07, 2022 6:36:07 PM org.apache.beam.sdk.extensions.sql.impl.CalciteQueryPlanner convertToBeamRel
INFO apache_beam.utils.subprocess_server:subprocess_server.py:126 INFO: SQLPlan>
INFO apache_beam.utils.subprocess_server:subprocess_server.py:126 LogicalProject(id=[$0], metadata=[$4])
INFO apache_beam.utils.subprocess_server:subprocess_server.py:126 LogicalJoin(condition=[=($0, $3)], joinType=[inner])
INFO apache_beam.utils.subprocess_server:subprocess_server.py:126 BeamIOSourceRel(table=[[beam, simple]])
INFO apache_beam.utils.subprocess_server:subprocess_server.py:126 BeamIOSourceRel(table=[[beam, enrich]])
INFO apache_beam.utils.subprocess_server:subprocess_server.py:126
INFO apache_beam.utils.subprocess_server:subprocess_server.py:126 Sep 07, 2022 6:36:07 PM org.apache.beam.sdk.extensions.sql.impl.CalciteQueryPlanner convertToBeamRel
INFO apache_beam.utils.subprocess_server:subprocess_server.py:126 INFO: BEAMPlan>
INFO apache_beam.utils.subprocess_server:subprocess_server.py:126 BeamCalcRel(expr#0..4=[{inputs}], id=[$t0], metadata=[$t4])
INFO apache_beam.utils.subprocess_server:subprocess_server.py:126 BeamCoGBKJoinRel(condition=[=($0, $3)], joinType=[inner])
INFO apache_beam.utils.subprocess_server:subprocess_server.py:126 BeamIOSourceRel(table=[[beam, simple]])
INFO apache_beam.utils.subprocess_server:subprocess_server.py:126 BeamIOSourceRel(table=[[beam, enrich]])
INFO apache_beam.utils.subprocess_server:subprocess_server.py:126
INFO root:environments.py:376 Default Python SDK image for environment is apache/beam_python3.7_sdk:2.42.0.dev
INFO root:environments.py:299 No image given, using default Python SDK image
INFO root:environments.py:376 Default Python SDK image for environment is apache/beam_python3.7_sdk:2.42.0.dev
INFO root:environments.py:304 Python SDK container image set to "apache/beam_python3.7_sdk:2.42.0.dev" for Docker environment
INFO apache_beam.runners.portability.fn_api_runner.translations:translations.py:714 ==================== <function pack_combiners at 0x7fa939251cb0> ====================
INFO apache_beam.runners.portability.fn_api_runner.translations:translations.py:714 ==================== <function lift_combiners at 0x7fa939251d40> ====================
INFO apache_beam.runners.portability.fn_api_runner.translations:translations.py:714 ==================== <function sort_stages at 0x7fa9392524d0> ====================
INFO apache_beam.runners.portability.portable_runner:portable_runner.py:583 Job state changed to STOPPED
INFO apache_beam.runners.portability.portable_runner:portable_runner.py:583 Job state changed to STARTING
INFO apache_beam.runners.portability.portable_runner:portable_runner.py:583 Job state changed to RUNNING
INFO apache_beam.runners.portability.portable_runner:portable_runner.py:583 Job state changed to DONE
PASSED [ 77%]
apache_beam/transforms/sql_test.py::SqlTransformTest::test_windowing_before_sql
-------------------------------- live log call ---------------------------------
INFO apache_beam.utils.subprocess_server:subprocess_server.py:239 Using pre-built snapshot at <https://ci-beam.apache.org/job/beam_PostCommit_XVR_Samza/ws/src/sdks/java/extensions/sql/expansion-service/build/libs/beam-sdks-java-extensions-sql-expansion-service-2.42.0-SNAPSHOT.jar>
INFO root:external.py:773 Starting a JAR-based expansion service from JAR <https://ci-beam.apache.org/job/beam_PostCommit_XVR_Samza/ws/src/sdks/java/extensions/sql/expansion-service/build/libs/beam-sdks-java-extensions-sql-expansion-service-2.42.0-SNAPSHOT.jar>
INFO apache_beam.utils.subprocess_server:subprocess_server.py:116 Starting service with ['java' '-jar' '<https://ci-beam.apache.org/job/beam_PostCommit_XVR_Samza/ws/src/sdks/java/extensions/sql/expansion-service/build/libs/beam-sdks-java-extensions-sql-expansion-service-2.42.0-SNAPSHOT.jar'> '55237' '--filesToStage=<https://ci-beam.apache.org/job/beam_PostCommit_XVR_Samza/ws/src/sdks/java/extensions/sql/expansion-service/build/libs/beam-sdks-java-extensions-sql-expansion-service-2.42.0-SNAPSHOT.jar']>
INFO apache_beam.utils.subprocess_server:subprocess_server.py:126 Starting expansion service at localhost:55237
INFO apache_beam.utils.subprocess_server:subprocess_server.py:126 Sep 07, 2022 6:36:31 PM org.apache.beam.sdk.expansion.service.ExpansionService loadRegisteredTransforms
INFO apache_beam.utils.subprocess_server:subprocess_server.py:126 INFO: Registering external transforms: [beam:external:java:sql:v1, beam:transform:org.apache.beam:pubsub_read:v1, beam:transform:org.apache.beam:pubsub_write:v1, beam:transform:org.apache.beam:pubsublite_write:v1, beam:transform:org.apache.beam:pubsublite_read:v1, beam:transform:org.apache.beam:spanner_insert:v1, beam:transform:org.apache.beam:spanner_update:v1, beam:transform:org.apache.beam:spanner_replace:v1, beam:transform:org.apache.beam:spanner_insert_or_update:v1, beam:transform:org.apache.beam:spanner_delete:v1, beam:transform:org.apache.beam:spanner_read:v1, beam:transform:org.apache.beam:kafka_read_with_metadata:v1, beam:transform:org.apache.beam:kafka_read_without_metadata:v1, beam:transform:org.apache.beam:kafka_write:v1, beam:external:java:generate_sequence:v1]
INFO apache_beam.utils.subprocess_server:subprocess_server.py:126 beam:external:java:sql:v1: org.apache.beam.sdk.expansion.service.ExpansionService$ExternalTransformRegistrarLoader$1@47eaca72
INFO apache_beam.utils.subprocess_server:subprocess_server.py:126 beam:transform:org.apache.beam:pubsub_read:v1: org.apache.beam.sdk.expansion.service.ExpansionService$ExternalTransformRegistrarLoader$1@55141def
INFO apache_beam.utils.subprocess_server:subprocess_server.py:126 beam:transform:org.apache.beam:pubsub_write:v1: org.apache.beam.sdk.expansion.service.ExpansionService$ExternalTransformRegistrarLoader$1@55182842
INFO apache_beam.utils.subprocess_server:subprocess_server.py:126 beam:transform:org.apache.beam:pubsublite_write:v1: org.apache.beam.sdk.expansion.service.ExpansionService$ExternalTransformRegistrarLoader$1@3270d194
INFO apache_beam.utils.subprocess_server:subprocess_server.py:126 beam:transform:org.apache.beam:pubsublite_read:v1: org.apache.beam.sdk.expansion.service.ExpansionService$ExternalTransformRegistrarLoader$1@235834f2
INFO apache_beam.utils.subprocess_server:subprocess_server.py:126 beam:transform:org.apache.beam:spanner_insert:v1: org.apache.beam.sdk.expansion.service.ExpansionService$ExternalTransformRegistrarLoader$1@5656be13
INFO apache_beam.utils.subprocess_server:subprocess_server.py:126 beam:transform:org.apache.beam:spanner_update:v1: org.apache.beam.sdk.expansion.service.ExpansionService$ExternalTransformRegistrarLoader$1@4218d6a3
INFO apache_beam.utils.subprocess_server:subprocess_server.py:126 beam:transform:org.apache.beam:spanner_replace:v1: org.apache.beam.sdk.expansion.service.ExpansionService$ExternalTransformRegistrarLoader$1@76505305
INFO apache_beam.utils.subprocess_server:subprocess_server.py:126 beam:transform:org.apache.beam:spanner_insert_or_update:v1: org.apache.beam.sdk.expansion.service.ExpansionService$ExternalTransformRegistrarLoader$1@14cd1699
INFO apache_beam.utils.subprocess_server:subprocess_server.py:126 beam:transform:org.apache.beam:spanner_delete:v1: org.apache.beam.sdk.expansion.service.ExpansionService$ExternalTransformRegistrarLoader$1@77888435
INFO apache_beam.utils.subprocess_server:subprocess_server.py:126 beam:transform:org.apache.beam:spanner_read:v1: org.apache.beam.sdk.expansion.service.ExpansionService$ExternalTransformRegistrarLoader$1@73a1e9a9
INFO apache_beam.utils.subprocess_server:subprocess_server.py:126 beam:transform:org.apache.beam:kafka_read_with_metadata:v1: org.apache.beam.sdk.expansion.service.ExpansionService$ExternalTransformRegistrarLoader$1@71d44a3
INFO apache_beam.utils.subprocess_server:subprocess_server.py:126 beam:transform:org.apache.beam:kafka_read_without_metadata:v1: org.apache.beam.sdk.expansion.service.ExpansionService$ExternalTransformRegistrarLoader$1@7b98f307
INFO apache_beam.utils.subprocess_server:subprocess_server.py:126 beam:transform:org.apache.beam:kafka_write:v1: org.apache.beam.sdk.expansion.service.ExpansionService$ExternalTransformRegistrarLoader$1@4802796d
INFO apache_beam.utils.subprocess_server:subprocess_server.py:126 beam:external:java:generate_sequence:v1: org.apache.beam.sdk.expansion.service.ExpansionService$ExternalTransformRegistrarLoader$1@34123d65
INFO apache_beam.utils.subprocess_server:subprocess_server.py:126 Sep 07, 2022 6:36:32 PM org.apache.beam.sdk.expansion.service.ExpansionService expand
INFO apache_beam.utils.subprocess_server:subprocess_server.py:126 INFO: Expanding 'SqlTransform(beam:external:java:sql:v1)' with URN 'beam:external:java:sql:v1'
INFO apache_beam.utils.subprocess_server:subprocess_server.py:126 Sep 07, 2022 6:36:32 PM org.apache.beam.sdk.expansion.service.ExpansionService$ExternalTransformRegistrarLoader payloadToConfig
INFO apache_beam.utils.subprocess_server:subprocess_server.py:126 WARNING: Configuration class 'org.apache.beam.sdk.extensions.sql.expansion.ExternalSqlTransformRegistrar$Configuration' has no schema registered. Attempting to construct with setter approach.
INFO apache_beam.utils.subprocess_server:subprocess_server.py:126 Sep 07, 2022 6:36:33 PM org.apache.beam.sdk.expansion.service.ExpansionService$ExternalTransformRegistrarLoader payloadToConfig
INFO apache_beam.utils.subprocess_server:subprocess_server.py:126 WARNING: Configuration class 'org.apache.beam.sdk.extensions.sql.expansion.ExternalSqlTransformRegistrar$Configuration' has no schema registered. Attempting to construct with setter approach.
INFO apache_beam.utils.subprocess_server:subprocess_server.py:126 Sep 07, 2022 6:36:35 PM org.apache.beam.sdk.extensions.sql.impl.CalciteQueryPlanner convertToBeamRel
INFO apache_beam.utils.subprocess_server:subprocess_server.py:126 INFO: SQL:
INFO apache_beam.utils.subprocess_server:subprocess_server.py:126 SELECT COUNT(*) AS `count`
INFO apache_beam.utils.subprocess_server:subprocess_server.py:126 FROM `beam`.`PCOLLECTION` AS `PCOLLECTION`
INFO apache_beam.utils.subprocess_server:subprocess_server.py:126 Sep 07, 2022 6:36:35 PM org.apache.beam.sdk.extensions.sql.impl.CalciteQueryPlanner convertToBeamRel
INFO apache_beam.utils.subprocess_server:subprocess_server.py:126 INFO: SQLPlan>
INFO apache_beam.utils.subprocess_server:subprocess_server.py:126 LogicalAggregate(group=[{}], count=[COUNT()])
INFO apache_beam.utils.subprocess_server:subprocess_server.py:126 BeamIOSourceRel(table=[[beam, PCOLLECTION]])
INFO apache_beam.utils.subprocess_server:subprocess_server.py:126
INFO apache_beam.utils.subprocess_server:subprocess_server.py:126 Sep 07, 2022 6:36:35 PM org.apache.beam.sdk.extensions.sql.impl.CalciteQueryPlanner convertToBeamRel
INFO apache_beam.utils.subprocess_server:subprocess_server.py:126 INFO: BEAMPlan>
INFO apache_beam.utils.subprocess_server:subprocess_server.py:126 BeamAggregationRel(group=[{}], count=[COUNT()])
INFO apache_beam.utils.subprocess_server:subprocess_server.py:126 BeamIOSourceRel(table=[[beam, PCOLLECTION]])
INFO apache_beam.utils.subprocess_server:subprocess_server.py:126
INFO root:environments.py:376 Default Python SDK image for environment is apache/beam_python3.7_sdk:2.42.0.dev
INFO root:environments.py:299 No image given, using default Python SDK image
INFO root:environments.py:376 Default Python SDK image for environment is apache/beam_python3.7_sdk:2.42.0.dev
INFO root:environments.py:304 Python SDK container image set to "apache/beam_python3.7_sdk:2.42.0.dev" for Docker environment
INFO apache_beam.runners.portability.fn_api_runner.translations:translations.py:714 ==================== <function pack_combiners at 0x7fa939251cb0> ====================
INFO apache_beam.runners.portability.fn_api_runner.translations:translations.py:714 ==================== <function lift_combiners at 0x7fa939251d40> ====================
INFO apache_beam.runners.portability.fn_api_runner.translations:translations.py:714 ==================== <function sort_stages at 0x7fa9392524d0> ====================
INFO apache_beam.runners.portability.portable_runner:portable_runner.py:583 Job state changed to STOPPED
INFO apache_beam.runners.portability.portable_runner:portable_runner.py:583 Job state changed to STARTING
INFO apache_beam.runners.portability.portable_runner:portable_runner.py:583 Job state changed to RUNNING
INFO apache_beam.runners.portability.portable_runner:portable_runner.py:583 Job state changed to DONE
PASSED [ 88%]
apache_beam/transforms/sql_test.py::SqlTransformTest::test_zetasql_generate_data
-------------------------------- live log call ---------------------------------
INFO apache_beam.utils.subprocess_server:subprocess_server.py:239 Using pre-built snapshot at <https://ci-beam.apache.org/job/beam_PostCommit_XVR_Samza/ws/src/sdks/java/extensions/sql/expansion-service/build/libs/beam-sdks-java-extensions-sql-expansion-service-2.42.0-SNAPSHOT.jar>
INFO root:external.py:773 Starting a JAR-based expansion service from JAR <https://ci-beam.apache.org/job/beam_PostCommit_XVR_Samza/ws/src/sdks/java/extensions/sql/expansion-service/build/libs/beam-sdks-java-extensions-sql-expansion-service-2.42.0-SNAPSHOT.jar>
INFO apache_beam.utils.subprocess_server:subprocess_server.py:116 Starting service with ['java' '-jar' '<https://ci-beam.apache.org/job/beam_PostCommit_XVR_Samza/ws/src/sdks/java/extensions/sql/expansion-service/build/libs/beam-sdks-java-extensions-sql-expansion-service-2.42.0-SNAPSHOT.jar'> '59329' '--filesToStage=<https://ci-beam.apache.org/job/beam_PostCommit_XVR_Samza/ws/src/sdks/java/extensions/sql/expansion-service/build/libs/beam-sdks-java-extensions-sql-expansion-service-2.42.0-SNAPSHOT.jar']>
INFO apache_beam.utils.subprocess_server:subprocess_server.py:126 Starting expansion service at localhost:59329
INFO apache_beam.utils.subprocess_server:subprocess_server.py:126 Sep 07, 2022 6:37:02 PM org.apache.beam.sdk.expansion.service.ExpansionService loadRegisteredTransforms
INFO apache_beam.utils.subprocess_server:subprocess_server.py:126 INFO: Registering external transforms: [beam:external:java:sql:v1, beam:transform:org.apache.beam:pubsub_read:v1, beam:transform:org.apache.beam:pubsub_write:v1, beam:transform:org.apache.beam:pubsublite_write:v1, beam:transform:org.apache.beam:pubsublite_read:v1, beam:transform:org.apache.beam:spanner_insert:v1, beam:transform:org.apache.beam:spanner_update:v1, beam:transform:org.apache.beam:spanner_replace:v1, beam:transform:org.apache.beam:spanner_insert_or_update:v1, beam:transform:org.apache.beam:spanner_delete:v1, beam:transform:org.apache.beam:spanner_read:v1, beam:transform:org.apache.beam:kafka_read_with_metadata:v1, beam:transform:org.apache.beam:kafka_read_without_metadata:v1, beam:transform:org.apache.beam:kafka_write:v1, beam:external:java:generate_sequence:v1]
INFO apache_beam.utils.subprocess_server:subprocess_server.py:126 beam:external:java:sql:v1: org.apache.beam.sdk.expansion.service.ExpansionService$ExternalTransformRegistrarLoader$1@47eaca72
INFO apache_beam.utils.subprocess_server:subprocess_server.py:126 beam:transform:org.apache.beam:pubsub_read:v1: org.apache.beam.sdk.expansion.service.ExpansionService$ExternalTransformRegistrarLoader$1@55141def
INFO apache_beam.utils.subprocess_server:subprocess_server.py:126 beam:transform:org.apache.beam:pubsub_write:v1: org.apache.beam.sdk.expansion.service.ExpansionService$ExternalTransformRegistrarLoader$1@55182842
INFO apache_beam.utils.subprocess_server:subprocess_server.py:126 beam:transform:org.apache.beam:pubsublite_write:v1: org.apache.beam.sdk.expansion.service.ExpansionService$ExternalTransformRegistrarLoader$1@3270d194
INFO apache_beam.utils.subprocess_server:subprocess_server.py:126 beam:transform:org.apache.beam:pubsublite_read:v1: org.apache.beam.sdk.expansion.service.ExpansionService$ExternalTransformRegistrarLoader$1@235834f2
INFO apache_beam.utils.subprocess_server:subprocess_server.py:126 beam:transform:org.apache.beam:spanner_insert:v1: org.apache.beam.sdk.expansion.service.ExpansionService$ExternalTransformRegistrarLoader$1@5656be13
INFO apache_beam.utils.subprocess_server:subprocess_server.py:126 beam:transform:org.apache.beam:spanner_update:v1: org.apache.beam.sdk.expansion.service.ExpansionService$ExternalTransformRegistrarLoader$1@4218d6a3
INFO apache_beam.utils.subprocess_server:subprocess_server.py:126 beam:transform:org.apache.beam:spanner_replace:v1: org.apache.beam.sdk.expansion.service.ExpansionService$ExternalTransformRegistrarLoader$1@76505305
INFO apache_beam.utils.subprocess_server:subprocess_server.py:126 beam:transform:org.apache.beam:spanner_insert_or_update:v1: org.apache.beam.sdk.expansion.service.ExpansionService$ExternalTransformRegistrarLoader$1@14cd1699
INFO apache_beam.utils.subprocess_server:subprocess_server.py:126 beam:transform:org.apache.beam:spanner_delete:v1: org.apache.beam.sdk.expansion.service.ExpansionService$ExternalTransformRegistrarLoader$1@77888435
INFO apache_beam.utils.subprocess_server:subprocess_server.py:126 beam:transform:org.apache.beam:spanner_read:v1: org.apache.beam.sdk.expansion.service.ExpansionService$ExternalTransformRegistrarLoader$1@73a1e9a9
INFO apache_beam.utils.subprocess_server:subprocess_server.py:126 beam:transform:org.apache.beam:kafka_read_with_metadata:v1: org.apache.beam.sdk.expansion.service.ExpansionService$ExternalTransformRegistrarLoader$1@71d44a3
INFO apache_beam.utils.subprocess_server:subprocess_server.py:126 beam:transform:org.apache.beam:kafka_read_without_metadata:v1: org.apache.beam.sdk.expansion.service.ExpansionService$ExternalTransformRegistrarLoader$1@7b98f307
INFO apache_beam.utils.subprocess_server:subprocess_server.py:126 beam:transform:org.apache.beam:kafka_write:v1: org.apache.beam.sdk.expansion.service.ExpansionService$ExternalTransformRegistrarLoader$1@4802796d
INFO apache_beam.utils.subprocess_server:subprocess_server.py:126 beam:external:java:generate_sequence:v1: org.apache.beam.sdk.expansion.service.ExpansionService$ExternalTransformRegistrarLoader$1@34123d65
INFO apache_beam.utils.subprocess_server:subprocess_server.py:126 Sep 07, 2022 6:37:05 PM org.apache.beam.sdk.expansion.service.ExpansionService expand
INFO apache_beam.utils.subprocess_server:subprocess_server.py:126 INFO: Expanding 'SqlTransform(beam:external:java:sql:v1)' with URN 'beam:external:java:sql:v1'
INFO apache_beam.utils.subprocess_server:subprocess_server.py:126 Sep 07, 2022 6:37:05 PM org.apache.beam.sdk.expansion.service.ExpansionService$ExternalTransformRegistrarLoader payloadToConfig
INFO apache_beam.utils.subprocess_server:subprocess_server.py:126 WARNING: Configuration class 'org.apache.beam.sdk.extensions.sql.expansion.ExternalSqlTransformRegistrar$Configuration' has no schema registered. Attempting to construct with setter approach.
INFO apache_beam.utils.subprocess_server:subprocess_server.py:126 Sep 07, 2022 6:37:05 PM org.apache.beam.sdk.expansion.service.ExpansionService$ExternalTransformRegistrarLoader payloadToConfig
INFO apache_beam.utils.subprocess_server:subprocess_server.py:126 WARNING: Configuration class 'org.apache.beam.sdk.extensions.sql.expansion.ExternalSqlTransformRegistrar$Configuration' has no schema registered. Attempting to construct with setter approach.
INFO apache_beam.utils.subprocess_server:subprocess_server.py:126 Sep 07, 2022 6:37:08 PM com.google.zetasql.io.grpc.NameResolverRegistry getDefaultRegistry
INFO apache_beam.utils.subprocess_server:subprocess_server.py:126 WARNING: No NameResolverProviders found via ServiceLoader, including for DNS. This is probably due to a broken build. If using ProGuard, check your configuration
INFO apache_beam.utils.subprocess_server:subprocess_server.py:126 Sep 07, 2022 6:37:11 PM org.apache.beam.sdk.extensions.sql.zetasql.ZetaSQLQueryPlanner convertToBeamRelInternal
INFO apache_beam.utils.subprocess_server:subprocess_server.py:126 INFO: BEAMPlan>
INFO apache_beam.utils.subprocess_server:subprocess_server.py:126 BeamZetaSqlCalcRel(expr#0=[{inputs}], expr#1=[1:BIGINT], expr#2=['foo':VARCHAR], expr#3=[3.1400000000000001243E0:DOUBLE], int=[$t1], str=[$t2], flt=[$t3])
INFO apache_beam.utils.subprocess_server:subprocess_server.py:126 BeamValuesRel(tuples=[[{ 0 }]])
INFO apache_beam.utils.subprocess_server:subprocess_server.py:126
INFO root:environments.py:376 Default Python SDK image for environment is apache/beam_python3.7_sdk:2.42.0.dev
INFO root:environments.py:299 No image given, using default Python SDK image
INFO root:environments.py:376 Default Python SDK image for environment is apache/beam_python3.7_sdk:2.42.0.dev
INFO root:environments.py:304 Python SDK container image set to "apache/beam_python3.7_sdk:2.42.0.dev" for Docker environment
INFO apache_beam.runners.portability.fn_api_runner.translations:translations.py:714 ==================== <function pack_combiners at 0x7fa939251cb0> ====================
INFO apache_beam.runners.portability.fn_api_runner.translations:translations.py:714 ==================== <function lift_combiners at 0x7fa939251d40> ====================
INFO apache_beam.runners.portability.fn_api_runner.translations:translations.py:714 ==================== <function sort_stages at 0x7fa9392524d0> ====================
INFO apache_beam.runners.portability.portable_runner:portable_runner.py:583 Job state changed to STOPPED
INFO apache_beam.runners.portability.portable_runner:portable_runner.py:583 Job state changed to STARTING
INFO apache_beam.runners.portability.portable_runner:portable_runner.py:583 Job state changed to RUNNING
INFO apache_beam.runners.portability.portable_runner:portable_runner.py:583 Job state changed to DONE
PASSED [100%]
=============================== warnings summary ===============================
../../build/gradleenv/1922375555/lib/python3.7/site-packages/hdfs/config.py:15
<https://ci-beam.apache.org/job/beam_PostCommit_XVR_Samza/ws/src/build/gradleenv/1922375555/lib/python3.7/site-packages/hdfs/config.py>:15: DeprecationWarning: the imp module is deprecated in favour of importlib; see the module's documentation for alternative uses
from imp import load_source
../../build/gradleenv/1922375555/lib/python3.7/site-packages/google/api_core/grpc_helpers.py:42
<https://ci-beam.apache.org/job/beam_PostCommit_XVR_Samza/ws/src/build/gradleenv/1922375555/lib/python3.7/site-packages/google/api_core/grpc_helpers.py>:42: DeprecationWarning: Support for grpcio-gcp is deprecated. This feature will be
removed from `google-api-core` after January 1, 2024. If you need to
continue to use this feature, please pin to a specific version of
`google-api-core`.
DeprecationWarning,
-- Docs: https://docs.pytest.org/en/stable/how-to/capture-warnings.html
- generated xml file: <https://ci-beam.apache.org/job/beam_PostCommit_XVR_Samza/ws/src/sdks/python/pytest_xlangSqlValidateRunner.xml> -
==== 9 passed, 2 skipped, 6648 deselected, 2 warnings in 277.28s (0:04:37) =====
> Task :runners:samza:job-server:samzaJobServerCleanup
Stopping job server pid: 3380393.
> Task :runners:samza:job-server:validatesCrossLanguageRunnerCleanup
Stopping expansion service pid: 3431980.
Stopping expansion service pid: 3431981.
FAILURE: Build failed with an exception.
* Where:
Build file '<https://ci-beam.apache.org/job/beam_PostCommit_XVR_Samza/ws/src/sdks/go/test/build.gradle'> line: 199
* What went wrong:
Execution failed for task ':runners:samza:job-server:validatesCrossLanguageRunnerGoUsingJava'.
> Process 'command 'sh'' finished with non-zero exit value 1
* Try:
> Run with --stacktrace option to get the stack trace.
> Run with --info or --debug option to get more log output.
* Get more help at https://help.gradle.org
Deprecated Gradle features were used in this build, making it incompatible with Gradle 8.0.
You can use '--warning-mode all' to show the individual deprecation warnings and determine if they come from your own scripts or plugins.
See https://docs.gradle.org/7.5.1/userguide/command_line_interface.html#sec:command_line_warnings
Execution optimizations have been disabled for 1 invalid unit(s) of work during this build to ensure correctness.
Please consult deprecation warnings for more details.
BUILD FAILED in 45m 36s
260 actionable tasks: 179 executed, 69 from cache, 12 up-to-date
Publishing build scan...
https://gradle.com/s/t4esckfxppn5c
Build step 'Invoke Gradle script' changed build result to FAILURE
Build step 'Invoke Gradle script' marked build as failure
---------------------------------------------------------------------
To unsubscribe, e-mail: builds-unsubscribe@beam.apache.org
For additional commands, e-mail: builds-help@beam.apache.org
Jenkins build is back to normal : beam_PostCommit_XVR_Samza #1642
Posted by Apache Jenkins Server <je...@builds.apache.org>.
See <https://ci-beam.apache.org/job/beam_PostCommit_XVR_Samza/1642/display/redirect?page=changes>
---------------------------------------------------------------------
To unsubscribe, e-mail: builds-unsubscribe@beam.apache.org
For additional commands, e-mail: builds-help@beam.apache.org
Build failed in Jenkins: beam_PostCommit_XVR_Samza #1641
Posted by Apache Jenkins Server <je...@builds.apache.org>.
See <https://ci-beam.apache.org/job/beam_PostCommit_XVR_Samza/1641/display/redirect?page=changes>
Changes:
[clementg] allow non-lts jvm version, fallback on java 11 for runner
[clementg] Add a stricter java version method
[clementg] fall back to the nearest lts version
[noreply] Keep stale action from closing issues (#23067)
[noreply] Merge pull request #22996: [BEAM-11205] Update GCP Libraries BOM
------------------------------------------
[...truncated 1.49 MB...]
INFO apache_beam.utils.subprocess_server:subprocess_server.py:126 Sep 08, 2022 12:10:13 AM org.apache.beam.sdk.expansion.service.ExpansionService$ExternalTransformRegistrarLoader payloadToConfig
INFO apache_beam.utils.subprocess_server:subprocess_server.py:126 WARNING: Configuration class 'org.apache.beam.sdk.extensions.sql.expansion.ExternalSqlTransformRegistrar$Configuration' has no schema registered. Attempting to construct with setter approach.
INFO apache_beam.utils.subprocess_server:subprocess_server.py:126 Sep 08, 2022 12:10:14 AM org.apache.beam.sdk.expansion.service.ExpansionService$ExternalTransformRegistrarLoader payloadToConfig
INFO apache_beam.utils.subprocess_server:subprocess_server.py:126 WARNING: Configuration class 'org.apache.beam.sdk.extensions.sql.expansion.ExternalSqlTransformRegistrar$Configuration' has no schema registered. Attempting to construct with setter approach.
INFO apache_beam.utils.subprocess_server:subprocess_server.py:126 Sep 08, 2022 12:10:15 AM org.apache.beam.sdk.extensions.sql.impl.CalciteQueryPlanner convertToBeamRel
INFO apache_beam.utils.subprocess_server:subprocess_server.py:126 INFO: SQL:
INFO apache_beam.utils.subprocess_server:subprocess_server.py:126 SELECT `PCOLLECTION`.`a` * `PCOLLECTION`.`a` AS `s`, `LENGTH`(`PCOLLECTION`.`b`) AS `c`
INFO apache_beam.utils.subprocess_server:subprocess_server.py:126 FROM `beam`.`PCOLLECTION` AS `PCOLLECTION`
INFO apache_beam.utils.subprocess_server:subprocess_server.py:126 Sep 08, 2022 12:10:16 AM org.apache.beam.sdk.extensions.sql.impl.CalciteQueryPlanner convertToBeamRel
INFO apache_beam.utils.subprocess_server:subprocess_server.py:126 INFO: SQLPlan>
INFO apache_beam.utils.subprocess_server:subprocess_server.py:126 LogicalProject(s=[*($0, $0)], c=[LENGTH($1)])
INFO apache_beam.utils.subprocess_server:subprocess_server.py:126 BeamIOSourceRel(table=[[beam, PCOLLECTION]])
INFO apache_beam.utils.subprocess_server:subprocess_server.py:126
INFO apache_beam.utils.subprocess_server:subprocess_server.py:126 Sep 08, 2022 12:10:16 AM org.apache.beam.sdk.extensions.sql.impl.CalciteQueryPlanner convertToBeamRel
INFO apache_beam.utils.subprocess_server:subprocess_server.py:126 INFO: BEAMPlan>
INFO apache_beam.utils.subprocess_server:subprocess_server.py:126 BeamCalcRel(expr#0..1=[{inputs}], expr#2=[*($t0, $t0)], expr#3=[LENGTH($t1)], s=[$t2], c=[$t3])
INFO apache_beam.utils.subprocess_server:subprocess_server.py:126 BeamIOSourceRel(table=[[beam, PCOLLECTION]])
INFO apache_beam.utils.subprocess_server:subprocess_server.py:126
INFO root:environments.py:376 Default Python SDK image for environment is apache/beam_python3.7_sdk:2.42.0.dev
INFO root:environments.py:299 No image given, using default Python SDK image
INFO root:environments.py:376 Default Python SDK image for environment is apache/beam_python3.7_sdk:2.42.0.dev
INFO root:environments.py:304 Python SDK container image set to "apache/beam_python3.7_sdk:2.42.0.dev" for Docker environment
INFO apache_beam.runners.portability.fn_api_runner.translations:translations.py:714 ==================== <function pack_combiners at 0x7f981e7c8cb0> ====================
INFO apache_beam.runners.portability.fn_api_runner.translations:translations.py:714 ==================== <function lift_combiners at 0x7f981e7c8d40> ====================
INFO apache_beam.runners.portability.fn_api_runner.translations:translations.py:714 ==================== <function sort_stages at 0x7f981e7c94d0> ====================
INFO apache_beam.runners.portability.portable_runner:portable_runner.py:583 Job state changed to STOPPED
INFO apache_beam.runners.portability.portable_runner:portable_runner.py:583 Job state changed to STARTING
INFO apache_beam.runners.portability.portable_runner:portable_runner.py:583 Job state changed to RUNNING
INFO apache_beam.runners.portability.portable_runner:portable_runner.py:583 Job state changed to DONE
PASSED [ 66%]
apache_beam/transforms/sql_test.py::SqlTransformTest::test_tagged_join
-------------------------------- live log call ---------------------------------
INFO apache_beam.utils.subprocess_server:subprocess_server.py:239 Using pre-built snapshot at <https://ci-beam.apache.org/job/beam_PostCommit_XVR_Samza/ws/src/sdks/java/extensions/sql/expansion-service/build/libs/beam-sdks-java-extensions-sql-expansion-service-2.42.0-SNAPSHOT.jar>
INFO root:external.py:773 Starting a JAR-based expansion service from JAR <https://ci-beam.apache.org/job/beam_PostCommit_XVR_Samza/ws/src/sdks/java/extensions/sql/expansion-service/build/libs/beam-sdks-java-extensions-sql-expansion-service-2.42.0-SNAPSHOT.jar>
INFO apache_beam.utils.subprocess_server:subprocess_server.py:116 Starting service with ['java' '-jar' '<https://ci-beam.apache.org/job/beam_PostCommit_XVR_Samza/ws/src/sdks/java/extensions/sql/expansion-service/build/libs/beam-sdks-java-extensions-sql-expansion-service-2.42.0-SNAPSHOT.jar'> '52485' '--filesToStage=<https://ci-beam.apache.org/job/beam_PostCommit_XVR_Samza/ws/src/sdks/java/extensions/sql/expansion-service/build/libs/beam-sdks-java-extensions-sql-expansion-service-2.42.0-SNAPSHOT.jar']>
INFO apache_beam.utils.subprocess_server:subprocess_server.py:126 Starting expansion service at localhost:52485
INFO apache_beam.utils.subprocess_server:subprocess_server.py:126 Sep 08, 2022 12:10:35 AM org.apache.beam.sdk.expansion.service.ExpansionService loadRegisteredTransforms
INFO apache_beam.utils.subprocess_server:subprocess_server.py:126 INFO: Registering external transforms: [beam:external:java:sql:v1, beam:transform:org.apache.beam:pubsub_read:v1, beam:transform:org.apache.beam:pubsub_write:v1, beam:transform:org.apache.beam:pubsublite_write:v1, beam:transform:org.apache.beam:pubsublite_read:v1, beam:transform:org.apache.beam:spanner_insert:v1, beam:transform:org.apache.beam:spanner_update:v1, beam:transform:org.apache.beam:spanner_replace:v1, beam:transform:org.apache.beam:spanner_insert_or_update:v1, beam:transform:org.apache.beam:spanner_delete:v1, beam:transform:org.apache.beam:spanner_read:v1, beam:transform:org.apache.beam:kafka_read_with_metadata:v1, beam:transform:org.apache.beam:kafka_read_without_metadata:v1, beam:transform:org.apache.beam:kafka_write:v1, beam:external:java:generate_sequence:v1]
INFO apache_beam.utils.subprocess_server:subprocess_server.py:126 beam:external:java:sql:v1: org.apache.beam.sdk.expansion.service.ExpansionService$ExternalTransformRegistrarLoader$1@47eaca72
INFO apache_beam.utils.subprocess_server:subprocess_server.py:126 beam:transform:org.apache.beam:pubsub_read:v1: org.apache.beam.sdk.expansion.service.ExpansionService$ExternalTransformRegistrarLoader$1@55141def
INFO apache_beam.utils.subprocess_server:subprocess_server.py:126 beam:transform:org.apache.beam:pubsub_write:v1: org.apache.beam.sdk.expansion.service.ExpansionService$ExternalTransformRegistrarLoader$1@55182842
INFO apache_beam.utils.subprocess_server:subprocess_server.py:126 beam:transform:org.apache.beam:pubsublite_write:v1: org.apache.beam.sdk.expansion.service.ExpansionService$ExternalTransformRegistrarLoader$1@3270d194
INFO apache_beam.utils.subprocess_server:subprocess_server.py:126 beam:transform:org.apache.beam:pubsublite_read:v1: org.apache.beam.sdk.expansion.service.ExpansionService$ExternalTransformRegistrarLoader$1@235834f2
INFO apache_beam.utils.subprocess_server:subprocess_server.py:126 beam:transform:org.apache.beam:spanner_insert:v1: org.apache.beam.sdk.expansion.service.ExpansionService$ExternalTransformRegistrarLoader$1@5656be13
INFO apache_beam.utils.subprocess_server:subprocess_server.py:126 beam:transform:org.apache.beam:spanner_update:v1: org.apache.beam.sdk.expansion.service.ExpansionService$ExternalTransformRegistrarLoader$1@4218d6a3
INFO apache_beam.utils.subprocess_server:subprocess_server.py:126 beam:transform:org.apache.beam:spanner_replace:v1: org.apache.beam.sdk.expansion.service.ExpansionService$ExternalTransformRegistrarLoader$1@76505305
INFO apache_beam.utils.subprocess_server:subprocess_server.py:126 beam:transform:org.apache.beam:spanner_insert_or_update:v1: org.apache.beam.sdk.expansion.service.ExpansionService$ExternalTransformRegistrarLoader$1@14cd1699
INFO apache_beam.utils.subprocess_server:subprocess_server.py:126 beam:transform:org.apache.beam:spanner_delete:v1: org.apache.beam.sdk.expansion.service.ExpansionService$ExternalTransformRegistrarLoader$1@77888435
INFO apache_beam.utils.subprocess_server:subprocess_server.py:126 beam:transform:org.apache.beam:spanner_read:v1: org.apache.beam.sdk.expansion.service.ExpansionService$ExternalTransformRegistrarLoader$1@73a1e9a9
INFO apache_beam.utils.subprocess_server:subprocess_server.py:126 beam:transform:org.apache.beam:kafka_read_with_metadata:v1: org.apache.beam.sdk.expansion.service.ExpansionService$ExternalTransformRegistrarLoader$1@71d44a3
INFO apache_beam.utils.subprocess_server:subprocess_server.py:126 beam:transform:org.apache.beam:kafka_read_without_metadata:v1: org.apache.beam.sdk.expansion.service.ExpansionService$ExternalTransformRegistrarLoader$1@7b98f307
INFO apache_beam.utils.subprocess_server:subprocess_server.py:126 beam:transform:org.apache.beam:kafka_write:v1: org.apache.beam.sdk.expansion.service.ExpansionService$ExternalTransformRegistrarLoader$1@4802796d
INFO apache_beam.utils.subprocess_server:subprocess_server.py:126 beam:external:java:generate_sequence:v1: org.apache.beam.sdk.expansion.service.ExpansionService$ExternalTransformRegistrarLoader$1@34123d65
INFO apache_beam.utils.subprocess_server:subprocess_server.py:126 Sep 08, 2022 12:10:36 AM org.apache.beam.sdk.expansion.service.ExpansionService expand
INFO apache_beam.utils.subprocess_server:subprocess_server.py:126 INFO: Expanding 'SqlTransform(beam:external:java:sql:v1)' with URN 'beam:external:java:sql:v1'
INFO apache_beam.utils.subprocess_server:subprocess_server.py:126 Sep 08, 2022 12:10:37 AM org.apache.beam.sdk.expansion.service.ExpansionService$ExternalTransformRegistrarLoader payloadToConfig
INFO apache_beam.utils.subprocess_server:subprocess_server.py:126 WARNING: Configuration class 'org.apache.beam.sdk.extensions.sql.expansion.ExternalSqlTransformRegistrar$Configuration' has no schema registered. Attempting to construct with setter approach.
INFO apache_beam.utils.subprocess_server:subprocess_server.py:126 Sep 08, 2022 12:10:37 AM org.apache.beam.sdk.expansion.service.ExpansionService$ExternalTransformRegistrarLoader payloadToConfig
INFO apache_beam.utils.subprocess_server:subprocess_server.py:126 WARNING: Configuration class 'org.apache.beam.sdk.extensions.sql.expansion.ExternalSqlTransformRegistrar$Configuration' has no schema registered. Attempting to construct with setter approach.
INFO apache_beam.utils.subprocess_server:subprocess_server.py:126 Sep 08, 2022 12:10:38 AM org.apache.beam.sdk.extensions.sql.impl.CalciteQueryPlanner convertToBeamRel
INFO apache_beam.utils.subprocess_server:subprocess_server.py:126 INFO: SQL:
INFO apache_beam.utils.subprocess_server:subprocess_server.py:126 SELECT `simple`.`id` AS `id`, `enrich`.`metadata` AS `metadata`
INFO apache_beam.utils.subprocess_server:subprocess_server.py:126 FROM `beam`.`simple` AS `simple`
INFO apache_beam.utils.subprocess_server:subprocess_server.py:126 INNER JOIN `beam`.`enrich` AS `enrich` ON `simple`.`id` = `enrich`.`id`
INFO apache_beam.utils.subprocess_server:subprocess_server.py:126 Sep 08, 2022 12:10:39 AM org.apache.beam.sdk.extensions.sql.impl.CalciteQueryPlanner convertToBeamRel
INFO apache_beam.utils.subprocess_server:subprocess_server.py:126 INFO: SQLPlan>
INFO apache_beam.utils.subprocess_server:subprocess_server.py:126 LogicalProject(id=[$0], metadata=[$4])
INFO apache_beam.utils.subprocess_server:subprocess_server.py:126 LogicalJoin(condition=[=($0, $3)], joinType=[inner])
INFO apache_beam.utils.subprocess_server:subprocess_server.py:126 BeamIOSourceRel(table=[[beam, simple]])
INFO apache_beam.utils.subprocess_server:subprocess_server.py:126 BeamIOSourceRel(table=[[beam, enrich]])
INFO apache_beam.utils.subprocess_server:subprocess_server.py:126
INFO apache_beam.utils.subprocess_server:subprocess_server.py:126 Sep 08, 2022 12:10:39 AM org.apache.beam.sdk.extensions.sql.impl.CalciteQueryPlanner convertToBeamRel
INFO apache_beam.utils.subprocess_server:subprocess_server.py:126 INFO: BEAMPlan>
INFO apache_beam.utils.subprocess_server:subprocess_server.py:126 BeamCalcRel(expr#0..4=[{inputs}], id=[$t0], metadata=[$t4])
INFO apache_beam.utils.subprocess_server:subprocess_server.py:126 BeamCoGBKJoinRel(condition=[=($0, $3)], joinType=[inner])
INFO apache_beam.utils.subprocess_server:subprocess_server.py:126 BeamIOSourceRel(table=[[beam, simple]])
INFO apache_beam.utils.subprocess_server:subprocess_server.py:126 BeamIOSourceRel(table=[[beam, enrich]])
INFO apache_beam.utils.subprocess_server:subprocess_server.py:126
INFO root:environments.py:376 Default Python SDK image for environment is apache/beam_python3.7_sdk:2.42.0.dev
INFO root:environments.py:299 No image given, using default Python SDK image
INFO root:environments.py:376 Default Python SDK image for environment is apache/beam_python3.7_sdk:2.42.0.dev
INFO root:environments.py:304 Python SDK container image set to "apache/beam_python3.7_sdk:2.42.0.dev" for Docker environment
INFO apache_beam.runners.portability.fn_api_runner.translations:translations.py:714 ==================== <function pack_combiners at 0x7f981e7c8cb0> ====================
INFO apache_beam.runners.portability.fn_api_runner.translations:translations.py:714 ==================== <function lift_combiners at 0x7f981e7c8d40> ====================
INFO apache_beam.runners.portability.fn_api_runner.translations:translations.py:714 ==================== <function sort_stages at 0x7f981e7c94d0> ====================
INFO apache_beam.runners.portability.portable_runner:portable_runner.py:583 Job state changed to STOPPED
INFO apache_beam.runners.portability.portable_runner:portable_runner.py:583 Job state changed to STARTING
INFO apache_beam.runners.portability.portable_runner:portable_runner.py:583 Job state changed to RUNNING
INFO apache_beam.runners.portability.portable_runner:portable_runner.py:583 Job state changed to DONE
PASSED [ 77%]
apache_beam/transforms/sql_test.py::SqlTransformTest::test_windowing_before_sql
-------------------------------- live log call ---------------------------------
INFO apache_beam.utils.subprocess_server:subprocess_server.py:239 Using pre-built snapshot at <https://ci-beam.apache.org/job/beam_PostCommit_XVR_Samza/ws/src/sdks/java/extensions/sql/expansion-service/build/libs/beam-sdks-java-extensions-sql-expansion-service-2.42.0-SNAPSHOT.jar>
INFO root:external.py:773 Starting a JAR-based expansion service from JAR <https://ci-beam.apache.org/job/beam_PostCommit_XVR_Samza/ws/src/sdks/java/extensions/sql/expansion-service/build/libs/beam-sdks-java-extensions-sql-expansion-service-2.42.0-SNAPSHOT.jar>
INFO apache_beam.utils.subprocess_server:subprocess_server.py:116 Starting service with ['java' '-jar' '<https://ci-beam.apache.org/job/beam_PostCommit_XVR_Samza/ws/src/sdks/java/extensions/sql/expansion-service/build/libs/beam-sdks-java-extensions-sql-expansion-service-2.42.0-SNAPSHOT.jar'> '40695' '--filesToStage=<https://ci-beam.apache.org/job/beam_PostCommit_XVR_Samza/ws/src/sdks/java/extensions/sql/expansion-service/build/libs/beam-sdks-java-extensions-sql-expansion-service-2.42.0-SNAPSHOT.jar']>
INFO apache_beam.utils.subprocess_server:subprocess_server.py:126 Starting expansion service at localhost:40695
INFO apache_beam.utils.subprocess_server:subprocess_server.py:126 Sep 08, 2022 12:11:00 AM org.apache.beam.sdk.expansion.service.ExpansionService loadRegisteredTransforms
INFO apache_beam.utils.subprocess_server:subprocess_server.py:126 INFO: Registering external transforms: [beam:external:java:sql:v1, beam:transform:org.apache.beam:pubsub_read:v1, beam:transform:org.apache.beam:pubsub_write:v1, beam:transform:org.apache.beam:pubsublite_write:v1, beam:transform:org.apache.beam:pubsublite_read:v1, beam:transform:org.apache.beam:spanner_insert:v1, beam:transform:org.apache.beam:spanner_update:v1, beam:transform:org.apache.beam:spanner_replace:v1, beam:transform:org.apache.beam:spanner_insert_or_update:v1, beam:transform:org.apache.beam:spanner_delete:v1, beam:transform:org.apache.beam:spanner_read:v1, beam:transform:org.apache.beam:kafka_read_with_metadata:v1, beam:transform:org.apache.beam:kafka_read_without_metadata:v1, beam:transform:org.apache.beam:kafka_write:v1, beam:external:java:generate_sequence:v1]
INFO apache_beam.utils.subprocess_server:subprocess_server.py:126 beam:external:java:sql:v1: org.apache.beam.sdk.expansion.service.ExpansionService$ExternalTransformRegistrarLoader$1@47eaca72
INFO apache_beam.utils.subprocess_server:subprocess_server.py:126 beam:transform:org.apache.beam:pubsub_read:v1: org.apache.beam.sdk.expansion.service.ExpansionService$ExternalTransformRegistrarLoader$1@55141def
INFO apache_beam.utils.subprocess_server:subprocess_server.py:126 beam:transform:org.apache.beam:pubsub_write:v1: org.apache.beam.sdk.expansion.service.ExpansionService$ExternalTransformRegistrarLoader$1@55182842
INFO apache_beam.utils.subprocess_server:subprocess_server.py:126 beam:transform:org.apache.beam:pubsublite_write:v1: org.apache.beam.sdk.expansion.service.ExpansionService$ExternalTransformRegistrarLoader$1@3270d194
INFO apache_beam.utils.subprocess_server:subprocess_server.py:126 beam:transform:org.apache.beam:pubsublite_read:v1: org.apache.beam.sdk.expansion.service.ExpansionService$ExternalTransformRegistrarLoader$1@235834f2
INFO apache_beam.utils.subprocess_server:subprocess_server.py:126 beam:transform:org.apache.beam:spanner_insert:v1: org.apache.beam.sdk.expansion.service.ExpansionService$ExternalTransformRegistrarLoader$1@5656be13
INFO apache_beam.utils.subprocess_server:subprocess_server.py:126 beam:transform:org.apache.beam:spanner_update:v1: org.apache.beam.sdk.expansion.service.ExpansionService$ExternalTransformRegistrarLoader$1@4218d6a3
INFO apache_beam.utils.subprocess_server:subprocess_server.py:126 beam:transform:org.apache.beam:spanner_replace:v1: org.apache.beam.sdk.expansion.service.ExpansionService$ExternalTransformRegistrarLoader$1@76505305
INFO apache_beam.utils.subprocess_server:subprocess_server.py:126 beam:transform:org.apache.beam:spanner_insert_or_update:v1: org.apache.beam.sdk.expansion.service.ExpansionService$ExternalTransformRegistrarLoader$1@14cd1699
INFO apache_beam.utils.subprocess_server:subprocess_server.py:126 beam:transform:org.apache.beam:spanner_delete:v1: org.apache.beam.sdk.expansion.service.ExpansionService$ExternalTransformRegistrarLoader$1@77888435
INFO apache_beam.utils.subprocess_server:subprocess_server.py:126 beam:transform:org.apache.beam:spanner_read:v1: org.apache.beam.sdk.expansion.service.ExpansionService$ExternalTransformRegistrarLoader$1@73a1e9a9
INFO apache_beam.utils.subprocess_server:subprocess_server.py:126 beam:transform:org.apache.beam:kafka_read_with_metadata:v1: org.apache.beam.sdk.expansion.service.ExpansionService$ExternalTransformRegistrarLoader$1@71d44a3
INFO apache_beam.utils.subprocess_server:subprocess_server.py:126 beam:transform:org.apache.beam:kafka_read_without_metadata:v1: org.apache.beam.sdk.expansion.service.ExpansionService$ExternalTransformRegistrarLoader$1@7b98f307
INFO apache_beam.utils.subprocess_server:subprocess_server.py:126 beam:transform:org.apache.beam:kafka_write:v1: org.apache.beam.sdk.expansion.service.ExpansionService$ExternalTransformRegistrarLoader$1@4802796d
INFO apache_beam.utils.subprocess_server:subprocess_server.py:126 beam:external:java:generate_sequence:v1: org.apache.beam.sdk.expansion.service.ExpansionService$ExternalTransformRegistrarLoader$1@34123d65
INFO apache_beam.utils.subprocess_server:subprocess_server.py:126 Sep 08, 2022 12:11:02 AM org.apache.beam.sdk.expansion.service.ExpansionService expand
INFO apache_beam.utils.subprocess_server:subprocess_server.py:126 INFO: Expanding 'SqlTransform(beam:external:java:sql:v1)' with URN 'beam:external:java:sql:v1'
INFO apache_beam.utils.subprocess_server:subprocess_server.py:126 Sep 08, 2022 12:11:02 AM org.apache.beam.sdk.expansion.service.ExpansionService$ExternalTransformRegistrarLoader payloadToConfig
INFO apache_beam.utils.subprocess_server:subprocess_server.py:126 WARNING: Configuration class 'org.apache.beam.sdk.extensions.sql.expansion.ExternalSqlTransformRegistrar$Configuration' has no schema registered. Attempting to construct with setter approach.
INFO apache_beam.utils.subprocess_server:subprocess_server.py:126 Sep 08, 2022 12:11:02 AM org.apache.beam.sdk.expansion.service.ExpansionService$ExternalTransformRegistrarLoader payloadToConfig
INFO apache_beam.utils.subprocess_server:subprocess_server.py:126 WARNING: Configuration class 'org.apache.beam.sdk.extensions.sql.expansion.ExternalSqlTransformRegistrar$Configuration' has no schema registered. Attempting to construct with setter approach.
INFO apache_beam.utils.subprocess_server:subprocess_server.py:126 Sep 08, 2022 12:11:04 AM org.apache.beam.sdk.extensions.sql.impl.CalciteQueryPlanner convertToBeamRel
INFO apache_beam.utils.subprocess_server:subprocess_server.py:126 INFO: SQL:
INFO apache_beam.utils.subprocess_server:subprocess_server.py:126 SELECT COUNT(*) AS `count`
INFO apache_beam.utils.subprocess_server:subprocess_server.py:126 FROM `beam`.`PCOLLECTION` AS `PCOLLECTION`
INFO apache_beam.utils.subprocess_server:subprocess_server.py:126 Sep 08, 2022 12:11:04 AM org.apache.beam.sdk.extensions.sql.impl.CalciteQueryPlanner convertToBeamRel
INFO apache_beam.utils.subprocess_server:subprocess_server.py:126 INFO: SQLPlan>
INFO apache_beam.utils.subprocess_server:subprocess_server.py:126 LogicalAggregate(group=[{}], count=[COUNT()])
INFO apache_beam.utils.subprocess_server:subprocess_server.py:126 BeamIOSourceRel(table=[[beam, PCOLLECTION]])
INFO apache_beam.utils.subprocess_server:subprocess_server.py:126
INFO apache_beam.utils.subprocess_server:subprocess_server.py:126 Sep 08, 2022 12:11:04 AM org.apache.beam.sdk.extensions.sql.impl.CalciteQueryPlanner convertToBeamRel
INFO apache_beam.utils.subprocess_server:subprocess_server.py:126 INFO: BEAMPlan>
INFO apache_beam.utils.subprocess_server:subprocess_server.py:126 BeamAggregationRel(group=[{}], count=[COUNT()])
INFO apache_beam.utils.subprocess_server:subprocess_server.py:126 BeamIOSourceRel(table=[[beam, PCOLLECTION]])
INFO apache_beam.utils.subprocess_server:subprocess_server.py:126
INFO root:environments.py:376 Default Python SDK image for environment is apache/beam_python3.7_sdk:2.42.0.dev
INFO root:environments.py:299 No image given, using default Python SDK image
INFO root:environments.py:376 Default Python SDK image for environment is apache/beam_python3.7_sdk:2.42.0.dev
INFO root:environments.py:304 Python SDK container image set to "apache/beam_python3.7_sdk:2.42.0.dev" for Docker environment
INFO apache_beam.runners.portability.fn_api_runner.translations:translations.py:714 ==================== <function pack_combiners at 0x7f981e7c8cb0> ====================
INFO apache_beam.runners.portability.fn_api_runner.translations:translations.py:714 ==================== <function lift_combiners at 0x7f981e7c8d40> ====================
INFO apache_beam.runners.portability.fn_api_runner.translations:translations.py:714 ==================== <function sort_stages at 0x7f981e7c94d0> ====================
INFO apache_beam.runners.portability.portable_runner:portable_runner.py:583 Job state changed to STOPPED
INFO apache_beam.runners.portability.portable_runner:portable_runner.py:583 Job state changed to STARTING
INFO apache_beam.runners.portability.portable_runner:portable_runner.py:583 Job state changed to RUNNING
INFO apache_beam.runners.portability.portable_runner:portable_runner.py:583 Job state changed to DONE
PASSED [ 88%]
apache_beam/transforms/sql_test.py::SqlTransformTest::test_zetasql_generate_data
-------------------------------- live log call ---------------------------------
INFO apache_beam.utils.subprocess_server:subprocess_server.py:239 Using pre-built snapshot at <https://ci-beam.apache.org/job/beam_PostCommit_XVR_Samza/ws/src/sdks/java/extensions/sql/expansion-service/build/libs/beam-sdks-java-extensions-sql-expansion-service-2.42.0-SNAPSHOT.jar>
INFO root:external.py:773 Starting a JAR-based expansion service from JAR <https://ci-beam.apache.org/job/beam_PostCommit_XVR_Samza/ws/src/sdks/java/extensions/sql/expansion-service/build/libs/beam-sdks-java-extensions-sql-expansion-service-2.42.0-SNAPSHOT.jar>
INFO apache_beam.utils.subprocess_server:subprocess_server.py:116 Starting service with ['java' '-jar' '<https://ci-beam.apache.org/job/beam_PostCommit_XVR_Samza/ws/src/sdks/java/extensions/sql/expansion-service/build/libs/beam-sdks-java-extensions-sql-expansion-service-2.42.0-SNAPSHOT.jar'> '34547' '--filesToStage=<https://ci-beam.apache.org/job/beam_PostCommit_XVR_Samza/ws/src/sdks/java/extensions/sql/expansion-service/build/libs/beam-sdks-java-extensions-sql-expansion-service-2.42.0-SNAPSHOT.jar']>
INFO apache_beam.utils.subprocess_server:subprocess_server.py:126 Starting expansion service at localhost:34547
INFO apache_beam.utils.subprocess_server:subprocess_server.py:126 Sep 08, 2022 12:11:23 AM org.apache.beam.sdk.expansion.service.ExpansionService loadRegisteredTransforms
INFO apache_beam.utils.subprocess_server:subprocess_server.py:126 INFO: Registering external transforms: [beam:external:java:sql:v1, beam:transform:org.apache.beam:pubsub_read:v1, beam:transform:org.apache.beam:pubsub_write:v1, beam:transform:org.apache.beam:pubsublite_write:v1, beam:transform:org.apache.beam:pubsublite_read:v1, beam:transform:org.apache.beam:spanner_insert:v1, beam:transform:org.apache.beam:spanner_update:v1, beam:transform:org.apache.beam:spanner_replace:v1, beam:transform:org.apache.beam:spanner_insert_or_update:v1, beam:transform:org.apache.beam:spanner_delete:v1, beam:transform:org.apache.beam:spanner_read:v1, beam:transform:org.apache.beam:kafka_read_with_metadata:v1, beam:transform:org.apache.beam:kafka_read_without_metadata:v1, beam:transform:org.apache.beam:kafka_write:v1, beam:external:java:generate_sequence:v1]
INFO apache_beam.utils.subprocess_server:subprocess_server.py:126 beam:external:java:sql:v1: org.apache.beam.sdk.expansion.service.ExpansionService$ExternalTransformRegistrarLoader$1@47eaca72
INFO apache_beam.utils.subprocess_server:subprocess_server.py:126 beam:transform:org.apache.beam:pubsub_read:v1: org.apache.beam.sdk.expansion.service.ExpansionService$ExternalTransformRegistrarLoader$1@55141def
INFO apache_beam.utils.subprocess_server:subprocess_server.py:126 beam:transform:org.apache.beam:pubsub_write:v1: org.apache.beam.sdk.expansion.service.ExpansionService$ExternalTransformRegistrarLoader$1@55182842
INFO apache_beam.utils.subprocess_server:subprocess_server.py:126 beam:transform:org.apache.beam:pubsublite_write:v1: org.apache.beam.sdk.expansion.service.ExpansionService$ExternalTransformRegistrarLoader$1@3270d194
INFO apache_beam.utils.subprocess_server:subprocess_server.py:126 beam:transform:org.apache.beam:pubsublite_read:v1: org.apache.beam.sdk.expansion.service.ExpansionService$ExternalTransformRegistrarLoader$1@235834f2
INFO apache_beam.utils.subprocess_server:subprocess_server.py:126 beam:transform:org.apache.beam:spanner_insert:v1: org.apache.beam.sdk.expansion.service.ExpansionService$ExternalTransformRegistrarLoader$1@5656be13
INFO apache_beam.utils.subprocess_server:subprocess_server.py:126 beam:transform:org.apache.beam:spanner_update:v1: org.apache.beam.sdk.expansion.service.ExpansionService$ExternalTransformRegistrarLoader$1@4218d6a3
INFO apache_beam.utils.subprocess_server:subprocess_server.py:126 beam:transform:org.apache.beam:spanner_replace:v1: org.apache.beam.sdk.expansion.service.ExpansionService$ExternalTransformRegistrarLoader$1@76505305
INFO apache_beam.utils.subprocess_server:subprocess_server.py:126 beam:transform:org.apache.beam:spanner_insert_or_update:v1: org.apache.beam.sdk.expansion.service.ExpansionService$ExternalTransformRegistrarLoader$1@14cd1699
INFO apache_beam.utils.subprocess_server:subprocess_server.py:126 beam:transform:org.apache.beam:spanner_delete:v1: org.apache.beam.sdk.expansion.service.ExpansionService$ExternalTransformRegistrarLoader$1@77888435
INFO apache_beam.utils.subprocess_server:subprocess_server.py:126 beam:transform:org.apache.beam:spanner_read:v1: org.apache.beam.sdk.expansion.service.ExpansionService$ExternalTransformRegistrarLoader$1@73a1e9a9
INFO apache_beam.utils.subprocess_server:subprocess_server.py:126 beam:transform:org.apache.beam:kafka_read_with_metadata:v1: org.apache.beam.sdk.expansion.service.ExpansionService$ExternalTransformRegistrarLoader$1@71d44a3
INFO apache_beam.utils.subprocess_server:subprocess_server.py:126 beam:transform:org.apache.beam:kafka_read_without_metadata:v1: org.apache.beam.sdk.expansion.service.ExpansionService$ExternalTransformRegistrarLoader$1@7b98f307
INFO apache_beam.utils.subprocess_server:subprocess_server.py:126 beam:transform:org.apache.beam:kafka_write:v1: org.apache.beam.sdk.expansion.service.ExpansionService$ExternalTransformRegistrarLoader$1@4802796d
INFO apache_beam.utils.subprocess_server:subprocess_server.py:126 beam:external:java:generate_sequence:v1: org.apache.beam.sdk.expansion.service.ExpansionService$ExternalTransformRegistrarLoader$1@34123d65
INFO apache_beam.utils.subprocess_server:subprocess_server.py:126 Sep 08, 2022 12:11:24 AM org.apache.beam.sdk.expansion.service.ExpansionService expand
INFO apache_beam.utils.subprocess_server:subprocess_server.py:126 INFO: Expanding 'SqlTransform(beam:external:java:sql:v1)' with URN 'beam:external:java:sql:v1'
INFO apache_beam.utils.subprocess_server:subprocess_server.py:126 Sep 08, 2022 12:11:25 AM org.apache.beam.sdk.expansion.service.ExpansionService$ExternalTransformRegistrarLoader payloadToConfig
INFO apache_beam.utils.subprocess_server:subprocess_server.py:126 WARNING: Configuration class 'org.apache.beam.sdk.extensions.sql.expansion.ExternalSqlTransformRegistrar$Configuration' has no schema registered. Attempting to construct with setter approach.
INFO apache_beam.utils.subprocess_server:subprocess_server.py:126 Sep 08, 2022 12:11:25 AM org.apache.beam.sdk.expansion.service.ExpansionService$ExternalTransformRegistrarLoader payloadToConfig
INFO apache_beam.utils.subprocess_server:subprocess_server.py:126 WARNING: Configuration class 'org.apache.beam.sdk.extensions.sql.expansion.ExternalSqlTransformRegistrar$Configuration' has no schema registered. Attempting to construct with setter approach.
INFO apache_beam.utils.subprocess_server:subprocess_server.py:126 Sep 08, 2022 12:11:27 AM com.google.zetasql.io.grpc.NameResolverRegistry getDefaultRegistry
INFO apache_beam.utils.subprocess_server:subprocess_server.py:126 WARNING: No NameResolverProviders found via ServiceLoader, including for DNS. This is probably due to a broken build. If using ProGuard, check your configuration
INFO apache_beam.utils.subprocess_server:subprocess_server.py:126 Sep 08, 2022 12:11:28 AM org.apache.beam.sdk.extensions.sql.zetasql.ZetaSQLQueryPlanner convertToBeamRelInternal
INFO apache_beam.utils.subprocess_server:subprocess_server.py:126 INFO: BEAMPlan>
INFO apache_beam.utils.subprocess_server:subprocess_server.py:126 BeamZetaSqlCalcRel(expr#0=[{inputs}], expr#1=[1:BIGINT], expr#2=['foo':VARCHAR], expr#3=[3.1400000000000001243E0:DOUBLE], int=[$t1], str=[$t2], flt=[$t3])
INFO apache_beam.utils.subprocess_server:subprocess_server.py:126 BeamValuesRel(tuples=[[{ 0 }]])
INFO apache_beam.utils.subprocess_server:subprocess_server.py:126
INFO root:environments.py:376 Default Python SDK image for environment is apache/beam_python3.7_sdk:2.42.0.dev
INFO root:environments.py:299 No image given, using default Python SDK image
INFO root:environments.py:376 Default Python SDK image for environment is apache/beam_python3.7_sdk:2.42.0.dev
INFO root:environments.py:304 Python SDK container image set to "apache/beam_python3.7_sdk:2.42.0.dev" for Docker environment
INFO apache_beam.runners.portability.fn_api_runner.translations:translations.py:714 ==================== <function pack_combiners at 0x7f981e7c8cb0> ====================
INFO apache_beam.runners.portability.fn_api_runner.translations:translations.py:714 ==================== <function lift_combiners at 0x7f981e7c8d40> ====================
INFO apache_beam.runners.portability.fn_api_runner.translations:translations.py:714 ==================== <function sort_stages at 0x7f981e7c94d0> ====================
INFO apache_beam.runners.portability.portable_runner:portable_runner.py:583 Job state changed to STOPPED
INFO apache_beam.runners.portability.portable_runner:portable_runner.py:583 Job state changed to STARTING
INFO apache_beam.runners.portability.portable_runner:portable_runner.py:583 Job state changed to RUNNING
INFO apache_beam.runners.portability.portable_runner:portable_runner.py:583 Job state changed to DONE
PASSED [100%]
=============================== warnings summary ===============================
../../build/gradleenv/1922375555/lib/python3.7/site-packages/hdfs/config.py:15
<https://ci-beam.apache.org/job/beam_PostCommit_XVR_Samza/ws/src/build/gradleenv/1922375555/lib/python3.7/site-packages/hdfs/config.py>:15: DeprecationWarning: the imp module is deprecated in favour of importlib; see the module's documentation for alternative uses
from imp import load_source
../../build/gradleenv/1922375555/lib/python3.7/site-packages/google/api_core/grpc_helpers.py:42
<https://ci-beam.apache.org/job/beam_PostCommit_XVR_Samza/ws/src/build/gradleenv/1922375555/lib/python3.7/site-packages/google/api_core/grpc_helpers.py>:42: DeprecationWarning: Support for grpcio-gcp is deprecated. This feature will be
removed from `google-api-core` after January 1, 2024. If you need to
continue to use this feature, please pin to a specific version of
`google-api-core`.
DeprecationWarning,
-- Docs: https://docs.pytest.org/en/stable/how-to/capture-warnings.html
- generated xml file: <https://ci-beam.apache.org/job/beam_PostCommit_XVR_Samza/ws/src/sdks/python/pytest_xlangSqlValidateRunner.xml> -
==== 9 passed, 2 skipped, 6648 deselected, 2 warnings in 220.53s (0:03:40) =====
> Task :runners:samza:job-server:samzaJobServerCleanup
Stopping job server pid: 3297418.
> Task :runners:samza:job-server:validatesCrossLanguageRunnerCleanup
Stopping expansion service pid: 3300582.
Stopping expansion service pid: 3300583.
FAILURE: Build failed with an exception.
* Where:
Build file '<https://ci-beam.apache.org/job/beam_PostCommit_XVR_Samza/ws/src/sdks/go/test/build.gradle'> line: 199
* What went wrong:
Execution failed for task ':runners:samza:job-server:validatesCrossLanguageRunnerGoUsingJava'.
> Process 'command 'sh'' finished with non-zero exit value 1
* Try:
> Run with --stacktrace option to get the stack trace.
> Run with --info or --debug option to get more log output.
* Get more help at https://help.gradle.org
Deprecated Gradle features were used in this build, making it incompatible with Gradle 8.0.
You can use '--warning-mode all' to show the individual deprecation warnings and determine if they come from your own scripts or plugins.
See https://docs.gradle.org/7.5.1/userguide/command_line_interface.html#sec:command_line_warnings
Execution optimizations have been disabled for 1 invalid unit(s) of work during this build to ensure correctness.
Please consult deprecation warnings for more details.
BUILD FAILED in 29m 25s
260 actionable tasks: 203 executed, 48 from cache, 9 up-to-date
Publishing build scan...
https://gradle.com/s/j4rxs2bn5fism
Build step 'Invoke Gradle script' changed build result to FAILURE
Build step 'Invoke Gradle script' marked build as failure
---------------------------------------------------------------------
To unsubscribe, e-mail: builds-unsubscribe@beam.apache.org
For additional commands, e-mail: builds-help@beam.apache.org