You are viewing a plain text version of this content. The canonical link for it is here.
Posted to notifications@commons.apache.org by Apache Jenkins Server <je...@builds.apache.org> on 2025/11/08 02:39:18 UTC

Build failed in Jenkins: Commons » commons-net #829

See <https://ci-builds.apache.org/job/Commons/job/commons-net/829/display/redirect?page=changes>

Changes:

[garydgregory] Javadoc


------------------------------------------
Started by an SCM change
Running as SYSTEM
[EnvInject] - Loading node environment variables.
Building remotely on builds26 (ubuntu) in workspace <https://ci-builds.apache.org/job/Commons/job/commons-net/ws/>
The recommended git tool is: NONE
No credentials specified
Wiping out workspace first.
Cloning the remote Git repository
Cloning repository https://github.com/apache/commons-net
 > git init <https://ci-builds.apache.org/job/Commons/job/commons-net/ws/> # timeout=10
Fetching upstream changes from https://github.com/apache/commons-net
 > git --version # timeout=10
 > git --version # 'git version 2.34.1'
 > git fetch --tags --force --progress -- https://github.com/apache/commons-net +refs/heads/*:refs/remotes/origin/* # timeout=10
 > git config remote.origin.url https://github.com/apache/commons-net # timeout=10
 > git config --add remote.origin.fetch +refs/heads/*:refs/remotes/origin/* # timeout=10
Avoid second fetch
 > git rev-parse refs/remotes/origin/master^{commit} # timeout=10
Checking out Revision 3892fd7b21a2b2bd7180d14b69f2541904c4f6a6 (refs/remotes/origin/master)
 > git config core.sparsecheckout # timeout=10
 > git checkout -f 3892fd7b21a2b2bd7180d14b69f2541904c4f6a6 # timeout=10
Commit message: "Javadoc"
 > git rev-list --no-walk 8bb1fdfc67adf79f9bb62633f4335c1f2989b41a # timeout=10
Parsing POMs
Established TCP socket on 46863
maven35-agent.jar already up to date
maven35-interceptor.jar already up to date
maven3-interceptor-commons.jar already up to date
[commons-net] $ /home/jenkins/tools/java/latest16/bin/java -cp /home/jenkins/jenkins-agent/maven35-agent.jar:/home/jenkins/tools/maven/latest3/boot/plexus-classworlds-2.9.0.jar:/home/jenkins/tools/maven/latest3/conf/logging jenkins.maven3.agent.Maven35Main /home/jenkins/tools/maven/latest3 /home/jenkins/jenkins-agent/agent.jar /home/jenkins/jenkins-agent/maven35-interceptor.jar /home/jenkins/jenkins-agent/maven3-interceptor-commons.jar 46863
ERROR: Failed to parse POMs
java.io.IOException: Cannot run program "/home/jenkins/tools/java/latest16/bin/java" (in directory "<https://ci-builds.apache.org/job/Commons/job/commons-net/ws/")>: error=2, No such file or directory
	at java.base/java.lang.ProcessBuilder.start(ProcessBuilder.java:1143)
	at java.base/java.lang.ProcessBuilder.start(ProcessBuilder.java:1073)
	at hudson.Proc$LocalProc.<init>(Proc.java:252)
	at hudson.Proc$LocalProc.<init>(Proc.java:221)
	at hudson.Launcher$LocalLauncher.launch(Launcher.java:994)
	at hudson.Launcher$ProcStarter.start(Launcher.java:506)
	at hudson.Launcher$RemoteLaunchCallable.call(Launcher.java:1395)
	at hudson.Launcher$RemoteLaunchCallable.call(Launcher.java:1337)
	at hudson.remoting.UserRequest.perform(UserRequest.java:225)
	at hudson.remoting.UserRequest.perform(UserRequest.java:50)
	at hudson.remoting.Request$2.run(Request.java:391)
	at hudson.remoting.InterceptingExecutorService.lambda$wrap$0(InterceptingExecutorService.java:81)
	at java.base/java.util.concurrent.FutureTask.run(FutureTask.java:264)
	at java.base/java.util.concurrent.ThreadPoolExecutor.runWorker(ThreadPoolExecutor.java:1136)
	at java.base/java.util.concurrent.ThreadPoolExecutor$Worker.run(ThreadPoolExecutor.java:635)
	at java.base/java.lang.Thread.run(Thread.java:840)
	Suppressed: hudson.remoting.Channel$CallSiteStackTrace: Remote call to builds26
		at hudson.remoting.Channel.attachCallSiteStackTrace(Channel.java:1923)
		at hudson.remoting.UserRequest$ExceptionResponse.retrieve(UserRequest.java:384)
		at hudson.remoting.Channel.call(Channel.java:1112)
		at hudson.Launcher$RemoteLauncher.launch(Launcher.java:1121)
		at hudson.Launcher$ProcStarter.start(Launcher.java:506)
		at PluginClassLoader for maven-plugin//hudson.maven.AbstractMavenProcessFactory.newProcess(AbstractMavenProcessFactory.java:282)
		at PluginClassLoader for maven-plugin//hudson.maven.ProcessCache.get(ProcessCache.java:236)
		at PluginClassLoader for maven-plugin//hudson.maven.MavenModuleSetBuild$MavenModuleSetBuildExecution.doRun(MavenModuleSetBuild.java:802)
		at hudson.model.AbstractBuild$AbstractBuildExecution.run(AbstractBuild.java:527)
		at hudson.model.Run.execute(Run.java:1833)
		at PluginClassLoader for maven-plugin//hudson.maven.MavenModuleSetBuild.run(MavenModuleSetBuild.java:543)
		at hudson.model.ResourceController.execute(ResourceController.java:101)
		at hudson.model.Executor.run(Executor.java:446)
Caused by: java.io.IOException: error=2, No such file or directory
	at java.base/java.lang.ProcessImpl.forkAndExec(Native Method)
	at java.base/java.lang.ProcessImpl.<init>(ProcessImpl.java:314)
	at java.base/java.lang.ProcessImpl.start(ProcessImpl.java:244)
	at java.base/java.lang.ProcessBuilder.start(ProcessBuilder.java:1110)
	... 15 more

Build failed in Jenkins: Commons » commons-net #837

Posted by Apache Jenkins Server <je...@builds.apache.org>.
See <https://ci-builds.apache.org/job/Commons/job/commons-net/837/display/redirect?page=changes>

Changes:

[garydgregory] Bump github/codeql-action from 4.31.4 to 4.31.5


------------------------------------------
Started by an SCM change
Running as SYSTEM
No JDK named ‘jdk_16_latest’ found
[EnvInject] - Loading node environment variables.
Building remotely on builds57 (ubuntu ubuntu-avx) in workspace <https://ci-builds.apache.org/job/Commons/job/commons-net/ws/>
No JDK named ‘jdk_16_latest’ found
The recommended git tool is: NONE
No credentials specified
Wiping out workspace first.
No JDK named ‘jdk_16_latest’ found
Cloning the remote Git repository
Cloning repository https://github.com/apache/commons-net
 > git init <https://ci-builds.apache.org/job/Commons/job/commons-net/ws/> # timeout=10
Fetching upstream changes from https://github.com/apache/commons-net
 > git --version # timeout=10
 > git --version # 'git version 2.34.1'
 > git fetch --tags --force --progress -- https://github.com/apache/commons-net +refs/heads/*:refs/remotes/origin/* # timeout=10
 > git config remote.origin.url https://github.com/apache/commons-net # timeout=10
 > git config --add remote.origin.fetch +refs/heads/*:refs/remotes/origin/* # timeout=10
Avoid second fetch
 > git rev-parse refs/remotes/origin/master^{commit} # timeout=10
No JDK named ‘jdk_16_latest’ found
Checking out Revision 952e8c06609964194e008708b0e70eaba5e65423 (refs/remotes/origin/master)
 > git config core.sparsecheckout # timeout=10
 > git checkout -f 952e8c06609964194e008708b0e70eaba5e65423 # timeout=10
Commit message: "Bump github/codeql-action from 4.31.4 to 4.31.5"
 > git rev-list --no-walk b406d3cca5974e6101633690adeca384f6484c7c # timeout=10
No JDK named ‘jdk_16_latest’ found
No JDK named ‘jdk_16_latest’ found
No JDK named ‘jdk_16_latest’ found
No JDK named ‘jdk_16_latest’ found
Parsing POMs
Downloaded artifact https://repo.maven.apache.org/maven2/org/apache/commons/commons-parent/93/commons-parent-93.pom
Established TCP socket on 46873
maven35-agent.jar already up to date
maven35-interceptor.jar already up to date
maven3-interceptor-commons.jar already up to date
[commons-net] $ java -cp /home/jenkins/jenkins-agent/maven35-agent.jar:/home/jenkins/tools/maven/latest3/boot/plexus-classworlds-2.9.0.jar:/home/jenkins/tools/maven/latest3/conf/logging jenkins.maven3.agent.Maven35Main /home/jenkins/tools/maven/latest3 /home/jenkins/jenkins-agent/agent.jar /home/jenkins/jenkins-agent/maven35-interceptor.jar /home/jenkins/jenkins-agent/maven3-interceptor-commons.jar 46873
<===[JENKINS REMOTING CAPACITY]===>   channel started
Nov 28, 2025 9:43:04 PM hudson.remoting.UserRequest perform
WARNING: LinkageError while performing UserRequest:hudson.maven.AbstractMavenProcessFactory$ConfigureOriginalJDK@7eb0ce19
java.lang.UnsupportedClassVersionError: Failed to load hudson.maven.AbstractMavenProcessFactory$ConfigureOriginalJDK
	at hudson.remoting.RemoteClassLoader.loadClassFile(RemoteClassLoader.java:472)
	at hudson.remoting.RemoteClassLoader.loadRemoteClass(RemoteClassLoader.java:301)
	at hudson.remoting.RemoteClassLoader.loadWithMultiClassLoader(RemoteClassLoader.java:277)
	at hudson.remoting.RemoteClassLoader.findClass(RemoteClassLoader.java:236)
	at java.base/java.lang.ClassLoader.loadClass(ClassLoader.java:594)
	at java.base/java.lang.ClassLoader.loadClass(ClassLoader.java:527)
	at java.base/java.lang.Class.forName0(Native Method)
	at java.base/java.lang.Class.forName(Class.java:398)
	at hudson.remoting.MultiClassLoaderSerializer$Input.resolveClass(MultiClassLoaderSerializer.java:133)
	at java.base/java.io.ObjectInputStream.readNonProxyDesc(ObjectInputStream.java:2003)
	at java.base/java.io.ObjectInputStream.readClassDesc(ObjectInputStream.java:1870)
	at java.base/java.io.ObjectInputStream.readOrdinaryObject(ObjectInputStream.java:2201)
	at java.base/java.io.ObjectInputStream.readObject0(ObjectInputStream.java:1687)
	at java.base/java.io.ObjectInputStream.readObject(ObjectInputStream.java:489)
	at java.base/java.io.ObjectInputStream.readObject(ObjectInputStream.java:447)
	at hudson.remoting.UserRequest.deserialize(UserRequest.java:312)
	at hudson.remoting.UserRequest.perform(UserRequest.java:196)
	at hudson.remoting.UserRequest.perform(UserRequest.java:50)
	at hudson.remoting.Request$2.run(Request.java:391)
	at hudson.remoting.InterceptingExecutorService.lambda$wrap$0(InterceptingExecutorService.java:81)
	at java.base/java.util.concurrent.FutureTask.run(FutureTask.java:264)
	at java.base/java.util.concurrent.ThreadPoolExecutor.runWorker(ThreadPoolExecutor.java:1128)
	at java.base/java.util.concurrent.ThreadPoolExecutor$Worker.run(ThreadPoolExecutor.java:628)
	at java.base/java.lang.Thread.run(Thread.java:829)
Caused by: java.lang.UnsupportedClassVersionError: Failed to load jenkins.security.MasterToSlaveCallable
	at hudson.remoting.RemoteClassLoader.loadClassFile(RemoteClassLoader.java:472)
	at hudson.remoting.RemoteClassLoader.loadRemoteClass(RemoteClassLoader.java:301)
	at hudson.remoting.RemoteClassLoader.loadWithMultiClassLoader(RemoteClassLoader.java:277)
	at hudson.remoting.RemoteClassLoader.findClass(RemoteClassLoader.java:236)
	at java.base/java.lang.ClassLoader.loadClass(ClassLoader.java:594)
	at java.base/java.lang.ClassLoader.loadClass(ClassLoader.java:527)
	at java.base/java.lang.ClassLoader.defineClass1(Native Method)
	at java.base/java.lang.ClassLoader.defineClass(ClassLoader.java:1022)
	at java.base/java.lang.ClassLoader.defineClass(ClassLoader.java:883)
	at hudson.remoting.RemoteClassLoader.loadClassFile(RemoteClassLoader.java:470)
	... 23 more
Caused by: java.lang.UnsupportedClassVersionError: jenkins/security/MasterToSlaveCallable has been compiled by a more recent version of the Java Runtime (class file version 61.0), this version of the Java Runtime only recognizes class file versions up to 55.0
	at java.base/java.lang.ClassLoader.defineClass1(Native Method)
	at java.base/java.lang.ClassLoader.defineClass(ClassLoader.java:1022)
	at java.base/java.lang.ClassLoader.defineClass(ClassLoader.java:883)
	at hudson.remoting.RemoteClassLoader.loadClassFile(RemoteClassLoader.java:470)
	... 32 more

ERROR: ================================================================================
ERROR: Invalid project setup: Failed to load hudson.maven.AbstractMavenProcessFactory$ConfigureOriginalJDK
ERROR: Processing failed due to a bug in the code. Please report this to the issue tracker (https://jenkins.io/redirect/report-an-issue).
java.lang.NullPointerException: Cannot invoke "hudson.model.JDK.getName()" because "jdk" is null
	at PluginClassLoader for maven-plugin//hudson.maven.AbstractMavenProcessFactory.newProcess(AbstractMavenProcessFactory.java:308)
	at PluginClassLoader for maven-plugin//hudson.maven.ProcessCache.get(ProcessCache.java:236)
	at PluginClassLoader for maven-plugin//hudson.maven.MavenModuleSetBuild$MavenModuleSetBuildExecution.doRun(MavenModuleSetBuild.java:802)
	at hudson.model.AbstractBuild$AbstractBuildExecution.run(AbstractBuild.java:527)
	at hudson.model.Run.execute(Run.java:1833)
	at PluginClassLoader for maven-plugin//hudson.maven.MavenModuleSetBuild.run(MavenModuleSetBuild.java:543)
	at hudson.model.ResourceController.execute(ResourceController.java:101)
	at hudson.model.Executor.run(Executor.java:446)
project=hudson.maven.MavenModuleSet@317ad0fb[Commons/commons-net]
project.getModules()=[hudson.maven.MavenModule@677e9a8c[Commons/commons-net/commons-net:commons-net][Commons/commons-net/commons-net:commons-net][relativePath:]]
project.getRootModule()=hudson.maven.MavenModule@677e9a8c[Commons/commons-net/commons-net:commons-net][Commons/commons-net/commons-net:commons-net][relativePath:]
FATAL: Cannot invoke "hudson.model.JDK.getName()" because "jdk" is null
java.lang.NullPointerException: Cannot invoke "hudson.model.JDK.getName()" because "jdk" is null
	at PluginClassLoader for maven-plugin//hudson.maven.AbstractMavenProcessFactory.newProcess(AbstractMavenProcessFactory.java:308)
	at PluginClassLoader for maven-plugin//hudson.maven.ProcessCache.get(ProcessCache.java:236)
	at PluginClassLoader for maven-plugin//hudson.maven.MavenModuleSetBuild$MavenModuleSetBuildExecution.doRun(MavenModuleSetBuild.java:802)
	at hudson.model.AbstractBuild$AbstractBuildExecution.run(AbstractBuild.java:527)
	at hudson.model.Run.execute(Run.java:1833)
	at PluginClassLoader for maven-plugin//hudson.maven.MavenModuleSetBuild.run(MavenModuleSetBuild.java:543)
	at hudson.model.ResourceController.execute(ResourceController.java:101)
	at hudson.model.Executor.run(Executor.java:446)
No JDK named ‘jdk_16_latest’ found
No JDK named ‘jdk_16_latest’ found

Build failed in Jenkins: Commons » commons-net #836

Posted by Apache Jenkins Server <je...@builds.apache.org>.
See <https://ci-builds.apache.org/job/Commons/job/commons-net/836/display/redirect?page=changes>

Changes:

[github] Bump org.apache.commons:commons-lang3 from 3.19.0 to 3.20.0

[github] Bump org.apache.commons:commons-parent from 92 to 93

[github] Bump org.apache.commons:commons-lang3 from 3.19.0 to 3.20.0 #389


------------------------------------------
Started by an SCM change
Running as SYSTEM
No JDK named ‘jdk_16_latest’ found
[EnvInject] - Loading node environment variables.
Building remotely on builds38 (ubuntu) in workspace <https://ci-builds.apache.org/job/Commons/job/commons-net/ws/>
No JDK named ‘jdk_16_latest’ found
The recommended git tool is: NONE
No credentials specified
Wiping out workspace first.
No JDK named ‘jdk_16_latest’ found
Cloning the remote Git repository
Cloning repository https://github.com/apache/commons-net
 > git init <https://ci-builds.apache.org/job/Commons/job/commons-net/ws/> # timeout=10
Fetching upstream changes from https://github.com/apache/commons-net
 > git --version # timeout=10
 > git --version # 'git version 2.34.1'
 > git fetch --tags --force --progress -- https://github.com/apache/commons-net +refs/heads/*:refs/remotes/origin/* # timeout=10
 > git config remote.origin.url https://github.com/apache/commons-net # timeout=10
 > git config --add remote.origin.fetch +refs/heads/*:refs/remotes/origin/* # timeout=10
Avoid second fetch
 > git rev-parse refs/remotes/origin/master^{commit} # timeout=10
No JDK named ‘jdk_16_latest’ found
Checking out Revision b406d3cca5974e6101633690adeca384f6484c7c (refs/remotes/origin/master)
 > git config core.sparsecheckout # timeout=10
 > git checkout -f b406d3cca5974e6101633690adeca384f6484c7c # timeout=10
Commit message: "Merge pull request #390 from apache/dependabot/maven/org.apache.commons-commons-parent-93"
 > git rev-list --no-walk 7e5ce554da69d4cccca46f8738b3756d926149c8 # timeout=10
No JDK named ‘jdk_16_latest’ found
No JDK named ‘jdk_16_latest’ found
No JDK named ‘jdk_16_latest’ found
No JDK named ‘jdk_16_latest’ found
Parsing POMs
Downloaded artifact https://repo.maven.apache.org/maven2/org/apache/commons/commons-parent/93/commons-parent-93.pom
Modules changed, recalculating dependency graph
Established TCP socket on 41741
maven35-agent.jar already up to date
maven35-interceptor.jar already up to date
maven3-interceptor-commons.jar already up to date
[commons-net] $ java -cp /home/jenkins/jenkins-agent/maven35-agent.jar:/home/jenkins/tools/maven/latest3/boot/plexus-classworlds-2.9.0.jar:/home/jenkins/tools/maven/latest3/conf/logging jenkins.maven3.agent.Maven35Main /home/jenkins/tools/maven/latest3 /home/jenkins/jenkins-agent/agent.jar /home/jenkins/jenkins-agent/maven35-interceptor.jar /home/jenkins/jenkins-agent/maven3-interceptor-commons.jar 41741
<===[JENKINS REMOTING CAPACITY]===>   channel started
Nov 22, 2025 10:39:27 PM hudson.remoting.UserRequest perform
WARNING: LinkageError while performing UserRequest:hudson.maven.AbstractMavenProcessFactory$ConfigureOriginalJDK@6ead88b8
java.lang.UnsupportedClassVersionError: Failed to load hudson.maven.AbstractMavenProcessFactory$ConfigureOriginalJDK
	at hudson.remoting.RemoteClassLoader.loadClassFile(RemoteClassLoader.java:472)
	at hudson.remoting.RemoteClassLoader.loadRemoteClass(RemoteClassLoader.java:301)
	at hudson.remoting.RemoteClassLoader.loadWithMultiClassLoader(RemoteClassLoader.java:277)
	at hudson.remoting.RemoteClassLoader.findClass(RemoteClassLoader.java:236)
	at java.base/java.lang.ClassLoader.loadClass(ClassLoader.java:594)
	at java.base/java.lang.ClassLoader.loadClass(ClassLoader.java:527)
	at java.base/java.lang.Class.forName0(Native Method)
	at java.base/java.lang.Class.forName(Class.java:398)
	at hudson.remoting.MultiClassLoaderSerializer$Input.resolveClass(MultiClassLoaderSerializer.java:133)
	at java.base/java.io.ObjectInputStream.readNonProxyDesc(ObjectInputStream.java:2003)
	at java.base/java.io.ObjectInputStream.readClassDesc(ObjectInputStream.java:1870)
	at java.base/java.io.ObjectInputStream.readOrdinaryObject(ObjectInputStream.java:2201)
	at java.base/java.io.ObjectInputStream.readObject0(ObjectInputStream.java:1687)
	at java.base/java.io.ObjectInputStream.readObject(ObjectInputStream.java:489)
	at java.base/java.io.ObjectInputStream.readObject(ObjectInputStream.java:447)
	at hudson.remoting.UserRequest.deserialize(UserRequest.java:312)
	at hudson.remoting.UserRequest.perform(UserRequest.java:196)
	at hudson.remoting.UserRequest.perform(UserRequest.java:50)
	at hudson.remoting.Request$2.run(Request.java:391)
	at hudson.remoting.InterceptingExecutorService.lambda$wrap$0(InterceptingExecutorService.java:81)
	at java.base/java.util.concurrent.FutureTask.run(FutureTask.java:264)
	at java.base/java.util.concurrent.ThreadPoolExecutor.runWorker(ThreadPoolExecutor.java:1128)
	at java.base/java.util.concurrent.ThreadPoolExecutor$Worker.run(ThreadPoolExecutor.java:628)
	at java.base/java.lang.Thread.run(Thread.java:829)
Caused by: java.lang.UnsupportedClassVersionError: Failed to load jenkins.security.MasterToSlaveCallable
	at hudson.remoting.RemoteClassLoader.loadClassFile(RemoteClassLoader.java:472)
	at hudson.remoting.RemoteClassLoader.loadRemoteClass(RemoteClassLoader.java:301)
	at hudson.remoting.RemoteClassLoader.loadWithMultiClassLoader(RemoteClassLoader.java:277)
	at hudson.remoting.RemoteClassLoader.findClass(RemoteClassLoader.java:236)
	at java.base/java.lang.ClassLoader.loadClass(ClassLoader.java:594)
	at java.base/java.lang.ClassLoader.loadClass(ClassLoader.java:527)
	at java.base/java.lang.ClassLoader.defineClass1(Native Method)
	at java.base/java.lang.ClassLoader.defineClass(ClassLoader.java:1022)
	at java.base/java.lang.ClassLoader.defineClass(ClassLoader.java:883)
	at hudson.remoting.RemoteClassLoader.loadClassFile(RemoteClassLoader.java:470)
	... 23 more
Caused by: java.lang.UnsupportedClassVersionError: jenkins/security/MasterToSlaveCallable has been compiled by a more recent version of the Java Runtime (class file version 61.0), this version of the Java Runtime only recognizes class file versions up to 55.0
	at java.base/java.lang.ClassLoader.defineClass1(Native Method)
	at java.base/java.lang.ClassLoader.defineClass(ClassLoader.java:1022)
	at java.base/java.lang.ClassLoader.defineClass(ClassLoader.java:883)
	at hudson.remoting.RemoteClassLoader.loadClassFile(RemoteClassLoader.java:470)
	... 32 more

ERROR: ================================================================================
ERROR: Invalid project setup: Failed to load hudson.maven.AbstractMavenProcessFactory$ConfigureOriginalJDK
ERROR: Processing failed due to a bug in the code. Please report this to the issue tracker (https://jenkins.io/redirect/report-an-issue).
java.lang.NullPointerException: Cannot invoke "hudson.model.JDK.getName()" because "jdk" is null
	at PluginClassLoader for maven-plugin//hudson.maven.AbstractMavenProcessFactory.newProcess(AbstractMavenProcessFactory.java:308)
	at PluginClassLoader for maven-plugin//hudson.maven.ProcessCache.get(ProcessCache.java:236)
	at PluginClassLoader for maven-plugin//hudson.maven.MavenModuleSetBuild$MavenModuleSetBuildExecution.doRun(MavenModuleSetBuild.java:802)
	at hudson.model.AbstractBuild$AbstractBuildExecution.run(AbstractBuild.java:527)
	at hudson.model.Run.execute(Run.java:1833)
	at PluginClassLoader for maven-plugin//hudson.maven.MavenModuleSetBuild.run(MavenModuleSetBuild.java:543)
	at hudson.model.ResourceController.execute(ResourceController.java:101)
	at hudson.model.Executor.run(Executor.java:446)
project=hudson.maven.MavenModuleSet@c1ae30e[Commons/commons-net]
project.getModules()=[hudson.maven.MavenModule@6fdb9a[Commons/commons-net/commons-net:commons-net][Commons/commons-net/commons-net:commons-net][relativePath:]]
project.getRootModule()=hudson.maven.MavenModule@6fdb9a[Commons/commons-net/commons-net:commons-net][Commons/commons-net/commons-net:commons-net][relativePath:]
FATAL: Cannot invoke "hudson.model.JDK.getName()" because "jdk" is null
java.lang.NullPointerException: Cannot invoke "hudson.model.JDK.getName()" because "jdk" is null
	at PluginClassLoader for maven-plugin//hudson.maven.AbstractMavenProcessFactory.newProcess(AbstractMavenProcessFactory.java:308)
	at PluginClassLoader for maven-plugin//hudson.maven.ProcessCache.get(ProcessCache.java:236)
	at PluginClassLoader for maven-plugin//hudson.maven.MavenModuleSetBuild$MavenModuleSetBuildExecution.doRun(MavenModuleSetBuild.java:802)
	at hudson.model.AbstractBuild$AbstractBuildExecution.run(AbstractBuild.java:527)
	at hudson.model.Run.execute(Run.java:1833)
	at PluginClassLoader for maven-plugin//hudson.maven.MavenModuleSetBuild.run(MavenModuleSetBuild.java:543)
	at hudson.model.ResourceController.execute(ResourceController.java:101)
	at hudson.model.Executor.run(Executor.java:446)
No JDK named ‘jdk_16_latest’ found
No JDK named ‘jdk_16_latest’ found

Build failed in Jenkins: Commons » commons-net #835

Posted by Apache Jenkins Server <je...@builds.apache.org>.
See <https://ci-builds.apache.org/job/Commons/job/commons-net/835/display/redirect?page=changes>

Changes:

[garydgregory] Bump actions/checkout from v5.0.0 to v6.0.0


------------------------------------------
Started by an SCM change
Running as SYSTEM
No JDK named ‘jdk_16_latest’ found
[EnvInject] - Loading node environment variables.
Building remotely on builds57 (ubuntu ubuntu-avx) in workspace <https://ci-builds.apache.org/job/Commons/job/commons-net/ws/>
No JDK named ‘jdk_16_latest’ found
The recommended git tool is: NONE
No credentials specified
Wiping out workspace first.
No JDK named ‘jdk_16_latest’ found
Cloning the remote Git repository
Cloning repository https://github.com/apache/commons-net
 > git init <https://ci-builds.apache.org/job/Commons/job/commons-net/ws/> # timeout=10
Fetching upstream changes from https://github.com/apache/commons-net
 > git --version # timeout=10
 > git --version # 'git version 2.34.1'
 > git fetch --tags --force --progress -- https://github.com/apache/commons-net +refs/heads/*:refs/remotes/origin/* # timeout=10
 > git config remote.origin.url https://github.com/apache/commons-net # timeout=10
 > git config --add remote.origin.fetch +refs/heads/*:refs/remotes/origin/* # timeout=10
Avoid second fetch
 > git rev-parse refs/remotes/origin/master^{commit} # timeout=10
No JDK named ‘jdk_16_latest’ found
Checking out Revision 7e5ce554da69d4cccca46f8738b3756d926149c8 (refs/remotes/origin/master)
 > git config core.sparsecheckout # timeout=10
 > git checkout -f 7e5ce554da69d4cccca46f8738b3756d926149c8 # timeout=10
Commit message: "Bump actions/checkout from v5.0.0 to v6.0.0"
 > git rev-list --no-walk c44b7be36dbc4bf6dd1b25261f740debb7f5a105 # timeout=10
No JDK named ‘jdk_16_latest’ found
No JDK named ‘jdk_16_latest’ found
No JDK named ‘jdk_16_latest’ found
No JDK named ‘jdk_16_latest’ found
Parsing POMs
Established TCP socket on 37057
maven35-agent.jar already up to date
maven35-interceptor.jar already up to date
maven3-interceptor-commons.jar already up to date
[commons-net] $ java -cp /home/jenkins/jenkins-agent/maven35-agent.jar:/home/jenkins/tools/maven/latest3/boot/plexus-classworlds-2.9.0.jar:/home/jenkins/tools/maven/latest3/conf/logging jenkins.maven3.agent.Maven35Main /home/jenkins/tools/maven/latest3 /home/jenkins/jenkins-agent/agent.jar /home/jenkins/jenkins-agent/maven35-interceptor.jar /home/jenkins/jenkins-agent/maven3-interceptor-commons.jar 37057
<===[JENKINS REMOTING CAPACITY]===>   channel started
Nov 21, 2025 8:39:24 PM hudson.remoting.UserRequest perform
WARNING: LinkageError while performing UserRequest:hudson.maven.AbstractMavenProcessFactory$ConfigureOriginalJDK@68b526c7
java.lang.UnsupportedClassVersionError: Failed to load hudson.maven.AbstractMavenProcessFactory$ConfigureOriginalJDK
	at hudson.remoting.RemoteClassLoader.loadClassFile(RemoteClassLoader.java:472)
	at hudson.remoting.RemoteClassLoader.loadRemoteClass(RemoteClassLoader.java:301)
	at hudson.remoting.RemoteClassLoader.loadWithMultiClassLoader(RemoteClassLoader.java:277)
	at hudson.remoting.RemoteClassLoader.findClass(RemoteClassLoader.java:236)
	at java.base/java.lang.ClassLoader.loadClass(ClassLoader.java:594)
	at java.base/java.lang.ClassLoader.loadClass(ClassLoader.java:527)
	at java.base/java.lang.Class.forName0(Native Method)
	at java.base/java.lang.Class.forName(Class.java:398)
	at hudson.remoting.MultiClassLoaderSerializer$Input.resolveClass(MultiClassLoaderSerializer.java:133)
	at java.base/java.io.ObjectInputStream.readNonProxyDesc(ObjectInputStream.java:2003)
	at java.base/java.io.ObjectInputStream.readClassDesc(ObjectInputStream.java:1870)
	at java.base/java.io.ObjectInputStream.readOrdinaryObject(ObjectInputStream.java:2201)
	at java.base/java.io.ObjectInputStream.readObject0(ObjectInputStream.java:1687)
	at java.base/java.io.ObjectInputStream.readObject(ObjectInputStream.java:489)
	at java.base/java.io.ObjectInputStream.readObject(ObjectInputStream.java:447)
	at hudson.remoting.UserRequest.deserialize(UserRequest.java:312)
	at hudson.remoting.UserRequest.perform(UserRequest.java:196)
	at hudson.remoting.UserRequest.perform(UserRequest.java:50)
	at hudson.remoting.Request$2.run(Request.java:391)
	at hudson.remoting.InterceptingExecutorService.lambda$wrap$0(InterceptingExecutorService.java:81)
	at java.base/java.util.concurrent.FutureTask.run(FutureTask.java:264)
	at java.base/java.util.concurrent.ThreadPoolExecutor.runWorker(ThreadPoolExecutor.java:1128)
	at java.base/java.util.concurrent.ThreadPoolExecutor$Worker.run(ThreadPoolExecutor.java:628)
	at java.base/java.lang.Thread.run(Thread.java:829)
Caused by: java.lang.UnsupportedClassVersionError: Failed to load jenkins.security.MasterToSlaveCallable
	at hudson.remoting.RemoteClassLoader.loadClassFile(RemoteClassLoader.java:472)
	at hudson.remoting.RemoteClassLoader.loadRemoteClass(RemoteClassLoader.java:301)
	at hudson.remoting.RemoteClassLoader.loadWithMultiClassLoader(RemoteClassLoader.java:277)
	at hudson.remoting.RemoteClassLoader.findClass(RemoteClassLoader.java:236)
	at java.base/java.lang.ClassLoader.loadClass(ClassLoader.java:594)
	at java.base/java.lang.ClassLoader.loadClass(ClassLoader.java:527)
	at java.base/java.lang.ClassLoader.defineClass1(Native Method)
	at java.base/java.lang.ClassLoader.defineClass(ClassLoader.java:1022)
	at java.base/java.lang.ClassLoader.defineClass(ClassLoader.java:883)
	at hudson.remoting.RemoteClassLoader.loadClassFile(RemoteClassLoader.java:470)
	... 23 more
Caused by: java.lang.UnsupportedClassVersionError: jenkins/security/MasterToSlaveCallable has been compiled by a more recent version of the Java Runtime (class file version 61.0), this version of the Java Runtime only recognizes class file versions up to 55.0
	at java.base/java.lang.ClassLoader.defineClass1(Native Method)
	at java.base/java.lang.ClassLoader.defineClass(ClassLoader.java:1022)
	at java.base/java.lang.ClassLoader.defineClass(ClassLoader.java:883)
	at hudson.remoting.RemoteClassLoader.loadClassFile(RemoteClassLoader.java:470)
	... 32 more

ERROR: ================================================================================
ERROR: Invalid project setup: Failed to load hudson.maven.AbstractMavenProcessFactory$ConfigureOriginalJDK
ERROR: Processing failed due to a bug in the code. Please report this to the issue tracker (https://jenkins.io/redirect/report-an-issue).
java.lang.NullPointerException: Cannot invoke "hudson.model.JDK.getName()" because "jdk" is null
	at PluginClassLoader for maven-plugin//hudson.maven.AbstractMavenProcessFactory.newProcess(AbstractMavenProcessFactory.java:308)
	at PluginClassLoader for maven-plugin//hudson.maven.ProcessCache.get(ProcessCache.java:236)
	at PluginClassLoader for maven-plugin//hudson.maven.MavenModuleSetBuild$MavenModuleSetBuildExecution.doRun(MavenModuleSetBuild.java:802)
	at hudson.model.AbstractBuild$AbstractBuildExecution.run(AbstractBuild.java:527)
	at hudson.model.Run.execute(Run.java:1833)
	at PluginClassLoader for maven-plugin//hudson.maven.MavenModuleSetBuild.run(MavenModuleSetBuild.java:543)
	at hudson.model.ResourceController.execute(ResourceController.java:101)
	at hudson.model.Executor.run(Executor.java:446)
project=hudson.maven.MavenModuleSet@c1ae30e[Commons/commons-net]
project.getModules()=[hudson.maven.MavenModule@6fdb9a[Commons/commons-net/commons-net:commons-net][Commons/commons-net/commons-net:commons-net][relativePath:]]
project.getRootModule()=hudson.maven.MavenModule@6fdb9a[Commons/commons-net/commons-net:commons-net][Commons/commons-net/commons-net:commons-net][relativePath:]
FATAL: Cannot invoke "hudson.model.JDK.getName()" because "jdk" is null
java.lang.NullPointerException: Cannot invoke "hudson.model.JDK.getName()" because "jdk" is null
	at PluginClassLoader for maven-plugin//hudson.maven.AbstractMavenProcessFactory.newProcess(AbstractMavenProcessFactory.java:308)
	at PluginClassLoader for maven-plugin//hudson.maven.ProcessCache.get(ProcessCache.java:236)
	at PluginClassLoader for maven-plugin//hudson.maven.MavenModuleSetBuild$MavenModuleSetBuildExecution.doRun(MavenModuleSetBuild.java:802)
	at hudson.model.AbstractBuild$AbstractBuildExecution.run(AbstractBuild.java:527)
	at hudson.model.Run.execute(Run.java:1833)
	at PluginClassLoader for maven-plugin//hudson.maven.MavenModuleSetBuild.run(MavenModuleSetBuild.java:543)
	at hudson.model.ResourceController.execute(ResourceController.java:101)
	at hudson.model.Executor.run(Executor.java:446)
No JDK named ‘jdk_16_latest’ found
No JDK named ‘jdk_16_latest’ found

Build failed in Jenkins: Commons » commons-net #834

Posted by Apache Jenkins Server <je...@builds.apache.org>.
See <https://ci-builds.apache.org/job/Commons/job/commons-net/834/display/redirect?page=changes>

Changes:

[garydgregory] Bump CodeQL 4.31.4


------------------------------------------
Started by an SCM change
Running as SYSTEM
No JDK named ‘jdk_16_latest’ found
[EnvInject] - Loading node environment variables.
Building remotely on builds57 (ubuntu ubuntu-avx) in workspace <https://ci-builds.apache.org/job/Commons/job/commons-net/ws/>
No JDK named ‘jdk_16_latest’ found
The recommended git tool is: NONE
No credentials specified
Wiping out workspace first.
No JDK named ‘jdk_16_latest’ found
Cloning the remote Git repository
Cloning repository https://github.com/apache/commons-net
 > git init <https://ci-builds.apache.org/job/Commons/job/commons-net/ws/> # timeout=10
Fetching upstream changes from https://github.com/apache/commons-net
 > git --version # timeout=10
 > git --version # 'git version 2.34.1'
 > git fetch --tags --force --progress -- https://github.com/apache/commons-net +refs/heads/*:refs/remotes/origin/* # timeout=10
 > git config remote.origin.url https://github.com/apache/commons-net # timeout=10
 > git config --add remote.origin.fetch +refs/heads/*:refs/remotes/origin/* # timeout=10
Avoid second fetch
 > git rev-parse refs/remotes/origin/master^{commit} # timeout=10
No JDK named ‘jdk_16_latest’ found
Checking out Revision c44b7be36dbc4bf6dd1b25261f740debb7f5a105 (refs/remotes/origin/master)
 > git config core.sparsecheckout # timeout=10
 > git checkout -f c44b7be36dbc4bf6dd1b25261f740debb7f5a105 # timeout=10
Commit message: "Bump CodeQL 4.31.4"
 > git rev-list --no-walk 1d33900554a0cc5ace2c5e4d862c154f9ecd01a2 # timeout=10
No JDK named ‘jdk_16_latest’ found
No JDK named ‘jdk_16_latest’ found
No JDK named ‘jdk_16_latest’ found
No JDK named ‘jdk_16_latest’ found
Parsing POMs
Established TCP socket on 40547
maven35-agent.jar already up to date
maven35-interceptor.jar already up to date
maven3-interceptor-commons.jar already up to date
[commons-net] $ java -cp /home/jenkins/jenkins-agent/maven35-agent.jar:/home/jenkins/tools/maven/latest3/boot/plexus-classworlds-2.9.0.jar:/home/jenkins/tools/maven/latest3/conf/logging jenkins.maven3.agent.Maven35Main /home/jenkins/tools/maven/latest3 /home/jenkins/jenkins-agent/agent.jar /home/jenkins/jenkins-agent/maven35-interceptor.jar /home/jenkins/jenkins-agent/maven3-interceptor-commons.jar 40547
<===[JENKINS REMOTING CAPACITY]===>   channel started
Nov 21, 2025 3:39:25 PM hudson.remoting.UserRequest perform
WARNING: LinkageError while performing UserRequest:hudson.maven.AbstractMavenProcessFactory$ConfigureOriginalJDK@6ce2f01a
java.lang.UnsupportedClassVersionError: Failed to load hudson.maven.AbstractMavenProcessFactory$ConfigureOriginalJDK
	at hudson.remoting.RemoteClassLoader.loadClassFile(RemoteClassLoader.java:472)
	at hudson.remoting.RemoteClassLoader.loadRemoteClass(RemoteClassLoader.java:301)
	at hudson.remoting.RemoteClassLoader.loadWithMultiClassLoader(RemoteClassLoader.java:277)
	at hudson.remoting.RemoteClassLoader.findClass(RemoteClassLoader.java:236)
	at java.base/java.lang.ClassLoader.loadClass(ClassLoader.java:594)
	at java.base/java.lang.ClassLoader.loadClass(ClassLoader.java:527)
	at java.base/java.lang.Class.forName0(Native Method)
	at java.base/java.lang.Class.forName(Class.java:398)
	at hudson.remoting.MultiClassLoaderSerializer$Input.resolveClass(MultiClassLoaderSerializer.java:133)
	at java.base/java.io.ObjectInputStream.readNonProxyDesc(ObjectInputStream.java:2003)
	at java.base/java.io.ObjectInputStream.readClassDesc(ObjectInputStream.java:1870)
	at java.base/java.io.ObjectInputStream.readOrdinaryObject(ObjectInputStream.java:2201)
	at java.base/java.io.ObjectInputStream.readObject0(ObjectInputStream.java:1687)
	at java.base/java.io.ObjectInputStream.readObject(ObjectInputStream.java:489)
	at java.base/java.io.ObjectInputStream.readObject(ObjectInputStream.java:447)
	at hudson.remoting.UserRequest.deserialize(UserRequest.java:312)
	at hudson.remoting.UserRequest.perform(UserRequest.java:196)
	at hudson.remoting.UserRequest.perform(UserRequest.java:50)
	at hudson.remoting.Request$2.run(Request.java:391)
	at hudson.remoting.InterceptingExecutorService.lambda$wrap$0(InterceptingExecutorService.java:81)
	at java.base/java.util.concurrent.FutureTask.run(FutureTask.java:264)
	at java.base/java.util.concurrent.ThreadPoolExecutor.runWorker(ThreadPoolExecutor.java:1128)
	at java.base/java.util.concurrent.ThreadPoolExecutor$Worker.run(ThreadPoolExecutor.java:628)
	at java.base/java.lang.Thread.run(Thread.java:829)
Caused by: java.lang.UnsupportedClassVersionError: Failed to load jenkins.security.MasterToSlaveCallable
	at hudson.remoting.RemoteClassLoader.loadClassFile(RemoteClassLoader.java:472)
	at hudson.remoting.RemoteClassLoader.loadRemoteClass(RemoteClassLoader.java:301)
	at hudson.remoting.RemoteClassLoader.loadWithMultiClassLoader(RemoteClassLoader.java:277)
	at hudson.remoting.RemoteClassLoader.findClass(RemoteClassLoader.java:236)
	at java.base/java.lang.ClassLoader.loadClass(ClassLoader.java:594)
	at java.base/java.lang.ClassLoader.loadClass(ClassLoader.java:527)
	at java.base/java.lang.ClassLoader.defineClass1(Native Method)
	at java.base/java.lang.ClassLoader.defineClass(ClassLoader.java:1022)
	at java.base/java.lang.ClassLoader.defineClass(ClassLoader.java:883)
	at hudson.remoting.RemoteClassLoader.loadClassFile(RemoteClassLoader.java:470)
	... 23 more
Caused by: java.lang.UnsupportedClassVersionError: jenkins/security/MasterToSlaveCallable has been compiled by a more recent version of the Java Runtime (class file version 61.0), this version of the Java Runtime only recognizes class file versions up to 55.0
	at java.base/java.lang.ClassLoader.defineClass1(Native Method)
	at java.base/java.lang.ClassLoader.defineClass(ClassLoader.java:1022)
	at java.base/java.lang.ClassLoader.defineClass(ClassLoader.java:883)
	at hudson.remoting.RemoteClassLoader.loadClassFile(RemoteClassLoader.java:470)
	... 32 more

ERROR: ================================================================================
ERROR: Invalid project setup: Failed to load hudson.maven.AbstractMavenProcessFactory$ConfigureOriginalJDK
ERROR: Processing failed due to a bug in the code. Please report this to the issue tracker (https://jenkins.io/redirect/report-an-issue).
java.lang.NullPointerException: Cannot invoke "hudson.model.JDK.getName()" because "jdk" is null
	at PluginClassLoader for maven-plugin//hudson.maven.AbstractMavenProcessFactory.newProcess(AbstractMavenProcessFactory.java:308)
	at PluginClassLoader for maven-plugin//hudson.maven.ProcessCache.get(ProcessCache.java:236)
	at PluginClassLoader for maven-plugin//hudson.maven.MavenModuleSetBuild$MavenModuleSetBuildExecution.doRun(MavenModuleSetBuild.java:802)
	at hudson.model.AbstractBuild$AbstractBuildExecution.run(AbstractBuild.java:527)
	at hudson.model.Run.execute(Run.java:1833)
	at PluginClassLoader for maven-plugin//hudson.maven.MavenModuleSetBuild.run(MavenModuleSetBuild.java:543)
	at hudson.model.ResourceController.execute(ResourceController.java:101)
	at hudson.model.Executor.run(Executor.java:446)
project=hudson.maven.MavenModuleSet@c1ae30e[Commons/commons-net]
project.getModules()=[hudson.maven.MavenModule@6fdb9a[Commons/commons-net/commons-net:commons-net][Commons/commons-net/commons-net:commons-net][relativePath:]]
project.getRootModule()=hudson.maven.MavenModule@6fdb9a[Commons/commons-net/commons-net:commons-net][Commons/commons-net/commons-net:commons-net][relativePath:]
FATAL: Cannot invoke "hudson.model.JDK.getName()" because "jdk" is null
java.lang.NullPointerException: Cannot invoke "hudson.model.JDK.getName()" because "jdk" is null
	at PluginClassLoader for maven-plugin//hudson.maven.AbstractMavenProcessFactory.newProcess(AbstractMavenProcessFactory.java:308)
	at PluginClassLoader for maven-plugin//hudson.maven.ProcessCache.get(ProcessCache.java:236)
	at PluginClassLoader for maven-plugin//hudson.maven.MavenModuleSetBuild$MavenModuleSetBuildExecution.doRun(MavenModuleSetBuild.java:802)
	at hudson.model.AbstractBuild$AbstractBuildExecution.run(AbstractBuild.java:527)
	at hudson.model.Run.execute(Run.java:1833)
	at PluginClassLoader for maven-plugin//hudson.maven.MavenModuleSetBuild.run(MavenModuleSetBuild.java:543)
	at hudson.model.ResourceController.execute(ResourceController.java:101)
	at hudson.model.Executor.run(Executor.java:446)
No JDK named ‘jdk_16_latest’ found
No JDK named ‘jdk_16_latest’ found

Build failed in Jenkins: Commons » commons-net #833

Posted by Apache Jenkins Server <je...@builds.apache.org>.
See <https://ci-builds.apache.org/job/Commons/job/commons-net/833/display/redirect?page=changes>

Changes:

[garydgregory] Use HTTPS to download XML Schema


------------------------------------------
Started by an SCM change
Running as SYSTEM
No JDK named ‘jdk_16_latest’ found
[EnvInject] - Loading node environment variables.
Building remotely on builds57 (ubuntu ubuntu-avx) in workspace <https://ci-builds.apache.org/job/Commons/job/commons-net/ws/>
No JDK named ‘jdk_16_latest’ found
The recommended git tool is: NONE
No credentials specified
Wiping out workspace first.
No JDK named ‘jdk_16_latest’ found
Cloning the remote Git repository
Cloning repository https://github.com/apache/commons-net
 > git init <https://ci-builds.apache.org/job/Commons/job/commons-net/ws/> # timeout=10
Fetching upstream changes from https://github.com/apache/commons-net
 > git --version # timeout=10
 > git --version # 'git version 2.34.1'
 > git fetch --tags --force --progress -- https://github.com/apache/commons-net +refs/heads/*:refs/remotes/origin/* # timeout=10
 > git config remote.origin.url https://github.com/apache/commons-net # timeout=10
 > git config --add remote.origin.fetch +refs/heads/*:refs/remotes/origin/* # timeout=10
Avoid second fetch
 > git rev-parse refs/remotes/origin/master^{commit} # timeout=10
No JDK named ‘jdk_16_latest’ found
Checking out Revision 1d33900554a0cc5ace2c5e4d862c154f9ecd01a2 (refs/remotes/origin/master)
 > git config core.sparsecheckout # timeout=10
 > git checkout -f 1d33900554a0cc5ace2c5e4d862c154f9ecd01a2 # timeout=10
Commit message: "Use HTTPS to download XML Schema"
 > git rev-list --no-walk 8bb87895dee561d84abd6567bedb739b330fa738 # timeout=10
No JDK named ‘jdk_16_latest’ found
No JDK named ‘jdk_16_latest’ found
No JDK named ‘jdk_16_latest’ found
No JDK named ‘jdk_16_latest’ found
Parsing POMs
Established TCP socket on 41217
maven35-agent.jar already up to date
maven35-interceptor.jar already up to date
maven3-interceptor-commons.jar already up to date
[commons-net] $ java -cp /home/jenkins/jenkins-agent/maven35-agent.jar:/home/jenkins/tools/maven/latest3/boot/plexus-classworlds-2.9.0.jar:/home/jenkins/tools/maven/latest3/conf/logging jenkins.maven3.agent.Maven35Main /home/jenkins/tools/maven/latest3 /home/jenkins/jenkins-agent/agent.jar /home/jenkins/jenkins-agent/maven35-interceptor.jar /home/jenkins/jenkins-agent/maven3-interceptor-commons.jar 41217
<===[JENKINS REMOTING CAPACITY]===>   channel started
Nov 21, 2025 2:39:25 PM hudson.remoting.UserRequest perform
WARNING: LinkageError while performing UserRequest:hudson.maven.AbstractMavenProcessFactory$ConfigureOriginalJDK@366d126a
java.lang.UnsupportedClassVersionError: Failed to load hudson.maven.AbstractMavenProcessFactory$ConfigureOriginalJDK
	at hudson.remoting.RemoteClassLoader.loadClassFile(RemoteClassLoader.java:472)
	at hudson.remoting.RemoteClassLoader.loadRemoteClass(RemoteClassLoader.java:301)
	at hudson.remoting.RemoteClassLoader.loadWithMultiClassLoader(RemoteClassLoader.java:277)
	at hudson.remoting.RemoteClassLoader.findClass(RemoteClassLoader.java:236)
	at java.base/java.lang.ClassLoader.loadClass(ClassLoader.java:594)
	at java.base/java.lang.ClassLoader.loadClass(ClassLoader.java:527)
	at java.base/java.lang.Class.forName0(Native Method)
	at java.base/java.lang.Class.forName(Class.java:398)
	at hudson.remoting.MultiClassLoaderSerializer$Input.resolveClass(MultiClassLoaderSerializer.java:133)
	at java.base/java.io.ObjectInputStream.readNonProxyDesc(ObjectInputStream.java:2003)
	at java.base/java.io.ObjectInputStream.readClassDesc(ObjectInputStream.java:1870)
	at java.base/java.io.ObjectInputStream.readOrdinaryObject(ObjectInputStream.java:2201)
	at java.base/java.io.ObjectInputStream.readObject0(ObjectInputStream.java:1687)
	at java.base/java.io.ObjectInputStream.readObject(ObjectInputStream.java:489)
	at java.base/java.io.ObjectInputStream.readObject(ObjectInputStream.java:447)
	at hudson.remoting.UserRequest.deserialize(UserRequest.java:312)
	at hudson.remoting.UserRequest.perform(UserRequest.java:196)
	at hudson.remoting.UserRequest.perform(UserRequest.java:50)
	at hudson.remoting.Request$2.run(Request.java:391)
	at hudson.remoting.InterceptingExecutorService.lambda$wrap$0(InterceptingExecutorService.java:81)
	at java.base/java.util.concurrent.FutureTask.run(FutureTask.java:264)
	at java.base/java.util.concurrent.ThreadPoolExecutor.runWorker(ThreadPoolExecutor.java:1128)
	at java.base/java.util.concurrent.ThreadPoolExecutor$Worker.run(ThreadPoolExecutor.java:628)
	at java.base/java.lang.Thread.run(Thread.java:829)
Caused by: java.lang.UnsupportedClassVersionError: Failed to load jenkins.security.MasterToSlaveCallable
	at hudson.remoting.RemoteClassLoader.loadClassFile(RemoteClassLoader.java:472)
	at hudson.remoting.RemoteClassLoader.loadRemoteClass(RemoteClassLoader.java:301)
	at hudson.remoting.RemoteClassLoader.loadWithMultiClassLoader(RemoteClassLoader.java:277)
	at hudson.remoting.RemoteClassLoader.findClass(RemoteClassLoader.java:236)
	at java.base/java.lang.ClassLoader.loadClass(ClassLoader.java:594)
	at java.base/java.lang.ClassLoader.loadClass(ClassLoader.java:527)
	at java.base/java.lang.ClassLoader.defineClass1(Native Method)
	at java.base/java.lang.ClassLoader.defineClass(ClassLoader.java:1022)
	at java.base/java.lang.ClassLoader.defineClass(ClassLoader.java:883)
	at hudson.remoting.RemoteClassLoader.loadClassFile(RemoteClassLoader.java:470)
	... 23 more
Caused by: java.lang.UnsupportedClassVersionError: jenkins/security/MasterToSlaveCallable has been compiled by a more recent version of the Java Runtime (class file version 61.0), this version of the Java Runtime only recognizes class file versions up to 55.0
	at java.base/java.lang.ClassLoader.defineClass1(Native Method)
	at java.base/java.lang.ClassLoader.defineClass(ClassLoader.java:1022)
	at java.base/java.lang.ClassLoader.defineClass(ClassLoader.java:883)
	at hudson.remoting.RemoteClassLoader.loadClassFile(RemoteClassLoader.java:470)
	... 32 more

ERROR: ================================================================================
ERROR: Invalid project setup: Failed to load hudson.maven.AbstractMavenProcessFactory$ConfigureOriginalJDK
ERROR: Processing failed due to a bug in the code. Please report this to the issue tracker (https://jenkins.io/redirect/report-an-issue).
java.lang.NullPointerException: Cannot invoke "hudson.model.JDK.getName()" because "jdk" is null
	at PluginClassLoader for maven-plugin//hudson.maven.AbstractMavenProcessFactory.newProcess(AbstractMavenProcessFactory.java:308)
	at PluginClassLoader for maven-plugin//hudson.maven.ProcessCache.get(ProcessCache.java:236)
	at PluginClassLoader for maven-plugin//hudson.maven.MavenModuleSetBuild$MavenModuleSetBuildExecution.doRun(MavenModuleSetBuild.java:802)
	at hudson.model.AbstractBuild$AbstractBuildExecution.run(AbstractBuild.java:527)
	at hudson.model.Run.execute(Run.java:1833)
	at PluginClassLoader for maven-plugin//hudson.maven.MavenModuleSetBuild.run(MavenModuleSetBuild.java:543)
	at hudson.model.ResourceController.execute(ResourceController.java:101)
	at hudson.model.Executor.run(Executor.java:446)
project=hudson.maven.MavenModuleSet@c1ae30e[Commons/commons-net]
project.getModules()=[hudson.maven.MavenModule@6fdb9a[Commons/commons-net/commons-net:commons-net][Commons/commons-net/commons-net:commons-net][relativePath:]]
project.getRootModule()=hudson.maven.MavenModule@6fdb9a[Commons/commons-net/commons-net:commons-net][Commons/commons-net/commons-net:commons-net][relativePath:]
FATAL: Cannot invoke "hudson.model.JDK.getName()" because "jdk" is null
java.lang.NullPointerException: Cannot invoke "hudson.model.JDK.getName()" because "jdk" is null
	at PluginClassLoader for maven-plugin//hudson.maven.AbstractMavenProcessFactory.newProcess(AbstractMavenProcessFactory.java:308)
	at PluginClassLoader for maven-plugin//hudson.maven.ProcessCache.get(ProcessCache.java:236)
	at PluginClassLoader for maven-plugin//hudson.maven.MavenModuleSetBuild$MavenModuleSetBuildExecution.doRun(MavenModuleSetBuild.java:802)
	at hudson.model.AbstractBuild$AbstractBuildExecution.run(AbstractBuild.java:527)
	at hudson.model.Run.execute(Run.java:1833)
	at PluginClassLoader for maven-plugin//hudson.maven.MavenModuleSetBuild.run(MavenModuleSetBuild.java:543)
	at hudson.model.ResourceController.execute(ResourceController.java:101)
	at hudson.model.Executor.run(Executor.java:446)
No JDK named ‘jdk_16_latest’ found
No JDK named ‘jdk_16_latest’ found

Build failed in Jenkins: Commons » commons-net #832

Posted by Apache Jenkins Server <je...@builds.apache.org>.
See <https://ci-builds.apache.org/job/Commons/job/commons-net/832/display/redirect?page=changes>

Changes:

[Sebb] Dependabot => quarterly


------------------------------------------
Started by an SCM change
Running as SYSTEM
[EnvInject] - Loading node environment variables.
Building remotely on builds57 (ubuntu ubuntu-avx) in workspace <https://ci-builds.apache.org/job/Commons/job/commons-net/ws/>
The recommended git tool is: NONE
No credentials specified
Wiping out workspace first.
Cloning the remote Git repository
Cloning repository https://github.com/apache/commons-net
 > git init <https://ci-builds.apache.org/job/Commons/job/commons-net/ws/> # timeout=10
Fetching upstream changes from https://github.com/apache/commons-net
 > git --version # timeout=10
 > git --version # 'git version 2.34.1'
 > git fetch --tags --force --progress -- https://github.com/apache/commons-net +refs/heads/*:refs/remotes/origin/* # timeout=10
 > git config remote.origin.url https://github.com/apache/commons-net # timeout=10
 > git config --add remote.origin.fetch +refs/heads/*:refs/remotes/origin/* # timeout=10
Avoid second fetch
 > git rev-parse refs/remotes/origin/master^{commit} # timeout=10
Checking out Revision 8bb87895dee561d84abd6567bedb739b330fa738 (refs/remotes/origin/master)
 > git config core.sparsecheckout # timeout=10
 > git checkout -f 8bb87895dee561d84abd6567bedb739b330fa738 # timeout=10
Commit message: "Dependabot => quarterly"
 > git rev-list --no-walk 6aa7edac3d71e1d1393431809af087cf73e8ca5b # timeout=10
Parsing POMs
Established TCP socket on 40397
maven35-agent.jar already up to date
maven35-interceptor.jar already up to date
maven3-interceptor-commons.jar already up to date
[commons-net] $ /home/jenkins/tools/java/latest16/bin/java -cp /home/jenkins/jenkins-agent/maven35-agent.jar:/home/jenkins/tools/maven/latest3/boot/plexus-classworlds-2.9.0.jar:/home/jenkins/tools/maven/latest3/conf/logging jenkins.maven3.agent.Maven35Main /home/jenkins/tools/maven/latest3 /home/jenkins/jenkins-agent/agent.jar /home/jenkins/jenkins-agent/maven35-interceptor.jar /home/jenkins/jenkins-agent/maven3-interceptor-commons.jar 40397
ERROR: Failed to parse POMs
java.io.IOException: Cannot run program "/home/jenkins/tools/java/latest16/bin/java" (in directory "<https://ci-builds.apache.org/job/Commons/job/commons-net/ws/")>: error=2, No such file or directory
	at java.base/java.lang.ProcessBuilder.start(ProcessBuilder.java:1143)
	at java.base/java.lang.ProcessBuilder.start(ProcessBuilder.java:1073)
	at hudson.Proc$LocalProc.<init>(Proc.java:252)
	at hudson.Proc$LocalProc.<init>(Proc.java:221)
	at hudson.Launcher$LocalLauncher.launch(Launcher.java:994)
	at hudson.Launcher$ProcStarter.start(Launcher.java:506)
	at hudson.Launcher$RemoteLaunchCallable.call(Launcher.java:1395)
	at hudson.Launcher$RemoteLaunchCallable.call(Launcher.java:1337)
	at hudson.remoting.UserRequest.perform(UserRequest.java:225)
	at hudson.remoting.UserRequest.perform(UserRequest.java:50)
	at hudson.remoting.Request$2.run(Request.java:391)
	at hudson.remoting.InterceptingExecutorService.lambda$wrap$0(InterceptingExecutorService.java:81)
	at java.base/java.util.concurrent.FutureTask.run(FutureTask.java:264)
	at java.base/java.util.concurrent.ThreadPoolExecutor.runWorker(ThreadPoolExecutor.java:1136)
	at java.base/java.util.concurrent.ThreadPoolExecutor$Worker.run(ThreadPoolExecutor.java:635)
	at java.base/java.lang.Thread.run(Thread.java:840)
	Suppressed: hudson.remoting.Channel$CallSiteStackTrace: Remote call to builds57
		at hudson.remoting.Channel.attachCallSiteStackTrace(Channel.java:1923)
		at hudson.remoting.UserRequest$ExceptionResponse.retrieve(UserRequest.java:384)
		at hudson.remoting.Channel.call(Channel.java:1112)
		at hudson.Launcher$RemoteLauncher.launch(Launcher.java:1121)
		at hudson.Launcher$ProcStarter.start(Launcher.java:506)
		at PluginClassLoader for maven-plugin//hudson.maven.AbstractMavenProcessFactory.newProcess(AbstractMavenProcessFactory.java:282)
		at PluginClassLoader for maven-plugin//hudson.maven.ProcessCache.get(ProcessCache.java:236)
		at PluginClassLoader for maven-plugin//hudson.maven.MavenModuleSetBuild$MavenModuleSetBuildExecution.doRun(MavenModuleSetBuild.java:802)
		at hudson.model.AbstractBuild$AbstractBuildExecution.run(AbstractBuild.java:527)
		at hudson.model.Run.execute(Run.java:1833)
		at PluginClassLoader for maven-plugin//hudson.maven.MavenModuleSetBuild.run(MavenModuleSetBuild.java:543)
		at hudson.model.ResourceController.execute(ResourceController.java:101)
		at hudson.model.Executor.run(Executor.java:446)
Caused by: java.io.IOException: error=2, No such file or directory
	at java.base/java.lang.ProcessImpl.forkAndExec(Native Method)
	at java.base/java.lang.ProcessImpl.<init>(ProcessImpl.java:314)
	at java.base/java.lang.ProcessImpl.start(ProcessImpl.java:244)
	at java.base/java.lang.ProcessBuilder.start(ProcessBuilder.java:1110)
	... 15 more

Build failed in Jenkins: Commons » commons-net #831

Posted by Apache Jenkins Server <je...@builds.apache.org>.
See <https://ci-builds.apache.org/job/Commons/job/commons-net/831/display/redirect?page=changes>

Changes:

[github] Bump org.apache.commons:commons-parent from 91 to 92

[github] Bump org.apache.commons:commons-parent from 91 to 92 #388


------------------------------------------
Started by an SCM change
Running as SYSTEM
[EnvInject] - Loading node environment variables.
Building remotely on builds57 (ubuntu ubuntu-avx) in workspace <https://ci-builds.apache.org/job/Commons/job/commons-net/ws/>
The recommended git tool is: NONE
No credentials specified
Wiping out workspace first.
Cloning the remote Git repository
Cloning repository https://github.com/apache/commons-net
 > git init <https://ci-builds.apache.org/job/Commons/job/commons-net/ws/> # timeout=10
Fetching upstream changes from https://github.com/apache/commons-net
 > git --version # timeout=10
 > git --version # 'git version 2.34.1'
 > git fetch --tags --force --progress -- https://github.com/apache/commons-net +refs/heads/*:refs/remotes/origin/* # timeout=10
 > git config remote.origin.url https://github.com/apache/commons-net # timeout=10
 > git config --add remote.origin.fetch +refs/heads/*:refs/remotes/origin/* # timeout=10
Avoid second fetch
 > git rev-parse refs/remotes/origin/master^{commit} # timeout=10
Checking out Revision 6aa7edac3d71e1d1393431809af087cf73e8ca5b (refs/remotes/origin/master)
 > git config core.sparsecheckout # timeout=10
 > git checkout -f 6aa7edac3d71e1d1393431809af087cf73e8ca5b # timeout=10
Commit message: "Bump org.apache.commons:commons-parent from 91 to 92 #388"
 > git rev-list --no-walk 38a30fb9bbebd6f5a4ab1f2d3ccfe6a23d6ba66b # timeout=10
Parsing POMs
Downloaded artifact https://repo.maven.apache.org/maven2/org/apache/commons/commons-parent/92/commons-parent-92.pom
Modules changed, recalculating dependency graph
Established TCP socket on 39047
maven35-agent.jar already up to date
maven35-interceptor.jar already up to date
maven3-interceptor-commons.jar already up to date
[commons-net] $ /home/jenkins/tools/java/latest16/bin/java -cp /home/jenkins/jenkins-agent/maven35-agent.jar:/home/jenkins/tools/maven/latest3/boot/plexus-classworlds-2.9.0.jar:/home/jenkins/tools/maven/latest3/conf/logging jenkins.maven3.agent.Maven35Main /home/jenkins/tools/maven/latest3 /home/jenkins/jenkins-agent/agent.jar /home/jenkins/jenkins-agent/maven35-interceptor.jar /home/jenkins/jenkins-agent/maven3-interceptor-commons.jar 39047
ERROR: Failed to parse POMs
java.io.IOException: Cannot run program "/home/jenkins/tools/java/latest16/bin/java" (in directory "<https://ci-builds.apache.org/job/Commons/job/commons-net/ws/")>: error=2, No such file or directory
	at java.base/java.lang.ProcessBuilder.start(ProcessBuilder.java:1143)
	at java.base/java.lang.ProcessBuilder.start(ProcessBuilder.java:1073)
	at hudson.Proc$LocalProc.<init>(Proc.java:252)
	at hudson.Proc$LocalProc.<init>(Proc.java:221)
	at hudson.Launcher$LocalLauncher.launch(Launcher.java:994)
	at hudson.Launcher$ProcStarter.start(Launcher.java:506)
	at hudson.Launcher$RemoteLaunchCallable.call(Launcher.java:1395)
	at hudson.Launcher$RemoteLaunchCallable.call(Launcher.java:1337)
	at hudson.remoting.UserRequest.perform(UserRequest.java:225)
	at hudson.remoting.UserRequest.perform(UserRequest.java:50)
	at hudson.remoting.Request$2.run(Request.java:391)
	at hudson.remoting.InterceptingExecutorService.lambda$wrap$0(InterceptingExecutorService.java:81)
	at java.base/java.util.concurrent.FutureTask.run(FutureTask.java:264)
	at java.base/java.util.concurrent.ThreadPoolExecutor.runWorker(ThreadPoolExecutor.java:1136)
	at java.base/java.util.concurrent.ThreadPoolExecutor$Worker.run(ThreadPoolExecutor.java:635)
	at java.base/java.lang.Thread.run(Thread.java:840)
	Suppressed: hudson.remoting.Channel$CallSiteStackTrace: Remote call to builds57
		at hudson.remoting.Channel.attachCallSiteStackTrace(Channel.java:1923)
		at hudson.remoting.UserRequest$ExceptionResponse.retrieve(UserRequest.java:384)
		at hudson.remoting.Channel.call(Channel.java:1112)
		at hudson.Launcher$RemoteLauncher.launch(Launcher.java:1121)
		at hudson.Launcher$ProcStarter.start(Launcher.java:506)
		at PluginClassLoader for maven-plugin//hudson.maven.AbstractMavenProcessFactory.newProcess(AbstractMavenProcessFactory.java:282)
		at PluginClassLoader for maven-plugin//hudson.maven.ProcessCache.get(ProcessCache.java:236)
		at PluginClassLoader for maven-plugin//hudson.maven.MavenModuleSetBuild$MavenModuleSetBuildExecution.doRun(MavenModuleSetBuild.java:802)
		at hudson.model.AbstractBuild$AbstractBuildExecution.run(AbstractBuild.java:527)
		at hudson.model.Run.execute(Run.java:1833)
		at PluginClassLoader for maven-plugin//hudson.maven.MavenModuleSetBuild.run(MavenModuleSetBuild.java:543)
		at hudson.model.ResourceController.execute(ResourceController.java:101)
		at hudson.model.Executor.run(Executor.java:446)
Caused by: java.io.IOException: error=2, No such file or directory
	at java.base/java.lang.ProcessImpl.forkAndExec(Native Method)
	at java.base/java.lang.ProcessImpl.<init>(ProcessImpl.java:314)
	at java.base/java.lang.ProcessImpl.start(ProcessImpl.java:244)
	at java.base/java.lang.ProcessBuilder.start(ProcessBuilder.java:1110)
	... 15 more

Build failed in Jenkins: Commons » commons-net #830

Posted by Apache Jenkins Server <je...@builds.apache.org>.
See <https://ci-builds.apache.org/job/Commons/job/commons-net/830/display/redirect?page=changes>

Changes:

[github] Bump actions/dependency-review-action from 4.8.1 to 4.8.2

[github] Bump github/codeql-action from 4.31.2 to 4.31.3


------------------------------------------
Started by an SCM change
Running as SYSTEM
[EnvInject] - Loading node environment variables.
Building remotely on builds57 (ubuntu ubuntu-avx) in workspace <https://ci-builds.apache.org/job/Commons/job/commons-net/ws/>
The recommended git tool is: NONE
No credentials specified
Wiping out workspace first.
Cloning the remote Git repository
Cloning repository https://github.com/apache/commons-net
 > git init <https://ci-builds.apache.org/job/Commons/job/commons-net/ws/> # timeout=10
Fetching upstream changes from https://github.com/apache/commons-net
 > git --version # timeout=10
 > git --version # 'git version 2.34.1'
 > git fetch --tags --force --progress -- https://github.com/apache/commons-net +refs/heads/*:refs/remotes/origin/* # timeout=10
 > git config remote.origin.url https://github.com/apache/commons-net # timeout=10
 > git config --add remote.origin.fetch +refs/heads/*:refs/remotes/origin/* # timeout=10
Avoid second fetch
 > git rev-parse refs/remotes/origin/master^{commit} # timeout=10
Checking out Revision 38a30fb9bbebd6f5a4ab1f2d3ccfe6a23d6ba66b (refs/remotes/origin/master)
 > git config core.sparsecheckout # timeout=10
 > git checkout -f 38a30fb9bbebd6f5a4ab1f2d3ccfe6a23d6ba66b # timeout=10
Commit message: "Merge pull request #387 from apache/dependabot/github_actions/github/codeql-action-4.31.3"
 > git rev-list --no-walk 3892fd7b21a2b2bd7180d14b69f2541904c4f6a6 # timeout=10
Parsing POMs
Established TCP socket on 39155
maven35-agent.jar already up to date
maven35-interceptor.jar already up to date
maven3-interceptor-commons.jar already up to date
[commons-net] $ /home/jenkins/tools/java/latest16/bin/java -cp /home/jenkins/jenkins-agent/maven35-agent.jar:/home/jenkins/tools/maven/latest3/boot/plexus-classworlds-2.9.0.jar:/home/jenkins/tools/maven/latest3/conf/logging jenkins.maven3.agent.Maven35Main /home/jenkins/tools/maven/latest3 /home/jenkins/jenkins-agent/agent.jar /home/jenkins/jenkins-agent/maven35-interceptor.jar /home/jenkins/jenkins-agent/maven3-interceptor-commons.jar 39155
ERROR: Failed to parse POMs
java.io.IOException: Cannot run program "/home/jenkins/tools/java/latest16/bin/java" (in directory "<https://ci-builds.apache.org/job/Commons/job/commons-net/ws/")>: error=2, No such file or directory
	at java.base/java.lang.ProcessBuilder.start(ProcessBuilder.java:1143)
	at java.base/java.lang.ProcessBuilder.start(ProcessBuilder.java:1073)
	at hudson.Proc$LocalProc.<init>(Proc.java:252)
	at hudson.Proc$LocalProc.<init>(Proc.java:221)
	at hudson.Launcher$LocalLauncher.launch(Launcher.java:994)
	at hudson.Launcher$ProcStarter.start(Launcher.java:506)
	at hudson.Launcher$RemoteLaunchCallable.call(Launcher.java:1395)
	at hudson.Launcher$RemoteLaunchCallable.call(Launcher.java:1337)
	at hudson.remoting.UserRequest.perform(UserRequest.java:225)
	at hudson.remoting.UserRequest.perform(UserRequest.java:50)
	at hudson.remoting.Request$2.run(Request.java:391)
	at hudson.remoting.InterceptingExecutorService.lambda$wrap$0(InterceptingExecutorService.java:81)
	at java.base/java.util.concurrent.FutureTask.run(FutureTask.java:264)
	at java.base/java.util.concurrent.ThreadPoolExecutor.runWorker(ThreadPoolExecutor.java:1136)
	at java.base/java.util.concurrent.ThreadPoolExecutor$Worker.run(ThreadPoolExecutor.java:635)
	at java.base/java.lang.Thread.run(Thread.java:840)
	Suppressed: hudson.remoting.Channel$CallSiteStackTrace: Remote call to builds57
		at hudson.remoting.Channel.attachCallSiteStackTrace(Channel.java:1923)
		at hudson.remoting.UserRequest$ExceptionResponse.retrieve(UserRequest.java:384)
		at hudson.remoting.Channel.call(Channel.java:1112)
		at hudson.Launcher$RemoteLauncher.launch(Launcher.java:1121)
		at hudson.Launcher$ProcStarter.start(Launcher.java:506)
		at PluginClassLoader for maven-plugin//hudson.maven.AbstractMavenProcessFactory.newProcess(AbstractMavenProcessFactory.java:282)
		at PluginClassLoader for maven-plugin//hudson.maven.ProcessCache.get(ProcessCache.java:236)
		at PluginClassLoader for maven-plugin//hudson.maven.MavenModuleSetBuild$MavenModuleSetBuildExecution.doRun(MavenModuleSetBuild.java:802)
		at hudson.model.AbstractBuild$AbstractBuildExecution.run(AbstractBuild.java:527)
		at hudson.model.Run.execute(Run.java:1833)
		at PluginClassLoader for maven-plugin//hudson.maven.MavenModuleSetBuild.run(MavenModuleSetBuild.java:543)
		at hudson.model.ResourceController.execute(ResourceController.java:101)
		at hudson.model.Executor.run(Executor.java:446)
Caused by: java.io.IOException: error=2, No such file or directory
	at java.base/java.lang.ProcessImpl.forkAndExec(Native Method)
	at java.base/java.lang.ProcessImpl.<init>(ProcessImpl.java:314)
	at java.base/java.lang.ProcessImpl.start(ProcessImpl.java:244)
	at java.base/java.lang.ProcessBuilder.start(ProcessBuilder.java:1110)
	... 15 more