You are viewing a plain text version of this content. The canonical link for it is here.
Posted to builds@cassandra.apache.org by Apache Jenkins Server <je...@builds.apache.org> on 2023/03/22 13:46:28 UTC
Build complete: Cassandra-trunk #1500 [UNSTABLE] eee211fdbb517c1b0e0a8635e0813bda7cf655e5
-------------------------------------------------------------------------------
Build Cassandra-trunk #1500 Still Unstable
URL: https://ci-cassandra.apache.org/job/Cassandra-trunk/1500/
-------------------------------------------------------------------------------
Changes:
[Michael Semb Wever] Update OpenHFT dependencies (chronicle-queue, chronicle-core,
-------------------------------------------------------------------------------
Failed Tests:
11 tests failed.
FAILED: dtest-novnode.bootstrap_test.TestBootstrap.test_simultaneous_bootstrap
FAILED: dtest-novnode.replace_address_test.TestReplaceAddress.test_unsafe_replace
FAILED: dtest-novnode.transient_replication_test.TestTransientReplicationRepairStreamEntireSSTable.test_primary_range_repair
FAILED: dtest-novnode.cqlsh_tests.test_cqlsh_copy.TestCqlshCopy.test_bulk_round_trip_with_backoff
FAILED: dtest-novnode.repair_tests.repair_test.TestRepair.test_dc_parallel_repair
FAILED: dtest-upgrade.upgrade_tests.cql_tests.cls.test_limit_ranges
FAILED: dtest-upgrade.upgrade_tests.cql_tests.cls.test_indexed_with_eq
FAILED: org.apache.cassandra.db.compaction.LongLeveledCompactionStrategyTest.testLeveledScanner
FAILED: org.apache.cassandra.db.commitlog.CommitLogSegmentManagerCDCTest.testSwitchingCDCWriteModes
FAILED: dtest-upgrade.upgrade_tests.cql_tests.cls.test_dynamic_cf
FAILED: dtest.replace_address_test.TestReplaceAddress.test_fail_without_replace
-------------------------------------------------------------------------------
For complete test report and logs see https://nightlies.apache.org/cassandra/Cassandra-trunk/1500/