You are viewing a plain text version of this content. The canonical link for it is here.
Posted to builds@solr.apache.org by Apache Jenkins Server <je...@builds.apache.org> on 2026/09/07 19:03:07 UTC
[JENKINS] Solr » Solr-Test-main - Build # 14749 - Unstable!
Build: https://ci-builds.apache.org/job/Solr/job/Solr-Test-main/14749/
1 tests failed.
FAILED: org.apache.solr.cloud.RecoveryAfterSoftCommitTest.test
Error Message:
org.apache.solr.client.solrj.SolrServerException: IOException occurred when talking to server at: http://127.0.0.1:46511/solr/collection1_shard1_replica_n3/update
Stack Trace:
org.apache.solr.client.solrj.SolrServerException: IOException occurred when talking to server at: http://127.0.0.1:46511/solr/collection1_shard1_replica_n3/update
at __randomizedtesting.SeedInfo.seed([5B303761AD35AC72:D36408BB03C9C18A]:0)
at org.apache.solr.client.solrj.jetty.HttpJettySolrClient.request(HttpJettySolrClient.java:512)
at org.apache.solr.client.solrj.jetty.HttpJettySolrClient.lambda$requestWithBaseUrl$1(HttpJettySolrClient.java:540)
at org.apache.solr.client.solrj.jetty.HttpJettySolrClient.requestWithBaseUrl(HttpJettySolrClient.java:559)
at org.apache.solr.client.solrj.jetty.HttpJettySolrClient.requestWithBaseUrl(HttpJettySolrClient.java:540)
at org.apache.solr.client.solrj.impl.LBSolrClient.doRequest(LBSolrClient.java:626)
at org.apache.solr.client.solrj.impl.LBSolrClient.doRequest(LBSolrClient.java:614)
at org.apache.solr.client.solrj.impl.LBSolrClient.doRequest(LBSolrClient.java:639)
at org.apache.solr.client.solrj.impl.LBSolrClient.request(LBSolrClient.java:583)
at org.apache.solr.client.solrj.impl.CloudSolrClient.sendRequest(CloudSolrClient.java:1052)
at org.apache.solr.client.solrj.impl.CloudSolrClient.requestWithRetryOnStaleState(CloudSolrClient.java:683)
at org.apache.solr.client.solrj.impl.CloudSolrClient.request(CloudSolrClient.java:605)
at org.apache.solr.client.solrj.SolrRequest.process(SolrRequest.java:304)
at org.apache.solr.client.solrj.SolrClient.add(SolrClient.java:167)
at org.apache.solr.client.solrj.SolrClient.add(SolrClient.java:132)
at org.apache.solr.client.solrj.SolrClient.add(SolrClient.java:148)
at org.apache.solr.cloud.RecoveryAfterSoftCommitTest.test(RecoveryAfterSoftCommitTest.java:106)
at java.base/jdk.internal.reflect.DirectMethodHandleAccessor.invoke(DirectMethodHandleAccessor.java:103)
at java.base/java.lang.reflect.Method.invoke(Method.java:580)
at com.carrotsearch.randomizedtesting.RandomizedRunner.invoke(RandomizedRunner.java:1780)
at com.carrotsearch.randomizedtesting.RandomizedRunner$8.evaluate(RandomizedRunner.java:959)
at com.carrotsearch.randomizedtesting.RandomizedRunner$9.evaluate(RandomizedRunner.java:995)
at com.carrotsearch.randomizedtesting.RandomizedRunner$10.evaluate(RandomizedRunner.java:1009)
at org.apache.solr.BaseDistributedSearchTestCase$ShardsRepeatRule$ShardsFixedStatement.callStatement(BaseDistributedSearchTestCase.java:1080)
at org.apache.solr.BaseDistributedSearchTestCase$ShardsRepeatRule$ShardsStatement.evaluate(BaseDistributedSearchTestCase.java:1051)
at com.carrotsearch.randomizedtesting.rules.SystemPropertiesRestoreRule$1.evaluate(SystemPropertiesRestoreRule.java:80)
at org.junit.rules.RunRules.evaluate(RunRules.java:20)
at org.apache.lucene.tests.util.TestRuleSetupTeardownChained$1.evaluate(TestRuleSetupTeardownChained.java:48)
at org.apache.lucene.tests.util.AbstractBeforeAfterRule$1.evaluate(AbstractBeforeAfterRule.java:43)
at org.apache.lucene.tests.util.TestRuleThreadAndTestName$1.evaluate(TestRuleThreadAndTestName.java:45)
at org.apache.lucene.tests.util.TestRuleIgnoreAfterMaxFailures$1.evaluate(TestRuleIgnoreAfterMaxFailures.java:60)
at org.apache.lucene.tests.util.TestRuleMarkFailure$1.evaluate(TestRuleMarkFailure.java:44)
at org.junit.rules.RunRules.evaluate(RunRules.java:20)
at com.carrotsearch.randomizedtesting.rules.StatementAdapter.evaluate(StatementAdapter.java:36)
at com.carrotsearch.randomizedtesting.ThreadLeakControl$StatementRunner.run(ThreadLeakControl.java:390)
at com.carrotsearch.randomizedtesting.ThreadLeakControl.forkTimeoutingTask(ThreadLeakControl.java:843)
at com.carrotsearch.randomizedtesting.ThreadLeakControl$3.evaluate(ThreadLeakControl.java:490)
at com.carrotsearch.randomizedtesting.RandomizedRunner.runSingleTest(RandomizedRunner.java:968)
at com.carrotsearch.randomizedtesting.RandomizedRunner$5.evaluate(RandomizedRunner.java:853)
at com.carrotsearch.randomizedtesting.RandomizedRunner$6.evaluate(RandomizedRunner.java:904)
at com.carrotsearch.randomizedtesting.RandomizedRunner$7.evaluate(RandomizedRunner.java:915)
at com.carrotsearch.randomizedtesting.rules.StatementAdapter.evaluate(StatementAdapter.java:36)
at com.carrotsearch.randomizedtesting.rules.StatementAdapter.evaluate(StatementAdapter.java:36)
at org.apache.lucene.tests.util.AbstractBeforeAfterRule$1.evaluate(AbstractBeforeAfterRule.java:43)
at com.carrotsearch.randomizedtesting.rules.SystemPropertiesRestoreRule$1.evaluate(SystemPropertiesRestoreRule.java:80)
at org.junit.rules.RunRules.evaluate(RunRules.java:20)
at org.apache.lucene.tests.util.AbstractBeforeAfterRule$1.evaluate(AbstractBeforeAfterRule.java:43)
at com.carrotsearch.randomizedtesting.rules.StatementAdapter.evaluate(StatementAdapter.java:36)
at org.apache.lucene.tests.util.TestRuleStoreClassName$1.evaluate(TestRuleStoreClassName.java:38)
at com.carrotsearch.randomizedtesting.rules.NoShadowingOrOverridesOnMethodsRule$1.evaluate(NoShadowingOrOverridesOnMethodsRule.java:40)
at com.carrotsearch.randomizedtesting.rules.NoShadowingOrOverridesOnMethodsRule$1.evaluate(NoShadowingOrOverridesOnMethodsRule.java:40)
at com.carrotsearch.randomizedtesting.rules.StatementAdapter.evaluate(StatementAdapter.java:36)
at com.carrotsearch.randomizedtesting.rules.StatementAdapter.evaluate(StatementAdapter.java:36)
at org.apache.lucene.tests.util.TestRuleAssertionsRequired$1.evaluate(TestRuleAssertionsRequired.java:53)
at org.apache.lucene.tests.util.AbstractBeforeAfterRule$1.evaluate(AbstractBeforeAfterRule.java:43)
at org.apache.lucene.tests.util.TestRuleMarkFailure$1.evaluate(TestRuleMarkFailure.java:44)
at org.apache.lucene.tests.util.TestRuleIgnoreAfterMaxFailures$1.evaluate(TestRuleIgnoreAfterMaxFailures.java:60)
at org.apache.lucene.tests.util.TestRuleIgnoreTestSuites$1.evaluate(TestRuleIgnoreTestSuites.java:47)
at org.junit.rules.RunRules.evaluate(RunRules.java:20)
at com.carrotsearch.randomizedtesting.rules.StatementAdapter.evaluate(StatementAdapter.java:36)
at com.carrotsearch.randomizedtesting.ThreadLeakControl$StatementRunner.run(ThreadLeakControl.java:390)
at com.carrotsearch.randomizedtesting.ThreadLeakControl.lambda$forkTimeoutingTask$0(ThreadLeakControl.java:850)
at java.base/java.lang.Thread.run(Thread.java:1583)
Caused by: java.nio.channels.ClosedChannelException
at org.eclipse.jetty.http2.HTTP2Session$StreamsState.onShutdown(HTTP2Session.java:2179)
at org.eclipse.jetty.http2.HTTP2Session.onShutdown(HTTP2Session.java:1212)
at org.eclipse.jetty.http2.HTTP2Connection$HTTP2Producer.produce(HTTP2Connection.java:441)
at org.eclipse.jetty.util.thread.strategy.AdaptiveExecutionStrategy.produceTask(AdaptiveExecutionStrategy.java:509)
at org.eclipse.jetty.util.thread.strategy.AdaptiveExecutionStrategy.tryProduce(AdaptiveExecutionStrategy.java:251)
at org.eclipse.jetty.util.thread.strategy.AdaptiveExecutionStrategy.produce(AdaptiveExecutionStrategy.java:196)
at org.eclipse.jetty.http2.HTTP2Connection.produce(HTTP2Connection.java:237)
at org.eclipse.jetty.http2.HTTP2Connection.onFillable(HTTP2Connection.java:165)
at org.eclipse.jetty.http2.HTTP2Connection$FillableCallback.succeeded(HTTP2Connection.java:592)
at org.eclipse.jetty.io.FillInterest.fillable(FillInterest.java:105)
at org.eclipse.jetty.io.SelectableChannelEndPoint$1.run(SelectableChannelEndPoint.java:54)
at org.eclipse.jetty.util.thread.Invocable.invokeNonBlocking(Invocable.java:225)
at org.eclipse.jetty.util.thread.strategy.AdaptiveExecutionStrategy.picRunTask(AdaptiveExecutionStrategy.java:473)
at org.eclipse.jetty.util.thread.strategy.AdaptiveExecutionStrategy.consumeTask(AdaptiveExecutionStrategy.java:399)
at org.eclipse.jetty.util.thread.strategy.AdaptiveExecutionStrategy.tryProduce(AdaptiveExecutionStrategy.java:255)
at org.eclipse.jetty.util.thread.strategy.AdaptiveExecutionStrategy.produce(AdaptiveExecutionStrategy.java:196)
at org.apache.solr.common.util.ExecutorUtil$MDCAwareThreadPoolExecutor.lambda$execute$0(ExecutorUtil.java:390)
at java.base/java.util.concurrent.ThreadPoolExecutor.runWorker(ThreadPoolExecutor.java:1144)
at java.base/java.util.concurrent.ThreadPoolExecutor$Worker.run(ThreadPoolExecutor.java:642)
... 1 more
Suppressed: org.eclipse.jetty.io.EofException: Broken pipe
at org.eclipse.jetty.io.SocketChannelEndPoint.flush(SocketChannelEndPoint.java:118)
at org.eclipse.jetty.io.WriteFlusher.flush(WriteFlusher.java:461)
at org.eclipse.jetty.io.WriteFlusher.write(WriteFlusher.java:309)
at org.eclipse.jetty.io.WriteFlusher.write(WriteFlusher.java:288)
at org.eclipse.jetty.io.AbstractEndPoint.write(AbstractEndPoint.java:350)
at org.eclipse.jetty.io.EndPoint.write(EndPoint.java:332)
at org.eclipse.jetty.io.RetainableByteBuffer.writeTo(RetainableByteBuffer.java:503)
at org.eclipse.jetty.io.RetainableByteBuffer$DynamicCapacity.writeTo(RetainableByteBuffer.java:2407)
at org.eclipse.jetty.http2.internal.HTTP2Flusher.process(HTTP2Flusher.java:333)
at org.eclipse.jetty.util.IteratingCallback.processing(IteratingCallback.java:374)
at org.eclipse.jetty.util.IteratingCallback.iterate(IteratingCallback.java:351)
at org.eclipse.jetty.http2.HTTP2Session.frame(HTTP2Session.java:989)
at org.eclipse.jetty.http2.HTTP2Session.data(HTTP2Session.java:976)
at org.eclipse.jetty.http2.HTTP2Stream.data(HTTP2Stream.java:161)
at org.eclipse.jetty.http2.client.transport.internal.HttpSenderOverHTTP2.sendContent(HttpSenderOverHTTP2.java:172)
at org.eclipse.jetty.client.transport.HttpSender$ContentSender.process(HttpSender.java:574)
at org.eclipse.jetty.util.IteratingCallback.processing(IteratingCallback.java:374)
at org.eclipse.jetty.util.IteratingCallback.lambda$doOnSuccessProcessing$0(IteratingCallback.java:271)
at org.eclipse.jetty.util.ExceptionUtil.callAndThen(ExceptionUtil.java:503)
at org.eclipse.jetty.util.IteratingCallback.doOnSuccessProcessing(IteratingCallback.java:271)
at org.eclipse.jetty.util.IteratingCallback.succeeded(IteratingCallback.java:586)
at org.eclipse.jetty.io.content.AsyncContent.runDemandCallback(AsyncContent.java:241)
at org.eclipse.jetty.io.content.AsyncContent.invokeDemandCallback(AsyncContent.java:234)
at org.eclipse.jetty.util.thread.SerializedInvoker$Link.run(SerializedInvoker.java:274)
at org.eclipse.jetty.util.thread.SerializedInvoker.run(SerializedInvoker.java:174)
at org.eclipse.jetty.io.content.AsyncContent.offer(AsyncContent.java:120)
at org.eclipse.jetty.io.content.AsyncContent.write(AsyncContent.java:77)
at org.eclipse.jetty.io.content.OutputStreamContentSource$AsyncOutputStream.write(OutputStreamContentSource.java:89)
at org.apache.solr.common.util.FastOutputStream.flush(FastOutputStream.java:207)
at org.apache.solr.common.util.FastOutputStream.flushBuffer(FastOutputStream.java:200)
at org.apache.solr.common.util.JavaBinCodec.marshal(JavaBinCodec.java:174)
at org.apache.solr.client.solrj.request.JavaBinUpdateRequestCodec.marshal(JavaBinUpdateRequestCodec.java:88)
at org.apache.solr.client.solrj.request.JavaBinRequestWriter$1.write(JavaBinRequestWriter.java:40)
at org.apache.solr.client.solrj.jetty.HttpJettySolrClient.sendRequest(HttpJettySolrClient.java:763)
at org.apache.solr.client.solrj.jetty.HttpJettySolrClient.request(HttpJettySolrClient.java:478)
at org.apache.solr.client.solrj.jetty.HttpJettySolrClient.lambda$requestWithBaseUrl$1(HttpJettySolrClient.java:540)
at org.apache.solr.client.solrj.jetty.HttpJettySolrClient.requestWithBaseUrl(HttpJettySolrClient.java:559)
at org.apache.solr.client.solrj.jetty.HttpJettySolrClient.requestWithBaseUrl(HttpJettySolrClient.java:540)
at org.apache.solr.client.solrj.impl.LBSolrClient.doRequest(LBSolrClient.java:626)
at org.apache.solr.client.solrj.impl.LBSolrClient.doRequest(LBSolrClient.java:614)
at org.apache.solr.client.solrj.impl.LBSolrClient.doRequest(LBSolrClient.java:639)
at org.apache.solr.client.solrj.impl.LBSolrClient.request(LBSolrClient.java:583)
at org.apache.solr.client.solrj.impl.CloudSolrClient.sendRequest(CloudSolrClient.java:1052)
at org.apache.solr.client.solrj.impl.CloudSolrClient.requestWithRetryOnStaleState(CloudSolrClient.java:683)
at org.apache.solr.client.solrj.impl.CloudSolrClient.request(CloudSolrClient.java:605)
at org.apache.solr.client.solrj.SolrRequest.process(SolrRequest.java:304)
at org.apache.solr.client.solrj.SolrClient.add(SolrClient.java:167)
at org.apache.solr.client.solrj.SolrClient.add(SolrClient.java:132)
at org.apache.solr.client.solrj.SolrClient.add(SolrClient.java:148)
at org.apache.solr.cloud.RecoveryAfterSoftCommitTest.test(RecoveryAfterSoftCommitTest.java:106)
at java.base/jdk.internal.reflect.DirectMethodHandleAccessor.invoke(DirectMethodHandleAccessor.java:103)
at java.base/java.lang.reflect.Method.invoke(Method.java:580)
at com.carrotsearch.randomizedtesting.RandomizedRunner.invoke(RandomizedRunner.java:1780)
at com.carrotsearch.randomizedtesting.RandomizedRunner$8.evaluate(RandomizedRunner.java:959)
at com.carrotsearch.randomizedtesting.RandomizedRunner$9.evaluate(RandomizedRunner.java:995)
at com.carrotsearch.randomizedtesting.RandomizedRunner$10.evaluate(RandomizedRunner.java:1009)
at org.apache.solr.BaseDistributedSearchTestCase$ShardsRepeatRule$ShardsFixedStatement.callStatement(BaseDistributedSearchTestCase.java:1080)
at org.apache.solr.BaseDistributedSearchTestCase$ShardsRepeatRule$ShardsStatement.evaluate(BaseDistributedSearchTestCase.java:1051)
at com.carrotsearch.randomizedtesting.rules.SystemPropertiesRestoreRule$1.evaluate(SystemPropertiesRestoreRule.java:80)
at org.junit.rules.RunRules.evaluate(RunRules.java:20)
at org.apache.lucene.tests.util.TestRuleSetupTeardownChained$1.evaluate(TestRuleSetupTeardownChained.java:48)
at org.apache.lucene.tests.util.AbstractBeforeAfterRule$1.evaluate(AbstractBeforeAfterRule.java:43)
at org.apache.lucene.tests.util.TestRuleThreadAndTestName$1.evaluate(TestRuleThreadAndTestName.java:45)
at org.apache.lucene.tests.util.TestRuleIgnoreAfterMaxFailures$1.evaluate(TestRuleIgnoreAfterMaxFailures.java:60)
at org.apache.lucene.tests.util.TestRuleMarkFailure$1.evaluate(TestRuleMarkFailure.java:44)
at org.junit.rules.RunRules.evaluate(RunRules.java:20)
at com.carrotsearch.randomizedtesting.rules.StatementAdapter.evaluate(StatementAdapter.java:36)
at com.carrotsearch.randomizedtesting.ThreadLeakControl$StatementRunner.run(ThreadLeakControl.java:390)
at com.carrotsearch.randomizedtesting.ThreadLeakControl.forkTimeoutingTask(ThreadLeakControl.java:843)
at com.carrotsearch.randomizedtesting.ThreadLeakControl$3.evaluate(ThreadLeakControl.java:490)
at com.carrotsearch.randomizedtesting.RandomizedRunner.runSingleTest(RandomizedRunner.java:968)
at com.carrotsearch.randomizedtesting.RandomizedRunner$5.evaluate(RandomizedRunner.java:853)
at com.carrotsearch.randomizedtesting.RandomizedRunner$6.evaluate(RandomizedRunner.java:904)
at com.carrotsearch.randomizedtesting.RandomizedRunner$7.evaluate(RandomizedRunner.java:915)
at com.carrotsearch.randomizedtesting.rules.StatementAdapter.evaluate(StatementAdapter.java:36)
at com.carrotsearch.randomizedtesting.rules.StatementAdapter.evaluate(StatementAdapter.java:36)
at org.apache.lucene.tests.util.AbstractBeforeAfterRule$1.evaluate(AbstractBeforeAfterRule.java:43)
at com.carrotsearch.randomizedtesting.rules.SystemPropertiesRestoreRule$1.evaluate(SystemPropertiesRestoreRule.java:80)
at org.junit.rules.RunRules.evaluate(RunRules.java:20)
at org.apache.lucene.tests.util.AbstractBeforeAfterRule$1.evaluate(AbstractBeforeAfterRule.java:43)
at com.carrotsearch.randomizedtesting.rules.StatementAdapter.evaluate(StatementAdapter.java:36)
at org.apache.lucene.tests.util.TestRuleStoreClassName$1.evaluate(TestRuleStoreClassName.java:38)
at com.carrotsearch.randomizedtesting.rules.NoShadowingOrOverridesOnMethodsRule$1.evaluate(NoShadowingOrOverridesOnMethodsRule.java:40)
at com.carrotsearch.randomizedtesting.rules.NoShadowingOrOverridesOnMethodsRule$1.evaluate(NoShadowingOrOverridesOnMethodsRule.java:40)
at com.carrotsearch.randomizedtesting.rules.StatementAdapter.evaluate(StatementAdapter.java:36)
at com.carrotsearch.randomizedtesting.rules.StatementAdapter.evaluate(StatementAdapter.java:36)
at org.apache.lucene.tests.util.TestRuleAssertionsRequired$1.evaluate(TestRuleAssertionsRequired.java:53)
at org.apache.lucene.tests.util.AbstractBeforeAfterRule$1.evaluate(AbstractBeforeAfterRule.java:43)
at org.apache.lucene.tests.util.TestRuleMarkFailure$1.evaluate(TestRuleMarkFailure.java:44)
at org.apache.lucene.tests.util.TestRuleIgnoreAfterMaxFailures$1.evaluate(TestRuleIgnoreAfterMaxFailures.java:60)
at org.apache.lucene.tests.util.TestRuleIgnoreTestSuites$1.evaluate(TestRuleIgnoreTestSuites.java:47)
at org.junit.rules.RunRules.evaluate(RunRules.java:20)
at com.carrotsearch.randomizedtesting.rules.StatementAdapter.evaluate(StatementAdapter.java:36)
at com.carrotsearch.randomizedtesting.ThreadLeakControl$StatementRunner.run(ThreadLeakControl.java:390)
at com.carrotsearch.randomizedtesting.ThreadLeakControl.lambda$forkTimeoutingTask$0(ThreadLeakControl.java:850)
... 1 more
Caused by: java.io.IOException: Broken pipe
at java.base/sun.nio.ch.SocketDispatcher.writev0(Native Method)
at java.base/sun.nio.ch.SocketDispatcher.writev(SocketDispatcher.java:66)
at java.base/sun.nio.ch.IOUtil.write(IOUtil.java:227)
at java.base/sun.nio.ch.IOUtil.write(IOUtil.java:158)
at java.base/sun.nio.ch.SocketChannelImpl.write(SocketChannelImpl.java:574)
at java.base/java.nio.channels.SocketChannel.write(SocketChannel.java:660)
at org.eclipse.jetty.io.SocketChannelEndPoint.flush(SocketChannelEndPoint.java:112)
... 95 more
Build Log:
[...truncated 11 lines...]
ERROR: Workspace has a .git repository, but it appears to be corrupt.
hudson.plugins.git.GitException: Command "git rev-parse --resolve-git-dir /home/jenkins/jenkins-agent/workspace/Solr/Solr-Test-main/.git" returned status code 128:
stdout:
stderr: fatal: not a gitdir '/home/jenkins/jenkins-agent/workspace/Solr/Solr-Test-main/.git'
at PluginClassLoader for git-client//org.jenkinsci.plugins.gitclient.CliGitAPIImpl.launchCommandIn(CliGitAPIImpl.java:2848)
at PluginClassLoader for git-client//org.jenkinsci.plugins.gitclient.CliGitAPIImpl.launchCommandIn(CliGitAPIImpl.java:2768)
at PluginClassLoader for git-client//org.jenkinsci.plugins.gitclient.CliGitAPIImpl.launchCommandIn(CliGitAPIImpl.java:2763)
at PluginClassLoader for git-client//org.jenkinsci.plugins.gitclient.CliGitAPIImpl.launchCommand(CliGitAPIImpl.java:2052)
at PluginClassLoader for git-client//org.jenkinsci.plugins.gitclient.CliGitAPIImpl.launchCommand(CliGitAPIImpl.java:2064)
at PluginClassLoader for git-client//org.jenkinsci.plugins.gitclient.CliGitAPIImpl.hasGitRepo(CliGitAPIImpl.java:404)
at PluginClassLoader for git-client//hudson.plugins.git.GitAPI.hasGitRepo(GitAPI.java:281)
at jdk.internal.reflect.GeneratedMethodAccessor30.invoke(Unknown Source)
at java.base/jdk.internal.reflect.DelegatingMethodAccessorImpl.invoke(DelegatingMethodAccessorImpl.java:43)
at java.base/java.lang.reflect.Method.invoke(Method.java:569)
at hudson.remoting.RemoteInvocationHandler$RPCRequest.perform(RemoteInvocationHandler.java:986)
at hudson.remoting.RemoteInvocationHandler$RPCRequest.call(RemoteInvocationHandler.java:961)
at hudson.remoting.RemoteInvocationHandler$RPCRequest.call(RemoteInvocationHandler.java:907)
at hudson.remoting.UserRequest.perform(UserRequest.java:225)
at hudson.remoting.UserRequest.perform(UserRequest.java:50)
at hudson.remoting.Request$2.run(Request.java:391)
at hudson.remoting.InterceptingExecutorService.lambda$wrap$0(InterceptingExecutorService.java:81)
at java.base/java.util.concurrent.FutureTask.run(FutureTask.java:264)
at java.base/java.util.concurrent.ThreadPoolExecutor.runWorker(ThreadPoolExecutor.java:1136)
at java.base/java.util.concurrent.ThreadPoolExecutor$Worker.run(ThreadPoolExecutor.java:635)
at java.base/java.lang.Thread.run(Thread.java:840)
Cloning the remote Git repository
Cloning repository https://gitbox.apache.org/repos/asf/solr.git
> git init /home/jenkins/jenkins-agent/workspace/Solr/Solr-Test-main # timeout=10
Fetching upstream changes from https://gitbox.apache.org/repos/asf/solr.git
> git --version # timeout=10
> git --version # 'git version 2.43.0'
> git fetch --tags --force --progress -- https://gitbox.apache.org/repos/asf/solr.git +refs/heads/*:refs/remotes/origin/* # timeout=10
> git config remote.origin.url https://gitbox.apache.org/repos/asf/solr.git # timeout=10
> git config --add remote.origin.fetch +refs/heads/*:refs/remotes/origin/* # timeout=10
Avoid second fetch
> git rev-parse refs/remotes/origin/main^{commit} # timeout=10
Checking out Revision 108870ea40afc08af1db9e74d08ca1f98cb8abab (refs/remotes/origin/main)
> git config core.sparsecheckout # timeout=10
> git checkout -f 108870ea40afc08af1db9e74d08ca1f98cb8abab # timeout=10
> git branch -a -v --no-abbrev # timeout=10
> git checkout -b main 108870ea40afc08af1db9e74d08ca1f98cb8abab # timeout=10
Commit message: "SOLR-18417: Deprecate v1 PingRequestHandler and related code (#4872)"
> git rev-list --no-walk 108870ea40afc08af1db9e74d08ca1f98cb8abab # timeout=10
No emails were triggered.
provisioning config files...
copy managed file [gradle.properties] to file:/home/jenkins/jenkins-agent/workspace/Solr/Solr-Test-main/gradle.properties
[Gradle] - Launching build.
[Solr-Test-main] $ /home/jenkins/jenkins-agent/workspace/Solr/Solr-Test-main/gradlew -Dtests.haltonfailure=false -Dtests.badapples=false --continue test
Downloading gradle-wrapper.jar from https://raw.githubusercontent.com/gradle/gradle/v8.10.2/gradle/wrapper/gradle-wrapper.jar
To honour the JVM settings for this build a single-use Daemon process will be forked. For more on this, please refer to https://docs.gradle.org/9.7.0/userguide/gradle_daemon.html#sec:disabling_the_daemon in the Gradle documentation.
Daemon will be stopped at the end of the build
> Task :build-infra:compileJava
Note: /home/jenkins/jenkins-agent/workspace/Solr/Solr-Test-main/build-tools/build-infra/src/main/java/org/apache/lucene/gradle/Checksum.java uses or overrides a deprecated API.
Note: Recompile with -Xlint:deprecation for details.
> Task :build-infra:pluginDescriptors
> Task :build-infra:processResources
> Task :build-infra:classes
> Task :build-infra:jar
> Configure project :
The com.github.ben-manes.versions plugin id is deprecated; apply io.github.ben-manes.versions instead.
> Task :gitStatus
> Task :checkJdkInternalsExportedToGradle
> Task :solr:api:compileJava
Note: Some input files use or override a deprecated API.
Note: Recompile with -Xlint:deprecation for details.
> Task :solr:api:processResources NO-SOURCE
> Task :solr:api:classes
> Task :solr:api:jar
> Task :randomizationInfo
Running tests with randomization seed: tests.seed=5B303761AD35AC72
> Task :solr:api:resolve
> Task :solr:api:processTestResources
> Task :solr:core:processResources
> Task :solr:solrj:processResources
> Task :solr:solrj-jetty:processResources NO-SOURCE
> Task :solr:solrj-streaming:processResources
> Task :solr:solrj-zookeeper:processResources NO-SOURCE
> Task :solr:test-framework:processResources
> Task :solr:benchmark:processResources
> Task :solr:benchmark:processTestResources
> Task :solr:core:processTestResources
> Task :solr:modules:analysis-extras:processResources NO-SOURCE
> Task :solr:cross-dc-manager:processResources NO-SOURCE
> Task :solr:cross-dc-manager:processTestResources
> Task :solr:modules:cross-dc:processResources NO-SOURCE
> Task :solr:modules:opentelemetry:processResources NO-SOURCE
> Task :solr:server:compileJava SKIPPED
> Task :solr:server:processResources NO-SOURCE
> Task :solr:server:classes UP-TO-DATE
> Task :solr:server:compileTestJava NO-SOURCE
> Task :solr:server:processTestResources NO-SOURCE
> Task :solr:server:testClasses UP-TO-DATE
> Task :solr:server:test NO-SOURCE
> Task :solr:server:wipeTaskTemp
> Task :solr:solr-ref-guide:compileJava NO-SOURCE
> Task :solr:solr-ref-guide:processResources NO-SOURCE
> Task :solr:solr-ref-guide:classes UP-TO-DATE
> Task :solr:solr-ref-guide:copySolrjTestResources
> Task :solr:solr-ref-guide:processTestResources NO-SOURCE
> Task :solr:modules:sql:processResources
> Task :solr:solrj:processTestResources
> Task :solr:solrj-jetty:processTestResources
> Task :solr:solrj-streaming:processTestResources
> Task :solr:solrj-zookeeper:processTestResources
> Task :solr:test-framework:processTestResources
> Task :solr:webapp:processResources NO-SOURCE
> Task :solr:webapp:processTestResources
> Task :solr:modules:analysis-extras:processTestResources
> Task :solr:modules:clustering:processResources NO-SOURCE
> Task :solr:modules:clustering:processTestResources
> Task :solr:modules:cross-dc:processTestResources
> Task :solr:modules:cuvs:processResources NO-SOURCE
> Task :solr:modules:cuvs:processTestResources
> Task :solr:modules:extraction:processResources
> Task :solr:modules:extraction:processTestResources
> Task :solr:modules:gcs-repository:processResources NO-SOURCE
> Task :solr:modules:gcs-repository:processTestResources
> Task :solr:modules:jwt-auth:processResources NO-SOURCE
> Task :solr:modules:jwt-auth:processTestResources
> Task :solr:modules:langid:processResources NO-SOURCE
> Task :solr:modules:langid:processTestResources
> Task :solr:modules:language-models:processResources NO-SOURCE
> Task :solr:modules:language-models:processTestResources
> Task :solr:modules:ltr:processResources NO-SOURCE
> Task :solr:modules:ltr:processTestResources
> Task :solr:modules:opentelemetry:processTestResources
> Task :solr:modules:s3-repository:processResources NO-SOURCE
> Task :solr:modules:s3-repository:processTestResources
> Task :solr:modules:scripting:processResources NO-SOURCE
> Task :solr:modules:scripting:processTestResources
> Task :solr:modules:sql:copySolrCoreTestResources
> Task :solr:modules:sql:processTestResources
> Task :solr:solrj:openApiGenerate
Cleaned up output directory /home/jenkins/jenkins-agent/workspace/Solr/Solr-Test-main/solr/solrj/build/generated before code generation.
[openApiGenerate] Worker isolation: classloader (fast startup, but generator classes accumulate in Gradle daemon Metaspace - consider workerIsolation = "process" if you hit metaspace pressure)
File (reserved word) cannot be used as model name. Renamed to ModelFile
############################################################################################
# Thanks for using OpenAPI Generator. #
# We appreciate your support! Please consider donating to help us maintain this project. #
# https://opencollective.com/openapi_generator/donate #
############################################################################################
Successfully generated code to /home/jenkins/jenkins-agent/workspace/Solr/Solr-Test-main/solr/solrj/build/generated
> Task :solr:solrj:generatedSpotlessHelper
> Task :solr:solrj:generatedSpotless
> Task :solr:solrj:compileJava
Note: Some input files use or override a deprecated API.
Note: Recompile with -Xlint:deprecation for details.
> Task :solr:solrj-jetty:compileJava
Note: /home/jenkins/jenkins-agent/workspace/Solr/Solr-Test-main/solr/solrj-jetty/src/java/org/apache/solr/client/solrj/jetty/HttpJettySolrClient.java uses or overrides a deprecated API.
Note: Recompile with -Xlint:deprecation for details.
> Task :solr:solrj-streaming:compileJava
Note: Some input files use or override a deprecated API.
Note: Recompile with -Xlint:deprecation for details.
> Task :solr:solrj-zookeeper:compileJava
> Task :solr:core:compileJava
Note: Some input files use or override a deprecated API.
Note: Recompile with -Xlint:deprecation for details.
> Task :solr:test-framework:compileJava
Note: Some input files use or override a deprecated API.
Note: Recompile with -Xlint:deprecation for details.
> Task :solr:api:compileTestJava
> Task :solr:api:testClasses
> Task :solr:core:classes
> Task :solr:core:jar
> Task :solr:solrj:classes
> Task :solr:solrj:jar
> Task :solr:solrj-jetty:classes
> Task :solr:solrj-jetty:jar
> Task :solr:solrj-streaming:classes
> Task :solr:solrj-streaming:jar
> Task :solr:solrj-zookeeper:classes
> Task :solr:solrj-zookeeper:jar
> Task :solr:test-framework:classes
> Task :solr:test-framework:jar
> Task :solr:api:test
WARNING: Using incubator modules: jdk.incubator.vector
WARNING: Using incubator modules: jdk.incubator.vector
WARNING: A command line option has enabled the Security Manager
WARNING: A command line option has enabled the Security Manager
WARNING: The Security Manager is deprecated and will be removed in a future release
WARNING: The Security Manager is deprecated and will be removed in a future release
java.security.policy: error adding Permission, java.net.URLPermission:
java.util.ServiceConfigurationError: Locale provider adapter "CLDR"cannot be instantiated.
java.security.policy: error adding Permission, java.net.URLPermission:
java.util.ServiceConfigurationError: Locale provider adapter "CLDR"cannot be instantiated.
java.security.policy: error adding Permission, java.net.URLPermission:
java.util.ServiceConfigurationError: Locale provider adapter "CLDR"cannot be instantiated.
java.security.policy: error adding Permission, java.net.URLPermission:
java.util.ServiceConfigurationError: Locale provider adapter "CLDR"cannot be instantiated.
java.security.policy: error adding Permission, java.net.URLPermission:
java.util.ServiceConfigurationError: Locale provider adapter "CLDR"cannot be instantiated.
java.security.policy: error adding Permission, java.net.URLPermission:
java.util.ServiceConfigurationError: Locale provider adapter "CLDR"cannot be instantiated.
java.security.policy: error adding Permission, java.net.URLPermission:
java.util.ServiceConfigurationError: Locale provider adapter "CLDR"cannot be instantiated.
java.security.policy: error adding Permission, java.net.URLPermission:
java.util.ServiceConfigurationError: Locale provider adapter "CLDR"cannot be instantiated.
java.security.policy: error adding Permission, java.net.URLPermission:
java.util.ServiceConfigurationError: Locale provider adapter "CLDR"cannot be instantiated.
java.security.policy: error adding Permission, java.net.URLPermission:
java.util.ServiceConfigurationError: Locale provider adapter "CLDR"cannot be instantiated.
:solr:api:test (SUCCESS): 19 test(s)
> Task :solr:api:wipeTaskTemp
> Task :solr:benchmark:compileJava
Note: /home/jenkins/jenkins-agent/workspace/Solr/Solr-Test-main/solr/benchmark/src/java/org/apache/solr/bench/lifecycle/SolrStartup.java uses or overrides a deprecated API.
Note: Recompile with -Xlint:deprecation for details.
> Task :solr:benchmark:classes
> Task :solr:benchmark:compileTestJava
> Task :solr:benchmark:testClasses
> Task :solr:benchmark:test
WARNING: Using incubator modules: jdk.incubator.vector
WARNING: Using incubator modules: jdk.incubator.vector
WARNING: Using incubator modules: jdk.incubator.vector
WARNING: A command line option has enabled the Security Manager
WARNING: The Security Manager is deprecated and will be removed in a future release
WARNING: A command line option has enabled the Security Manager
WARNING: The Security Manager is deprecated and will be removed in a future release
WARNING: A command line option has enabled the Security Manager
WARNING: The Security Manager is deprecated and will be removed in a future release
java.security.policy: error adding Permission, java.net.URLPermission:
java.util.ServiceConfigurationError: Locale provider adapter "CLDR"cannot be instantiated.
java.security.policy: error adding Permission, java.net.URLPermission:
java.util.ServiceConfigurationError: Locale provider adapter "CLDR"cannot be instantiated.
java.security.policy: error adding Permission, java.net.URLPermission:
java.util.ServiceConfigurationError: Locale provider adapter "CLDR"cannot be instantiated.
java.security.policy: error adding Permission, java.net.URLPermission:
java.util.ServiceConfigurationError: Locale provider adapter "CLDR"cannot be instantiated.
java.security.policy: error adding Permission, java.net.URLPermission:
java.util.ServiceConfigurationError: Locale provider adapter "CLDR"cannot be instantiated.
java.security.policy: error adding Permission, java.net.URLPermission:
java.util.ServiceConfigurationError: Locale provider adapter "CLDR"cannot be instantiated.
java.security.policy: error adding Permission, java.net.URLPermission:
java.util.ServiceConfigurationError: Locale provider adapter "CLDR"cannot be instantiated.
java.security.policy: error adding Permission, java.net.URLPermission:
java.util.ServiceConfigurationError: Locale provider adapter "CLDR"cannot be instantiated.
java.security.policy: error adding Permission, java.net.URLPermission:
java.util.ServiceConfigurationError: Locale provider adapter "CLDR"cannot be instantiated.
java.security.policy: error adding Permission, java.net.URLPermission:
java.util.ServiceConfigurationError: Locale provider adapter "CLDR"cannot be instantiated.
java.security.policy: error adding Permission, java.net.URLPermission:
java.util.ServiceConfigurationError: Locale provider adapter "CLDR"cannot be instantiated.
java.security.policy: error adding Permission, java.net.URLPermission:
java.util.ServiceConfigurationError: Locale provider adapter "CLDR"cannot be instantiated.
java.security.policy: error adding Permission, java.net.URLPermission:
java.util.ServiceConfigurationError: Locale provider adapter "CLDR"cannot be instantiated.
java.security.policy: error adding Permission, java.net.URLPermission:
java.util.ServiceConfigurationError: Locale provider adapter "CLDR"cannot be instantiated.
java.security.policy: error adding Permission, java.net.URLPermission:
java.util.ServiceConfigurationError: Locale provider adapter "CLDR"cannot be instantiated.
:solr:benchmark:test (SUCCESS): 10 test(s)
> Task :solr:benchmark:wipeTaskTemp
> Task :solr:core:compileTestJava
Note: Some input files use or override a deprecated API.
Note: Recompile with -Xlint:deprecation for details.
> Task :solr:core:testClasses
> Task :solr:modules:analysis-extras:compileJava
Note: /home/jenkins/jenkins-agent/workspace/Solr/Solr-Test-main/solr/modules/analysis-extras/src/java/org/apache/solr/schema/ICUCollationField.java uses or overrides a deprecated API.
Note: Recompile with -Xlint:deprecation for details.
> Task :solr:modules:analysis-extras:classes
> Task :solr:modules:analysis-extras:jar
> Task :solr:core:test
WARNING: Using incubator modules: jdk.incubator.vector
WARNING: Using incubator modules: jdk.incubator.vector
WARNING: Using incubator modules: jdk.incubator.vector
WARNING: Using incubator modules: jdk.incubator.vector
WARNING: A command line option has enabled the Security Manager
WARNING: The Security Manager is deprecated and will be removed in a future release
WARNING: A command line option has enabled the Security Manager
WARNING: The Security Manager is deprecated and will be removed in a future release
WARNING: A command line option has enabled the Security Manager
WARNING: The Security Manager is deprecated and will be removed in a future release
WARNING: A command line option has enabled the Security Manager
WARNING: The Security Manager is deprecated and will be removed in a future release
java.security.policy: error adding Permission, java.net.URLPermission:
java.security.policy: error adding Permission, java.net.URLPermission:
java.util.ServiceConfigurationError: Locale provider adapter "CLDR"cannot be instantiated.
java.util.ServiceConfigurationError: Locale provider adapter "CLDR"cannot be instantiated.
java.security.policy: error adding Permission, java.net.URLPermission:
java.security.policy: error adding Permission, java.net.URLPermission:
java.util.ServiceConfigurationError: Locale provider adapter "CLDR"cannot be instantiated.
java.util.ServiceConfigurationError: Locale provider adapter "CLDR"cannot be instantiated.
java.security.policy: error adding Permission, java.net.URLPermission:
java.util.ServiceConfigurationError: Locale provider adapter "CLDR"cannot be instantiated.
java.security.policy: error adding Permission, java.net.URLPermission:
java.util.ServiceConfigurationError: Locale provider adapter "CLDR"cannot be instantiated.
java.security.policy: error adding Permission, java.net.URLPermission:
java.security.policy: error adding Permission, java.net.URLPermission:
java.util.ServiceConfigurationError: Locale provider adapter "CLDR"cannot be instantiated.
java.util.ServiceConfigurationError: Locale provider adapter "CLDR"cannot be instantiated.
java.security.policy: error adding Permission, java.net.URLPermission:
java.security.policy: error adding Permission, java.net.URLPermission:
java.util.ServiceConfigurationError: Locale provider adapter "CLDR"cannot be instantiated.
java.util.ServiceConfigurationError: Locale provider adapter "CLDR"cannot be instantiated.
java.security.policy: error adding Permission, java.net.URLPermission:
java.util.ServiceConfigurationError: Locale provider adapter "CLDR"cannot be instantiated.
java.security.policy: error adding Permission, java.net.URLPermission:
java.util.ServiceConfigurationError: Locale provider adapter "CLDR"cannot be instantiated.
java.security.policy: error adding Permission, java.net.URLPermission:
java.util.ServiceConfigurationError: Locale provider adapter "CLDR"cannot be instantiated.
java.security.policy: error adding Permission, java.net.URLPermission:
java.util.ServiceConfigurationError: Locale provider adapter "CLDR"cannot be instantiated.
java.security.policy: error adding Permission, java.net.URLPermission:
java.util.ServiceConfigurationError: Locale provider adapter "CLDR"cannot be instantiated.
java.security.policy: error adding Permission, java.net.URLPermission:
java.util.ServiceConfigurationError: Locale provider adapter "CLDR"cannot be instantiated.
java.security.policy: error adding Permission, java.net.URLPermission:
java.util.ServiceConfigurationError: Locale provider adapter "CLDR"cannot be instantiated.
java.security.policy: error adding Permission, java.net.URLPermission:
java.util.ServiceConfigurationError: Locale provider adapter "CLDR"cannot be instantiated.
java.security.policy: error adding Permission, java.net.URLPermission:
java.util.ServiceConfigurationError: Locale provider adapter "CLDR"cannot be instantiated.
java.security.policy: error adding Permission, java.net.URLPermission:
java.util.ServiceConfigurationError: Locale provider adapter "CLDR"cannot be instantiated.
WARNING: Test org.apache.solr.TestRandomFaceting wrote 20,637,799 bytes of output.
RecoveryAfterSoftCommitTest > test FAILED
org.apache.solr.client.solrj.SolrServerException: IOException occurred when talking to server at: http://127.0.0.1:46511/solr/collection1_shard1_replica_n3/update
at __randomizedtesting.SeedInfo.seed([5B303761AD35AC72:D36408BB03C9C18A]:0)
at app//org.apache.solr.client.solrj.jetty.HttpJettySolrClient.request(HttpJettySolrClient.java:512)
at app//org.apache.solr.client.solrj.jetty.HttpJettySolrClient.lambda$requestWithBaseUrl$1(HttpJettySolrClient.java:540)
at app//org.apache.solr.client.solrj.jetty.HttpJettySolrClient.requestWithBaseUrl(HttpJettySolrClient.java:559)
at app//org.apache.solr.client.solrj.jetty.HttpJettySolrClient.requestWithBaseUrl(HttpJettySolrClient.java:540)
at app//org.apache.solr.client.solrj.impl.LBSolrClient.doRequest(LBSolrClient.java:626)
at app//org.apache.solr.client.solrj.impl.LBSolrClient.doRequest(LBSolrClient.java:614)
at app//org.apache.solr.client.solrj.impl.LBSolrClient.doRequest(LBSolrClient.java:639)
at app//org.apache.solr.client.solrj.impl.LBSolrClient.request(LBSolrClient.java:583)
at app//org.apache.solr.client.solrj.impl.CloudSolrClient.sendRequest(CloudSolrClient.java:1052)
at app//org.apache.solr.client.solrj.impl.CloudSolrClient.requestWithRetryOnStaleState(CloudSolrClient.java:683)
at app//org.apache.solr.client.solrj.impl.CloudSolrClient.request(CloudSolrClient.java:605)
at app//org.apache.solr.client.solrj.SolrRequest.process(SolrRequest.java:304)
at app//org.apache.solr.client.solrj.SolrClient.add(SolrClient.java:167)
at app//org.apache.solr.client.solrj.SolrClient.add(SolrClient.java:132)
at app//org.apache.solr.client.solrj.SolrClient.add(SolrClient.java:148)
at app//org.apache.solr.cloud.RecoveryAfterSoftCommitTest.test(RecoveryAfterSoftCommitTest.java:106)
at java.base@21.0.4/jdk.internal.reflect.DirectMethodHandleAccessor.invoke(DirectMethodHandleAccessor.java:103)
at java.base@21.0.4/java.lang.reflect.Method.invoke(Method.java:580)
at app//com.carrotsearch.randomizedtesting.RandomizedRunner.invoke(RandomizedRunner.java:1780)
at app//com.carrotsearch.randomizedtesting.RandomizedRunner$8.evaluate(RandomizedRunner.java:959)
at app//com.carrotsearch.randomizedtesting.RandomizedRunner$9.evaluate(RandomizedRunner.java:995)
at app//com.carrotsearch.randomizedtesting.RandomizedRunner$10.evaluate(RandomizedRunner.java:1009)
at app//org.apache.solr.BaseDistributedSearchTestCase$ShardsRepeatRule$ShardsFixedStatement.callStatement(BaseDistributedSearchTestCase.java:1080)
at app//org.apache.solr.BaseDistributedSearchTestCase$ShardsRepeatRule$ShardsStatement.evaluate(BaseDistributedSearchTestCase.java:1051)
at app//com.carrotsearch.randomizedtesting.rules.SystemPropertiesRestoreRule$1.evaluate(SystemPropertiesRestoreRule.java:80)
at app//org.junit.rules.RunRules.evaluate(RunRules.java:20)
at app//org.apache.lucene.tests.util.TestRuleSetupTeardownChained$1.evaluate(TestRuleSetupTeardownChained.java:48)
at app//org.apache.lucene.tests.util.AbstractBeforeAfterRule$1.evaluate(AbstractBeforeAfterRule.java:43)
at app//org.apache.lucene.tests.util.TestRuleThreadAndTestName$1.evaluate(TestRuleThreadAndTestName.java:45)
at app//org.apache.lucene.tests.util.TestRuleIgnoreAfterMaxFailures$1.evaluate(TestRuleIgnoreAfterMaxFailures.java:60)
at app//org.apache.lucene.tests.util.TestRuleMarkFailure$1.evaluate(TestRuleMarkFailure.java:44)
at app//org.junit.rules.RunRules.evaluate(RunRules.java:20)
at app//com.carrotsearch.randomizedtesting.rules.StatementAdapter.evaluate(StatementAdapter.java:36)
at app//com.carrotsearch.randomizedtesting.ThreadLeakControl$StatementRunner.run(ThreadLeakControl.java:390)
at app//com.carrotsearch.randomizedtesting.ThreadLeakControl.forkTimeoutingTask(ThreadLeakControl.java:843)
at app//com.carrotsearch.randomizedtesting.ThreadLeakControl$3.evaluate(ThreadLeakControl.java:490)
at app//com.carrotsearch.randomizedtesting.RandomizedRunner.runSingleTest(RandomizedRunner.java:968)
at app//com.carrotsearch.randomizedtesting.RandomizedRunner$5.evaluate(RandomizedRunner.java:853)
at app//com.carrotsearch.randomizedtesting.RandomizedRunner$6.evaluate(RandomizedRunner.java:904)
at app//com.carrotsearch.randomizedtesting.RandomizedRunner$7.evaluate(RandomizedRunner.java:915)
at app//com.carrotsearch.randomizedtesting.rules.StatementAdapter.evaluate(StatementAdapter.java:36)
at app//com.carrotsearch.randomizedtesting.rules.StatementAdapter.evaluate(StatementAdapter.java:36)
at app//org.apache.lucene.tests.util.AbstractBeforeAfterRule$1.evaluate(AbstractBeforeAfterRule.java:43)
at app//com.carrotsearch.randomizedtesting.rules.SystemPropertiesRestoreRule$1.evaluate(SystemPropertiesRestoreRule.java:80)
at app//org.junit.rules.RunRules.evaluate(RunRules.java:20)
at app//org.apache.lucene.tests.util.AbstractBeforeAfterRule$1.evaluate(AbstractBeforeAfterRule.java:43)
at app//com.carrotsearch.randomizedtesting.rules.StatementAdapter.evaluate(StatementAdapter.java:36)
at app//org.apache.lucene.tests.util.TestRuleStoreClassName$1.evaluate(TestRuleStoreClassName.java:38)
at app//com.carrotsearch.randomizedtesting.rules.NoShadowingOrOverridesOnMethodsRule$1.evaluate(NoShadowingOrOverridesOnMethodsRule.java:40)
at app//com.carrotsearch.randomizedtesting.rules.NoShadowingOrOverridesOnMethodsRule$1.evaluate(NoShadowingOrOverridesOnMethodsRule.java:40)
at app//com.carrotsearch.randomizedtesting.rules.StatementAdapter.evaluate(StatementAdapter.java:36)
at app//com.carrotsearch.randomizedtesting.rules.StatementAdapter.evaluate(StatementAdapter.java:36)
at app//org.apache.lucene.tests.util.TestRuleAssertionsRequired$1.evaluate(TestRuleAssertionsRequired.java:53)
at app//org.apache.lucene.tests.util.AbstractBeforeAfterRule$1.evaluate(AbstractBeforeAfterRule.java:43)
at app//org.apache.lucene.tests.util.TestRuleMarkFailure$1.evaluate(TestRuleMarkFailure.java:44)
at app//org.apache.lucene.tests.util.TestRuleIgnoreAfterMaxFailures$1.evaluate(TestRuleIgnoreAfterMaxFailures.java:60)
at app//org.apache.lucene.tests.util.TestRuleIgnoreTestSuites$1.evaluate(TestRuleIgnoreTestSuites.java:47)
at app//org.junit.rules.RunRules.evaluate(RunRules.java:20)
at app//com.carrotsearch.randomizedtesting.rules.StatementAdapter.evaluate(StatementAdapter.java:36)
at app//com.carrotsearch.randomizedtesting.ThreadLeakControl$StatementRunner.run(ThreadLeakControl.java:390)
at app//com.carrotsearch.randomizedtesting.ThreadLeakControl.lambda$forkTimeoutingTask$0(ThreadLeakControl.java:850)
at java.base@21.0.4/java.lang.Thread.run(Thread.java:1583)
Caused by:
java.nio.channels.ClosedChannelException
at org.eclipse.jetty.http2.HTTP2Session$StreamsState.onShutdown(HTTP2Session.java:2179)
at org.eclipse.jetty.http2.HTTP2Session.onShutdown(HTTP2Session.java:1212)
at org.eclipse.jetty.http2.HTTP2Connection$HTTP2Producer.produce(HTTP2Connection.java:441)
at org.eclipse.jetty.util.thread.strategy.AdaptiveExecutionStrategy.produceTask(AdaptiveExecutionStrategy.java:509)
at org.eclipse.jetty.util.thread.strategy.AdaptiveExecutionStrategy.tryProduce(AdaptiveExecutionStrategy.java:251)
at org.eclipse.jetty.util.thread.strategy.AdaptiveExecutionStrategy.produce(AdaptiveExecutionStrategy.java:196)
at org.eclipse.jetty.http2.HTTP2Connection.produce(HTTP2Connection.java:237)
at org.eclipse.jetty.http2.HTTP2Connection.onFillable(HTTP2Connection.java:165)
at org.eclipse.jetty.http2.HTTP2Connection$FillableCallback.succeeded(HTTP2Connection.java:592)
at org.eclipse.jetty.io.FillInterest.fillable(FillInterest.java:105)
at org.eclipse.jetty.io.SelectableChannelEndPoint$1.run(SelectableChannelEndPoint.java:54)
at org.eclipse.jetty.util.thread.Invocable.invokeNonBlocking(Invocable.java:225)
at org.eclipse.jetty.util.thread.strategy.AdaptiveExecutionStrategy.picRunTask(AdaptiveExecutionStrategy.java:473)
at org.eclipse.jetty.util.thread.strategy.AdaptiveExecutionStrategy.consumeTask(AdaptiveExecutionStrategy.java:399)
at org.eclipse.jetty.util.thread.strategy.AdaptiveExecutionStrategy.tryProduce(AdaptiveExecutionStrategy.java:255)
at org.eclipse.jetty.util.thread.strategy.AdaptiveExecutionStrategy.produce(AdaptiveExecutionStrategy.java:196)
at org.apache.solr.common.util.ExecutorUtil$MDCAwareThreadPoolExecutor.lambda$execute$0(ExecutorUtil.java:390)
at java.base/java.util.concurrent.ThreadPoolExecutor.runWorker(ThreadPoolExecutor.java:1144)
at java.base/java.util.concurrent.ThreadPoolExecutor$Worker.run(ThreadPoolExecutor.java:642)
... 1 more
org.apache.solr.cloud.RecoveryAfterSoftCommitTest > test suite's output saved to /home/jenkins/jenkins-agent/workspace/Solr/Solr-Test-main/solr/core/build/test-results/test/outputs/OUTPUT-org.apache.solr.cloud.RecoveryAfterSoftCommitTest.txt, copied below:
2> 238374 INFO (SUITE-RecoveryAfterSoftCommitTest-seed#[5B303761AD35AC72]-worker) [] o.a.s.SolrTestCase Setting 'solr.configset.default.confdir' system property to test-framework derived value of '/home/jenkins/jenkins-agent/workspace/Solr/Solr-Test-main/solr/server/solr/configsets/_default/conf'
2> 238374 INFO (SUITE-RecoveryAfterSoftCommitTest-seed#[5B303761AD35AC72]-worker) [] o.a.s.SolrTestCaseJ4 SecureRandom sanity checks: test.solr.allowed.securerandom=null & java.security.egd=file:/dev/./urandom
2> 238374 INFO (SUITE-RecoveryAfterSoftCommitTest-seed#[5B303761AD35AC72]-worker) [] o.a.s.SolrTestCaseJ4 Created dataDir: /home/jenkins/jenkins-agent/workspace/Solr/Solr-Test-main/solr/core/build/tmp/tests-tmp/org.apache.solr.cloud.RecoveryAfterSoftCommitTest_5B303761AD35AC72-001/data-dir-27-001
2> 238374 INFO (SUITE-RecoveryAfterSoftCommitTest-seed#[5B303761AD35AC72]-worker) [] o.a.s.u.ErrorLogMuter Creating ErrorLogMuter-regex-14764 for ERROR logs matching regex: ignore_exception
2> 238375 INFO (SUITE-RecoveryAfterSoftCommitTest-seed#[5B303761AD35AC72]-worker) [] o.a.s.SolrTestCaseJ4 Using TrieFields (NUMERIC_POINTS_SYSPROP=false) w/NUMERIC_DOCVALUES_SYSPROP=true
2> 238376 WARN (SUITE-RecoveryAfterSoftCommitTest-seed#[5B303761AD35AC72]-worker) [] o.e.j.u.r.ResourceFactory Leaked /home/jenkins/jenkins-agent/workspace/Solr/Solr-Test-main/solr/test-framework/build/libs/solr-test-framework-11.0.0-SNAPSHOT.jar for jar:file:///home/jenkins/jenkins-agent/workspace/Solr/Solr-Test-main/solr/test-framework/build/libs/solr-test-framework-11.0.0-SNAPSHOT.jar!/SSLTestConfig.hostname-and-ip-missmatch.keystore
2> 238376 INFO (SUITE-RecoveryAfterSoftCommitTest-seed#[5B303761AD35AC72]-worker) [] o.a.s.SolrTestCaseJ4 Randomized ssl (false) and clientAuth (false) via: @org.apache.solr.SolrTestCaseJ4.SuppressSSL(bugUrl="None")
2> 238382 INFO (TEST-RecoveryAfterSoftCommitTest.test-seed#[5B303761AD35AC72]) [] o.a.s.c.ZkTestServer STARTING ZK TEST SERVER
2> 238382 INFO (ZkTestServer Run Thread) [] o.a.s.c.ZkTestServer client port: /127.0.0.1:0
2> 238382 INFO (ZkTestServer Run Thread) [] o.a.s.c.ZkTestServer Starting server
2> 238383 WARN (ZkTestServer Run Thread) [] o.a.z.s.ServerCnxnFactory maxCnxns is not configured, using default value 0.
2> 238482 INFO (TEST-RecoveryAfterSoftCommitTest.test-seed#[5B303761AD35AC72]) [] o.a.s.c.ZkTestServer start zk server on port: 43783
2> 238483 WARN (TEST-RecoveryAfterSoftCommitTest.test-seed#[5B303761AD35AC72]) [] o.a.s.c.c.SolrZkClient Using default ZkCredentialsInjector. ZkCredentialsInjector is not secure, it creates an empty list of credentials which leads to 'OPEN_ACL_UNSAFE' ACLs to Zookeeper nodes
2> 238483 WARN (TEST-RecoveryAfterSoftCommitTest.test-seed#[5B303761AD35AC72]) [] o.a.s.c.c.SolrZkClient Using default ZkACLProvider. DefaultZkACLProvider is not secure, it creates 'OPEN_ACL_UNSAFE' ACLs to Zookeeper nodes
2> 238484 INFO (TEST-RecoveryAfterSoftCommitTest.test-seed#[5B303761AD35AC72]) [] o.a.c.f.i.CuratorFrameworkImpl Starting
2> 238485 INFO (TEST-RecoveryAfterSoftCommitTest.test-seed#[5B303761AD35AC72]) [] o.a.c.f.i.CuratorFrameworkImpl Default schema
2> 238486 INFO (TEST-RecoveryAfterSoftCommitTest.test-seed#[5B303761AD35AC72]-EventThread) [] o.a.c.f.s.ConnectionStateManager State change: CONNECTED
2> 238487 INFO (TEST-RecoveryAfterSoftCommitTest.test-seed#[5B303761AD35AC72]-EventThread) [] o.a.c.f.i.EnsembleTracker New config event received: {}
2> 238487 INFO (TEST-RecoveryAfterSoftCommitTest.test-seed#[5B303761AD35AC72]-EventThread) [] o.a.c.f.i.EnsembleTracker New config event received: {}
2> 238488 WARN (TEST-RecoveryAfterSoftCommitTest.test-seed#[5B303761AD35AC72]) [] o.a.s.c.c.SolrZkClient Using default ZkCredentialsInjector. ZkCredentialsInjector is not secure, it creates an empty list of credentials which leads to 'OPEN_ACL_UNSAFE' ACLs to Zookeeper nodes
2> 238488 WARN (TEST-RecoveryAfterSoftCommitTest.test-seed#[5B303761AD35AC72]) [] o.a.s.c.c.SolrZkClient Using default ZkACLProvider. DefaultZkACLProvider is not secure, it creates 'OPEN_ACL_UNSAFE' ACLs to Zookeeper nodes
2> 238488 INFO (TEST-RecoveryAfterSoftCommitTest.test-seed#[5B303761AD35AC72]) [] o.a.c.f.i.CuratorFrameworkImpl Starting
2> 238489 INFO (TEST-RecoveryAfterSoftCommitTest.test-seed#[5B303761AD35AC72]) [] o.a.c.f.i.CuratorFrameworkImpl Default schema
2> 238490 INFO (TEST-RecoveryAfterSoftCommitTest.test-seed#[5B303761AD35AC72]-EventThread) [] o.a.c.f.s.ConnectionStateManager State change: CONNECTED
2> 238490 INFO (TEST-RecoveryAfterSoftCommitTest.test-seed#[5B303761AD35AC72]-EventThread) [] o.a.c.f.i.EnsembleTracker New config event received: {}
2> 238490 INFO (TEST-RecoveryAfterSoftCommitTest.test-seed#[5B303761AD35AC72]-EventThread) [] o.a.c.f.i.EnsembleTracker New config event received: {}
2> 238491 INFO (TEST-RecoveryAfterSoftCommitTest.test-seed#[5B303761AD35AC72]) [] o.a.s.c.ZkTestServer put /home/jenkins/jenkins-agent/workspace/Solr/Solr-Test-main/solr/core/build/resources/test/solr/collection1/conf/solrconfig-tlog.xml to /configs/conf1/solrconfig.xml
2> 238493 INFO (TEST-RecoveryAfterSoftCommitTest.test-seed#[5B303761AD35AC72]) [] o.a.s.c.ZkTestServer put /home/jenkins/jenkins-agent/workspace/Solr/Solr-Test-main/solr/core/build/resources/test/solr/collection1/conf/schema.xml to /configs/conf1/schema.xml
2> 238494 INFO (TEST-RecoveryAfterSoftCommitTest.test-seed#[5B303761AD35AC72]) [] o.a.s.c.ZkTestServer put /home/jenkins/jenkins-agent/workspace/Solr/Solr-Test-main/solr/core/build/resources/test/solr/collection1/conf/solrconfig.snippet.randomindexconfig.xml to /configs/conf1/solrconfig.snippet.randomindexconfig.xml
2> 238495 INFO (TEST-RecoveryAfterSoftCommitTest.test-seed#[5B303761AD35AC72]) [] o.a.s.c.ZkTestServer put /home/jenkins/jenkins-agent/workspace/Solr/Solr-Test-main/solr/core/build/resources/test/solr/collection1/conf/stopwords.txt to /configs/conf1/stopwords.txt
2> 238496 INFO (TEST-RecoveryAfterSoftCommitTest.test-seed#[5B303761AD35AC72]) [] o.a.s.c.ZkTestServer put /home/jenkins/jenkins-agent/workspace/Solr/Solr-Test-main/solr/core/build/resources/test/solr/collection1/conf/protwords.txt to /configs/conf1/protwords.txt
2> 238497 INFO (TEST-RecoveryAfterSoftCommitTest.test-seed#[5B303761AD35AC72]) [] o.a.s.c.ZkTestServer put /home/jenkins/jenkins-agent/workspace/Solr/Solr-Test-main/solr/core/build/resources/test/solr/collection1/conf/currency.xml to /configs/conf1/currency.xml
2> 238498 INFO (TEST-RecoveryAfterSoftCommitTest.test-seed#[5B303761AD35AC72]) [] o.a.s.c.ZkTestServer put /home/jenkins/jenkins-agent/workspace/Solr/Solr-Test-main/solr/core/build/resources/test/solr/collection1/conf/enumsConfig.xml to /configs/conf1/enumsConfig.xml
2> 238499 INFO (TEST-RecoveryAfterSoftCommitTest.test-seed#[5B303761AD35AC72]) [] o.a.s.c.ZkTestServer put /home/jenkins/jenkins-agent/workspace/Solr/Solr-Test-main/solr/core/build/resources/test/solr/collection1/conf/open-exchange-rates.json to /configs/conf1/open-exchange-rates.json
2> 238500 INFO (TEST-RecoveryAfterSoftCommitTest.test-seed#[5B303761AD35AC72]) [] o.a.s.c.ZkTestServer put /home/jenkins/jenkins-agent/workspace/Solr/Solr-Test-main/solr/core/build/resources/test/solr/collection1/conf/mapping-ISOLatin1Accent.txt to /configs/conf1/mapping-ISOLatin1Accent.txt
2> 238501 INFO (TEST-RecoveryAfterSoftCommitTest.test-seed#[5B303761AD35AC72]) [] o.a.s.c.ZkTestServer put /home/jenkins/jenkins-agent/workspace/Solr/Solr-Test-main/solr/core/build/resources/test/solr/collection1/conf/old_synonyms.txt to /configs/conf1/old_synonyms.txt
2> 238502 INFO (TEST-RecoveryAfterSoftCommitTest.test-seed#[5B303761AD35AC72]) [] o.a.s.c.ZkTestServer put /home/jenkins/jenkins-agent/workspace/Solr/Solr-Test-main/solr/core/build/resources/test/solr/collection1/conf/synonyms.txt to /configs/conf1/synonyms.txt
2> 238503 INFO (TEST-RecoveryAfterSoftCommitTest.test-seed#[5B303761AD35AC72]) [] o.a.s.c.AbstractFullDistribZkTestBase Will use NRT replicas unless explicitly asked otherwise
2> 238707 INFO (TEST-RecoveryAfterSoftCommitTest.test-seed#[5B303761AD35AC72]) [] o.a.s.e.JettySolrRunner Start Jetty (configured port=0, binding port=0)
2> 238707 INFO (TEST-RecoveryAfterSoftCommitTest.test-seed#[5B303761AD35AC72]) [] o.a.s.e.JettySolrRunner Trying to start Jetty on port 0 try number 2 ...
2> 238708 INFO (TEST-RecoveryAfterSoftCommitTest.test-seed#[5B303761AD35AC72]) [] o.e.j.s.Server jetty-12.1.12; built: 2026-08-03T22:37:55.389Z; git: 10dd3948f37767b84cc2c62358364f042e51dbbe; jvm 21.0.4+7-LTS
2> 238709 INFO (TEST-RecoveryAfterSoftCommitTest.test-seed#[5B303761AD35AC72]) [] o.e.j.s.DefaultSessionIdManager Session workerName=node0
2> 238709 WARN (TEST-RecoveryAfterSoftCommitTest.test-seed#[5B303761AD35AC72]) [] o.e.j.e.s.ServletContextHandler BaseResource file:///home/jenkins/jenkins-agent/workspace/Solr/Solr-Test-main/solr/core/build/tmp/tests-cwd/./ is aliased to file:///home/jenkins/jenkins-agent/workspace/Solr/Solr-Test-main/solr/core/build/tmp/tests-cwd/ in oeje10s.ServletContextHandler@25daa1d7{/solr,/solr,b=file:///home/jenkins/jenkins-agent/workspace/Solr/Solr-Test-main/solr/core/build/tmp/tests-cwd/./,a=STOPPED,h=oeje10s.ServletHandler@787ab071{STOPPED}}. May not be supported in future releases.
2> 238710 INFO (TEST-RecoveryAfterSoftCommitTest.test-seed#[5B303761AD35AC72]) [] o.e.j.s.h.ContextHandler /solr Base Resource is an alias: file:///home/jenkins/jenkins-agent/workspace/Solr/Solr-Test-main/solr/core/build/tmp/tests-cwd/./ -> file:///home/jenkins/jenkins-agent/workspace/Solr/Solr-Test-main/solr/core/build/tmp/tests-cwd/
2> 238710 INFO (TEST-RecoveryAfterSoftCommitTest.test-seed#[5B303761AD35AC72]) [] o.e.j.s.h.ContextHandler Started oeje10s.ServletContextHandler@25daa1d7{/solr,/solr,b=file:///home/jenkins/jenkins-agent/workspace/Solr/Solr-Test-main/solr/core/build/tmp/tests-cwd/,a=AVAILABLE,h=oeje10s.ServletHandler@787ab071{STARTED}}
2> 238710 INFO (TEST-RecoveryAfterSoftCommitTest.test-seed#[5B303761AD35AC72]) [] o.a.s.e.JettySolrRunner Jetty properties: {solr.data.dir=/home/jenkins/jenkins-agent/workspace/Solr/Solr-Test-main/solr/core/build/tmp/tests-tmp/org.apache.solr.cloud.RecoveryAfterSoftCommitTest_5B303761AD35AC72-001/tempDir-001/control/data, hostPort=37189, coreRootDirectory=/home/jenkins/jenkins-agent/workspace/Solr/Solr-Test-main/solr/core/build/tmp/tests-tmp/org.apache.solr.cloud.RecoveryAfterSoftCommitTest_5B303761AD35AC72-001/control-001/cores, replicaType=NRT}
2> 238710 ERROR (TEST-RecoveryAfterSoftCommitTest.test-seed#[5B303761AD35AC72]) [] o.a.s.u.StartupLoggingUtils Missing Java Option solr.logs.dir. Logging may be missing or incomplete.
2> 238710 INFO (TEST-RecoveryAfterSoftCommitTest.test-seed#[5B303761AD35AC72]) [] o.a.s.s.CoreContainerProvider Using logger factory org.apache.logging.slf4j.Log4jLoggerFactory
2> 238710 INFO (TEST-RecoveryAfterSoftCommitTest.test-seed#[5B303761AD35AC72]) [] o.a.s.s.CoreContainerProvider ___ _ Welcome to Apache Solr™ version 11.0.0
2> 238710 INFO (TEST-RecoveryAfterSoftCommitTest.test-seed#[5B303761AD35AC72]) [] o.a.s.s.CoreContainerProvider / __| ___| |_ _ Starting in cloud mode on port null
2> 238710 INFO (TEST-RecoveryAfterSoftCommitTest.test-seed#[5B303761AD35AC72]) [] o.a.s.s.CoreContainerProvider \__ \/ _ \ | '_| Install dir: /home/jenkins/jenkins-agent/workspace/Solr/Solr-Test-main/solr
2> 238710 INFO (TEST-RecoveryAfterSoftCommitTest.test-seed#[5B303761AD35AC72]) [] o.a.s.s.CoreContainerProvider |___/\___/_|_| Start time: 2026-09-07T18:32:41.468820342Z
2> 238710 INFO (TEST-RecoveryAfterSoftCommitTest.test-seed#[5B303761AD35AC72]) [] o.a.s.s.CoreContainerProvider Solr Home: /home/jenkins/jenkins-agent/workspace/Solr/Solr-Test-main/solr/core/build/tmp/tests-tmp/org.apache.solr.cloud.RecoveryAfterSoftCommitTest_5B303761AD35AC72-001/control-001 (source: servlet config: solr.solr.home)
2> 238711 WARN (TEST-RecoveryAfterSoftCommitTest.test-seed#[5B303761AD35AC72]) [] o.a.s.c.c.SolrZkClient Using default ZkCredentialsInjector. ZkCredentialsInjector is not secure, it creates an empty list of credentials which leads to 'OPEN_ACL_UNSAFE' ACLs to Zookeeper nodes
2> 238711 WARN (TEST-RecoveryAfterSoftCommitTest.test-seed#[5B303761AD35AC72]) [] o.a.s.c.c.SolrZkClient Using default ZkACLProvider. DefaultZkACLProvider is not secure, it creates 'OPEN_ACL_UNSAFE' ACLs to Zookeeper nodes
2> 238711 INFO (TEST-RecoveryAfterSoftCommitTest.test-seed#[5B303761AD35AC72]) [] o.a.c.f.i.CuratorFrameworkImpl Starting
2> 238712 INFO (TEST-RecoveryAfterSoftCommitTest.test-seed#[5B303761AD35AC72]) [] o.a.c.f.i.CuratorFrameworkImpl Default schema
2> 238713 INFO (TEST-RecoveryAfterSoftCommitTest.test-seed#[5B303761AD35AC72]-EventThread) [] o.a.c.f.s.ConnectionStateManager State change: CONNECTED
2> 238714 INFO (TEST-RecoveryAfterSoftCommitTest.test-seed#[5B303761AD35AC72]-EventThread) [] o.a.c.f.i.EnsembleTracker New config event received: {}
2> 238714 INFO (TEST-RecoveryAfterSoftCommitTest.test-seed#[5B303761AD35AC72]-EventThread) [] o.a.c.f.i.EnsembleTracker New config event received: {}
2> 238714 INFO (Curator-Framework-0) [] o.a.c.f.i.CuratorFrameworkImpl backgroundOperationsLoop exiting
2> 238819 INFO (TEST-RecoveryAfterSoftCommitTest.test-seed#[5B303761AD35AC72]) [] o.a.s.c.SolrXmlConfig Loading solr.xml from /home/jenkins/jenkins-agent/workspace/Solr/Solr-Test-main/solr/core/build/tmp/tests-tmp/org.apache.solr.cloud.RecoveryAfterSoftCommitTest_5B303761AD35AC72-001/control-001/solr.xml
2> 239521 INFO (TEST-RecoveryAfterSoftCommitTest.test-seed#[5B303761AD35AC72]) [] o.a.s.c.OpenTelemetryConfigurator OpenTelemetry tracer enabled with simple propagation only.
2> 239521 INFO (TEST-RecoveryAfterSoftCommitTest.test-seed#[5B303761AD35AC72]) [] o.a.s.m.OtelRuntimeJvmMetrics JVM metrics are disabled
2> 239535 INFO (TEST-RecoveryAfterSoftCommitTest.test-seed#[5B303761AD35AC72]) [] o.a.s.c.ZkContainer Zookeeper client=127.0.0.1:43783/solr
2> 239535 WARN (TEST-RecoveryAfterSoftCommitTest.test-seed#[5B303761AD35AC72]) [] o.a.s.c.c.SolrZkClient Using default ZkCredentialsInjector. ZkCredentialsInjector is not secure, it creates an empty list of credentials which leads to 'OPEN_ACL_UNSAFE' ACLs to Zookeeper nodes
2> 239535 WARN (TEST-RecoveryAfterSoftCommitTest.test-seed#[5B303761AD35AC72]) [] o.a.s.c.c.SolrZkClient Using default ZkACLProvider. DefaultZkACLProvider is not secure, it creates 'OPEN_ACL_UNSAFE' ACLs to Zookeeper nodes
2> 239535 INFO (TEST-RecoveryAfterSoftCommitTest.test-seed#[5B303761AD35AC72]) [] o.a.c.f.i.CuratorFrameworkImpl Starting
2> 239537 INFO (TEST-RecoveryAfterSoftCommitTest.test-seed#[5B303761AD35AC72]) [] o.a.c.f.i.CuratorFrameworkImpl Default schema
2> 239538 INFO (TEST-RecoveryAfterSoftCommitTest.test-seed#[5B303761AD35AC72]-EventThread) [] o.a.c.f.s.ConnectionStateManager State change: CONNECTED
2> 239538 INFO (TEST-RecoveryAfterSoftCommitTest.test-seed#[5B303761AD35AC72]-EventThread) [] o.a.c.f.i.EnsembleTracker New config event received: {}
2> 239538 INFO (TEST-RecoveryAfterSoftCommitTest.test-seed#[5B303761AD35AC72]-EventThread) [] o.a.c.f.i.EnsembleTracker New config event received: {}
2> 239538 INFO (Curator-Framework-0) [] o.a.c.f.i.CuratorFrameworkImpl backgroundOperationsLoop exiting
2> 239640 INFO (TEST-RecoveryAfterSoftCommitTest.test-seed#[5B303761AD35AC72]) [n:127.0.0.1:37189_solr] o.a.c.f.i.CuratorFrameworkImpl Starting
2> 239642 INFO (TEST-RecoveryAfterSoftCommitTest.test-seed#[5B303761AD35AC72]) [n:127.0.0.1:37189_solr] o.a.c.f.i.CuratorFrameworkImpl Default schema
2> 239643 INFO (TEST-RecoveryAfterSoftCommitTest.test-seed#[5B303761AD35AC72]-EventThread) [] o.a.c.f.s.ConnectionStateManager State change: CONNECTED
2> 239643 INFO (TEST-RecoveryAfterSoftCommitTest.test-seed#[5B303761AD35AC72]-EventThread) [] o.a.c.f.i.EnsembleTracker New config event received: {}
2> 239643 INFO (TEST-RecoveryAfterSoftCommitTest.test-seed#[5B303761AD35AC72]-EventThread) [] o.a.c.f.i.EnsembleTracker New config event received: {}
2> 239664 WARN (TEST-RecoveryAfterSoftCommitTest.test-seed#[5B303761AD35AC72]) [n:127.0.0.1:37189_solr] o.a.s.c.ZkController Contents of zookeeper /security.json are world-readable; consider setting up ACLs as described in https://solr.apache.org/guide/solr/latest/deployment-guide/zookeeper-access-control.html
2> 239668 INFO (TEST-RecoveryAfterSoftCommitTest.test-seed#[5B303761AD35AC72]) [n:127.0.0.1:37189_solr] o.a.s.c.ZkController The Overseer is enabled. It will process all cluster commands & state updates.
2> 239671 INFO (TEST-RecoveryAfterSoftCommitTest.test-seed#[5B303761AD35AC72]) [n:127.0.0.1:37189_solr] o.a.s.c.OverseerElectionContext I am going to be the leader 127.0.0.1:37189_solr
2> 239672 INFO (TEST-RecoveryAfterSoftCommitTest.test-seed#[5B303761AD35AC72]) [n:127.0.0.1:37189_solr] o.a.s.c.Overseer Overseer (id=72077417580396548-127.0.0.1:37189_solr-n_0000000000) starting
2> 239676 INFO (TEST-RecoveryAfterSoftCommitTest.test-seed#[5B303761AD35AC72]) [n:127.0.0.1:37189_solr] o.a.s.c.ZkController Register node as live in ZooKeeper: /live_nodes/127.0.0.1:37189_solr
2> 239676 INFO (OverseerStateUpdate-72077417580396548-127.0.0.1:37189_solr-n_0000000000) [n:127.0.0.1:37189_solr] o.a.s.c.Overseer Starting to work on the main queue : 127.0.0.1:37189_solr
2> 239677 INFO (OverseerStateUpdate-72077417580396548-127.0.0.1:37189_solr-n_0000000000) [n:127.0.0.1:37189_solr] o.a.s.c.c.ZkStateReader Updated live nodes from ZooKeeper... (0) -> (1)
2> 239680 WARN (TEST-RecoveryAfterSoftCommitTest.test-seed#[5B303761AD35AC72]) [n:127.0.0.1:37189_solr] o.a.s.c.CoreContainer Not all security plugins configured! authentication=disabled authorization=disabled. Solr is only as secure as you make it. Consider configuring authentication/authorization before exposing Solr to users internal or external. See https://s.apache.org/solrsecurity for more info
2> 239753 INFO (TEST-RecoveryAfterSoftCommitTest.test-seed#[5B303761AD35AC72]) [n:127.0.0.1:37189_solr] o.a.s.c.CorePropertiesLocator Found 0 core definitions underneath /home/jenkins/jenkins-agent/workspace/Solr/Solr-Test-main/solr/core/build/tmp/tests-tmp/org.apache.solr.cloud.RecoveryAfterSoftCommitTest_5B303761AD35AC72-001/control-001/cores
2> 239812 INFO (TEST-RecoveryAfterSoftCommitTest.test-seed#[5B303761AD35AC72]) [n:127.0.0.1:37189_solr] o.e.j.e.s.ServletContextHandler Started oeje10s.ServletContextHandler@25daa1d7{/solr,/solr,b=file:///home/jenkins/jenkins-agent/workspace/Solr/Solr-Test-main/solr/core/build/tmp/tests-cwd/,a=AVAILABLE,h=oeje10s.ServletHandler@787ab071{STARTED}}
2> 239813 INFO (TEST-RecoveryAfterSoftCommitTest.test-seed#[5B303761AD35AC72]) [n:127.0.0.1:37189_solr] o.e.j.s.AbstractConnector Started oejs.ServerConnector@47be0aa6{HTTP/1.1, (http/1.1, h2c)}{127.0.0.1:43333}
2> 239813 INFO (TEST-RecoveryAfterSoftCommitTest.test-seed#[5B303761AD35AC72]) [n:127.0.0.1:37189_solr] o.e.j.s.Server Started oejs.Server@1c598c01{STARTING}[12.1.12,sto=0] @1105ms
2> 239816 WARN (TEST-RecoveryAfterSoftCommitTest.test-seed#[5B303761AD35AC72]) [] o.a.s.c.c.SolrZkClient Using default ZkCredentialsInjector. ZkCredentialsInjector is not secure, it creates an empty list of credentials which leads to 'OPEN_ACL_UNSAFE' ACLs to Zookeeper nodes
2> 239816 WARN (TEST-RecoveryAfterSoftCommitTest.test-seed#[5B303761AD35AC72]) [] o.a.s.c.c.SolrZkClient Using default ZkACLProvider. DefaultZkACLProvider is not secure, it creates 'OPEN_ACL_UNSAFE' ACLs to Zookeeper nodes
2> 239816 INFO (TEST-RecoveryAfterSoftCommitTest.test-seed#[5B303761AD35AC72]) [] o.a.c.f.i.CuratorFrameworkImpl Starting
2> 239818 INFO (TEST-RecoveryAfterSoftCommitTest.test-seed#[5B303761AD35AC72]) [] o.a.c.f.i.CuratorFrameworkImpl Default schema
2> 239819 INFO (TEST-RecoveryAfterSoftCommitTest.test-seed#[5B303761AD35AC72]-EventThread) [] o.a.c.f.s.ConnectionStateManager State change: CONNECTED
2> 239819 INFO (TEST-RecoveryAfterSoftCommitTest.test-seed#[5B303761AD35AC72]-EventThread) [] o.a.c.f.i.EnsembleTracker New config event received: {}
2> 239819 INFO (TEST-RecoveryAfterSoftCommitTest.test-seed#[5B303761AD35AC72]-EventThread) [] o.a.c.f.i.EnsembleTracker New config event received: {}
2> 239820 INFO (TEST-RecoveryAfterSoftCommitTest.test-seed#[5B303761AD35AC72]) [] o.a.s.c.c.ZkStateReader Updated live nodes from ZooKeeper... (0) -> (1)
2> 239821 INFO (TEST-RecoveryAfterSoftCommitTest.test-seed#[5B303761AD35AC72]) [] o.a.s.c.s.i.ZkClientClusterStateProvider Cluster at 127.0.0.1:43783/solr ready
2> 239822 INFO (SocketProxy-Acceptor-37189) [] o.a.s.u.SocketProxy accepted Socket[addr=/127.0.0.1,port=58684,localport=37189], receiveBufferSize: 65536
2> 239824 INFO (SocketProxy-Acceptor-37189) [] o.a.s.u.SocketProxy proxy connection Socket[addr=/127.0.0.1,port=43333,localport=45016], receiveBufferSize=65536
2> 239830 INFO (OverseerThreadFactory-2862-thread-1) [ c:control_collection t:null-4506] o.a.s.c.a.c.CreateCollectionCmd Create collection control_collection
2> 239830 INFO (OverseerThreadFactory-2862-thread-1) [ c:control_collection t:null-4506] o.a.s.c.a.c.CreateCollectionCmd solr.cloud.prs.enabled : false and collection prs : null, isPRS : false
2> 239834 INFO (OverseerThreadFactory-2862-thread-1) [ c:control_collection t:null-4506] o.a.s.c.c.ZkStateReader /collections/control_collection/state.json is deleted, stop watching children
2> 239835 INFO (zkCallback-2856-thread-1) [] o.a.s.c.c.ZkStateReader A cluster state change: [WatchedEvent state:SyncConnected type:NodeCreated path:/collections/control_collection/state.json zxid: -1] for collection [control_collection] has occurred - updating... (live nodes size: [1])
2> 239842 INFO (OverseerStateUpdate-72077417580396548-127.0.0.1:37189_solr-n_0000000000) [n:127.0.0.1:37189_solr] o.a.s.c.o.SliceMutator createReplica() {
2> "core":"control_collection_shard1_replica_n1",
2> "node_name":"127.0.0.1:37189_solr",
2> "base_url":"http://127.0.0.1:37189/solr",
2> "collection":"control_collection",
2> "shard":"shard1",
2> "state":"down",
2> "type":"NRT",
2> "operation":"ADDREPLICA",
2> "waitForFinalState":"false"}
2> 239945 INFO (zkCallback-2856-thread-1) [] o.a.s.c.c.ZkStateReader A cluster state change: [WatchedEvent state:SyncConnected type:NodeDataChanged path:/collections/control_collection/state.json zxid: -1] for collection [control_collection] has occurred - updating... (live nodes size: [1])
2> 239948 INFO (SocketProxy-Acceptor-37189) [] o.a.s.u.SocketProxy accepted Socket[addr=/127.0.0.1,port=58700,localport=37189], receiveBufferSize: 65536
2> 239948 INFO (SocketProxy-Acceptor-37189) [] o.a.s.u.SocketProxy proxy connection Socket[addr=/127.0.0.1,port=43333,localport=45032], receiveBufferSize=65536
2> 239951 INFO (qtp1873857203-4979-null-4506) [n:127.0.0.1:37189_solr x:control_collection_shard1_replica_n1 t:null-4506] o.a.s.h.a.a.CreateCore core create command "org.apache.solr.client.api.model.CreateCoreParams@5956f94e"
2> 239986 INFO (qtp1873857203-4979-null-4506) [n:127.0.0.1:37189_solr c:control_collection s:shard1 r:core_node2 x:control_collection_shard1_replica_n1 t:null-4506] o.a.s.s.IndexSchema Loaded schema test/1.0 with uniqueid field id
2> 240002 INFO (qtp1873857203-4979-null-4506) [n:127.0.0.1:37189_solr c:control_collection s:shard1 r:core_node2 x:control_collection_shard1_replica_n1 t:null-4506] o.a.s.c.CoreContainer Creating SolrCore 'control_collection_shard1_replica_n1' using configuration from configset conf1
2> 240002 INFO (qtp1873857203-4979-null-4506) [n:127.0.0.1:37189_solr c:control_collection s:shard1 r:core_node2 x:control_collection_shard1_replica_n1 t:null-4506] o.a.s.c.SolrCore Opening new SolrCore at [/home/jenkins/jenkins-agent/workspace/Solr/Solr-Test-main/solr/core/build/tmp/tests-tmp/org.apache.solr.cloud.RecoveryAfterSoftCommitTest_5B303761AD35AC72-001/control-001/cores/control_collection_shard1_replica_n1], dataDir=[/home/jenkins/jenkins-agent/workspace/Solr/Solr-Test-main/solr/core/build/tmp/tests-tmp/org.apache.solr.cloud.RecoveryAfterSoftCommitTest_5B303761AD35AC72-001/control-001/cores/control_collection_shard1_replica_n1/data/]
2> 240003 INFO (qtp1873857203-4979-null-4506) [n:127.0.0.1:37189_solr c:control_collection s:shard1 r:core_node2 x:control_collection_shard1_replica_n1 t:null-4506] o.a.s.u.RandomMergePolicy RandomMergePolicy wrapping class org.apache.lucene.index.TieredMergePolicy: [TieredMergePolicy: maxMergeAtOnce=45, maxMergedSegmentMB=13.144004821777344, floorSegmentMB=1.2054500579833984, forceMergeDeletesPctAllowed=18.831398178116707, segmentsPerTier=29.0, maxCFSSegmentSizeMB=8.796093022208E12, noCFSRatio=0.0, deletesPctAllowed=25.183305251725017, targetSearchConcurrency=5
2> 240005 WARN (qtp1873857203-4979-null-4506) [n:127.0.0.1:37189_solr c:control_collection s:shard1 r:core_node2 x:control_collection_shard1_replica_n1 t:null-4506] o.a.s.c.RequestHandlers INVALID paramSet a in requestHandler {type = requestHandler,name = /dump,class = DumpRequestHandler,attributes = {initParams=a, name=/dump, class=DumpRequestHandler},args = {defaults={a=A, b=B}}}
2> 240036 INFO (qtp1873857203-4979-null-4506) [n:127.0.0.1:37189_solr c:control_collection s:shard1 r:core_node2 x:control_collection_shard1_replica_n1 t:null-4506] o.a.s.u.UpdateLog Initializing UpdateLog: dataDir= defaultSyncLevel=FLUSH numRecordsToKeep=2 maxNumLogsToKeep=10
2> 240037 INFO (qtp1873857203-4979-null-4506) [n:127.0.0.1:37189_solr c:control_collection s:shard1 r:core_node2 x:control_collection_shard1_replica_n1 t:null-4506] o.a.s.u.CommitTracker Hard AutoCommit: disabled
2> 240037 INFO (qtp1873857203-4979-null-4506) [n:127.0.0.1:37189_solr c:control_collection s:shard1 r:core_node2 x:control_collection_shard1_replica_n1 t:null-4506] o.a.s.u.CommitTracker Soft AutoCommit: disabled
2> 240038 INFO (qtp1873857203-4979-null-4506) [n:127.0.0.1:37189_solr c:control_collection s:shard1 r:core_node2 x:control_collection_shard1_replica_n1 t:null-4506] o.a.s.u.RandomMergePolicy RandomMergePolicy wrapping class org.apache.lucene.index.TieredMergePolicy: [TieredMergePolicy: maxMergeAtOnce=39, maxMergedSegmentMB=81.26481437683105, floorSegmentMB=1.0687389373779297, forceMergeDeletesPctAllowed=25.578285479648674, segmentsPerTier=33.0, maxCFSSegmentSizeMB=8.796093022208E12, noCFSRatio=1.0, deletesPctAllowed=40.60123061112455, targetSearchConcurrency=7
2> 240040 INFO (qtp1873857203-4979-null-4506) [n:127.0.0.1:37189_solr c:control_collection s:shard1 r:core_node2 x:control_collection_shard1_replica_n1 t:null-4506] o.a.s.r.ManagedResourceStorage Configured ZooKeeperStorageIO with znodeBase: /configs/conf1
2> 240041 INFO (qtp1873857203-4979-null-4506) [n:127.0.0.1:37189_solr c:control_collection s:shard1 r:core_node2 x:control_collection_shard1_replica_n1 t:null-4506] o.a.s.r.ManagedResourceStorage Loaded null at path _rest_managed.json using ZooKeeperStorageIO:path=/configs/conf1
2> 240041 INFO (qtp1873857203-4979-null-4506) [n:127.0.0.1:37189_solr c:control_collection s:shard1 r:core_node2 x:control_collection_shard1_replica_n1 t:null-4506] o.a.s.h.ReplicationHandler Commits will be reserved for 10000 ms
2> 240042 INFO (searcherExecutor-2873-thread-1-processing-127.0.0.1:37189_solr control_collection_shard1_replica_n1 null-4506 control_collection shard1 core_node2) [n:127.0.0.1:37189_solr c:control_collection s:shard1 r:core_node2 x:control_collection_shard1_replica_n1 t:null-4506] o.a.s.c.SolrCore Registered new searcher autowarm time: 0 ms
2> 240046 INFO (qtp1873857203-4979-null-4506) [n:127.0.0.1:37189_solr c:control_collection s:shard1 r:core_node2 x:control_collection_shard1_replica_n1 t:null-4506] o.a.s.c.ZkShardTerms Successful update of terms at /collections/control_collection/terms/shard1 to Terms{values={core_node2=0}, version=0} for registerTerm
2> 240046 INFO (qtp1873857203-4979-null-4506) [n:127.0.0.1:37189_solr c:control_collection s:shard1 r:core_node2 x:control_collection_shard1_replica_n1 t:null-4506] o.a.s.c.ShardLeaderElectionContextBase make sure parent is created /collections/control_collection/leaders/shard1
2> 240054 INFO (qtp1873857203-4979-null-4506) [n:127.0.0.1:37189_solr c:control_collection s:shard1 r:core_node2 x:control_collection_shard1_replica_n1 t:null-4506] o.a.s.c.ShardLeaderElectionContext Enough replicas found to continue.
2> 240054 INFO (qtp1873857203-4979-null-4506) [n:127.0.0.1:37189_solr c:control_collection s:shard1 r:core_node2 x:control_collection_shard1_replica_n1 t:null-4506] o.a.s.c.ShardLeaderElectionContext I may be the new leader - try and sync
2> 240054 INFO (qtp1873857203-4979-null-4506) [n:127.0.0.1:37189_solr c:control_collection s:shard1 r:core_node2 x:control_collection_shard1_replica_n1 t:null-4506] o.a.s.c.SyncStrategy Sync replicas to http://127.0.0.1:37189/solr/control_collection_shard1_replica_n1/
2> 240055 INFO (qtp1873857203-4979-null-4506) [n:127.0.0.1:37189_solr c:control_collection s:shard1 r:core_node2 x:control_collection_shard1_replica_n1 t:null-4506] o.a.s.c.SyncStrategy Sync Success - now sync replicas to me
2> 240055 INFO (qtp1873857203-4979-null-4506) [n:127.0.0.1:37189_solr c:control_collection s:shard1 r:core_node2 x:control_collection_shard1_replica_n1 t:null-4506] o.a.s.c.SyncStrategy http://127.0.0.1:37189/solr/control_collection_shard1_replica_n1/ has no replicas
2> 240055 INFO (qtp1873857203-4979-null-4506) [n:127.0.0.1:37189_solr c:control_collection s:shard1 r:core_node2 x:control_collection_shard1_replica_n1 t:null-4506] o.a.s.c.ShardLeaderElectionContextBase Creating leader registration node /collections/control_collection/leaders/shard1/leader after winning as /collections/control_collection/leader_elect/shard1/election/72077417580396548-core_node2-n_0000000000
2> 240161 INFO (zkCallback-2856-thread-1) [] o.a.s.c.c.ZkStateReader A cluster state change: [WatchedEvent state:SyncConnected type:NodeDataChanged path:/collections/control_collection/state.json zxid: -1] for collection [control_collection] has occurred - updating... (live nodes size: [1])
2> 240161 INFO (qtp1873857203-4979-null-4506) [n:127.0.0.1:37189_solr c:control_collection s:shard1 r:core_node2 x:control_collection_shard1_replica_n1 t:null-4506] o.a.s.c.ShardLeaderElectionContext I am the new leader: http://127.0.0.1:37189/solr/control_collection_shard1_replica_n1/ shard1
2> 240163 INFO (qtp1873857203-4979-null-4506) [n:127.0.0.1:37189_solr c:control_collection s:shard1 r:core_node2 x:control_collection_shard1_replica_n1 t:null-4506] o.a.s.c.ZkController I am the leader, no recovery necessary
2> 240167 INFO (qtp1873857203-4979-null-4506) [n:127.0.0.1:37189_solr t:null-4506] o.a.s.s.HttpSolrCall [admin] path=/admin/cores params={coreNodeName=core_node2&collection.configName=conf1&newCollection=true&name=control_collection_shard1_replica_n1&action=CREATE&numShards=1&collection=control_collection&shard=shard1&wt=javabin&replicaType=NRT} status=0 QTime=216
2> 240169 INFO (qtp1873857203-4976-null-4505) [n:127.0.0.1:37189_solr c:control_collection t:null-4505] o.a.s.h.a.CollectionsHandler Wait for new collection to be active for at most 45 seconds. Check all shard replicas
2> 240266 INFO (zkCallback-2856-thread-2) [] o.a.s.c.c.ZkStateReader A cluster state change: [WatchedEvent state:SyncConnected type:NodeDataChanged path:/collections/control_collection/state.json zxid: -1] for collection [control_collection] has occurred - updating... (live nodes size: [1])
2> 240268 INFO (qtp1873857203-4976-null-4505) [n:127.0.0.1:37189_solr c:control_collection t:null-4505] o.a.s.s.HttpSolrCall [admin] path=/admin/collections params={collection.configName=conf1&name=control_collection&nrtReplicas=1&action=CREATE&numShards=1&createNodeSet=127.0.0.1:37189_solr&wt=javabin} status=0 QTime=441
2> 240268 INFO (TEST-RecoveryAfterSoftCommitTest.test-seed#[5B303761AD35AC72]) [] o.a.s.c.AbstractFullDistribZkTestBase Waiting to see 1 active replicas in collection: control_collection
2> 240269 INFO (Curator-Framework-0) [] o.a.c.f.i.CuratorFrameworkImpl backgroundOperationsLoop exiting
2> 240376 WARN (TEST-RecoveryAfterSoftCommitTest.test-seed#[5B303761AD35AC72]) [] o.a.s.c.c.SolrZkClient Using default ZkCredentialsInjector. ZkCredentialsInjector is not secure, it creates an empty list of credentials which leads to 'OPEN_ACL_UNSAFE' ACLs to Zookeeper nodes
2> 240376 WARN (TEST-RecoveryAfterSoftCommitTest.test-seed#[5B303761AD35AC72]) [] o.a.s.c.c.SolrZkClient Using default ZkACLProvider. DefaultZkACLProvider is not secure, it creates 'OPEN_ACL_UNSAFE' ACLs to Zookeeper nodes
2> 240376 INFO (TEST-RecoveryAfterSoftCommitTest.test-seed#[5B303761AD35AC72]) [] o.a.c.f.i.CuratorFrameworkImpl Starting
2> 240378 INFO (TEST-RecoveryAfterSoftCommitTest.test-seed#[5B303761AD35AC72]) [] o.a.c.f.i.CuratorFrameworkImpl Default schema
2> 240379 INFO (TEST-RecoveryAfterSoftCommitTest.test-seed#[5B303761AD35AC72]-EventThread) [] o.a.c.f.s.ConnectionStateManager State change: CONNECTED
2> 240380 INFO (TEST-RecoveryAfterSoftCommitTest.test-seed#[5B303761AD35AC72]-EventThread) [] o.a.c.f.i.EnsembleTracker New config event received: {}
2> 240380 INFO (TEST-RecoveryAfterSoftCommitTest.test-seed#[5B303761AD35AC72]-EventThread) [] o.a.c.f.i.EnsembleTracker New config event received: {}
2> 240381 INFO (TEST-RecoveryAfterSoftCommitTest.test-seed#[5B303761AD35AC72]) [] o.a.s.c.c.ZkStateReader Updated live nodes from ZooKeeper... (0) -> (1)
2> 240383 INFO (TEST-RecoveryAfterSoftCommitTest.test-seed#[5B303761AD35AC72]) [] o.a.s.c.s.i.ZkClientClusterStateProvider Cluster at 127.0.0.1:43783/solr ready
2> 240383 INFO (TEST-RecoveryAfterSoftCommitTest.test-seed#[5B303761AD35AC72]) [] o.a.s.c.ChaosMonkey monkey: init - expire sessions:false cause connection loss:false
2> 240384 INFO (SocketProxy-Acceptor-37189) [] o.a.s.u.SocketProxy accepted Socket[addr=/127.0.0.1,port=58702,localport=37189], receiveBufferSize: 65536
2> 240384 INFO (SocketProxy-Acceptor-37189) [] o.a.s.u.SocketProxy proxy connection Socket[addr=/127.0.0.1,port=43333,localport=45048], receiveBufferSize=65536
2> 240390 INFO (OverseerThreadFactory-2862-thread-2) [ c:collection1 t:null-4508] o.a.s.c.a.c.CreateCollectionCmd Create collection collection1
2> 240390 INFO (OverseerThreadFactory-2862-thread-2) [ c:collection1 t:null-4508] o.a.s.c.a.c.CreateCollectionCmd solr.cloud.prs.enabled : false and collection prs : null, isPRS : false
2> 240393 INFO (OverseerThreadFactory-2862-thread-2) [ c:collection1 t:null-4508] o.a.s.c.c.ZkStateReader /collections/collection1/state.json is deleted, stop watching children
2> 240497 INFO (zkCallback-2856-thread-2) [] o.a.s.c.c.ZkStateReader A cluster state change: [WatchedEvent state:SyncConnected type:NodeCreated path:/collections/collection1/state.json zxid: -1] for collection [collection1] has occurred - updating... (live nodes size: [1])
2> 240498 WARN (OverseerThreadFactory-2862-thread-2) [ c:collection1 t:null-4508] o.a.s.c.a.c.CreateCollectionCmd It is unusual to create a collection (collection1) without cores.
2> 240500 INFO (qtp1873857203-4978-null-4507) [n:127.0.0.1:37189_solr c:collection1 t:null-4507] o.a.s.h.a.CollectionsHandler Wait for new collection to be active for at most 45 seconds. Check all shard replicas
2> 240500 INFO (qtp1873857203-4978-null-4507) [n:127.0.0.1:37189_solr c:collection1 t:null-4507] o.a.s.s.HttpSolrCall [admin] path=/admin/collections params={collection.configName=conf1&name=collection1&nrtReplicas=1&action=CREATE&numShards=1&createNodeSet=&wt=javabin} status=0 QTime=114
2> 240502 INFO (TEST-RecoveryAfterSoftCommitTest.test-seed#[5B303761AD35AC72]) [] o.a.s.c.SolrCloudTestCase active slice count: 1 expected: 1
2> 240502 INFO (TEST-RecoveryAfterSoftCommitTest.test-seed#[5B303761AD35AC72]) [] o.a.s.c.SolrCloudTestCase active replica count: 0 expected replica count: 0
2> 240502 INFO (TEST-RecoveryAfterSoftCommitTest.test-seed#[5B303761AD35AC72]) [] o.a.s.c.AbstractFullDistribZkTestBase Creating jetty instances pullReplicaCount=0 numOtherReplicas=2
2> 240681 INFO (TEST-RecoveryAfterSoftCommitTest.test-seed#[5B303761AD35AC72]) [] o.a.s.c.AbstractFullDistribZkTestBase create jetty 1 in directory /home/jenkins/jenkins-agent/workspace/Solr/Solr-Test-main/solr/core/build/tmp/tests-tmp/org.apache.solr.cloud.RecoveryAfterSoftCommitTest_5B303761AD35AC72-001/shard-1-001 of type NRT for shard1
2> 240683 INFO (closeThreadPool-2885-thread-1) [] o.a.s.e.JettySolrRunner Start Jetty (configured port=0, binding port=0)
2> 240683 INFO (closeThreadPool-2885-thread-1) [] o.a.s.e.JettySolrRunner Trying to start Jetty on port 0 try number 2 ...
2> 240683 INFO (closeThreadPool-2885-thread-1) [] o.e.j.s.Server jetty-12.1.12; built: 2026-08-03T22:37:55.389Z; git: 10dd3948f37767b84cc2c62358364f042e51dbbe; jvm 21.0.4+7-LTS
2> 240684 INFO (closeThreadPool-2885-thread-1) [] o.e.j.s.DefaultSessionIdManager Session workerName=node0
2> 240685 WARN (closeThreadPool-2885-thread-1) [] o.e.j.e.s.ServletContextHandler BaseResource file:///home/jenkins/jenkins-agent/workspace/Solr/Solr-Test-main/solr/core/build/tmp/tests-cwd/./ is aliased to file:///home/jenkins/jenkins-agent/workspace/Solr/Solr-Test-main/solr/core/build/tmp/tests-cwd/ in oeje10s.ServletContextHandler@60cdf757{/solr,/solr,b=file:///home/jenkins/jenkins-agent/workspace/Solr/Solr-Test-main/solr/core/build/tmp/tests-cwd/./,a=STOPPED,h=oeje10s.ServletHandler@5d48f6f{STOPPED}}. May not be supported in future releases.
2> 240685 INFO (closeThreadPool-2885-thread-1) [] o.e.j.s.h.ContextHandler /solr Base Resource is an alias: file:///home/jenkins/jenkins-agent/workspace/Solr/Solr-Test-main/solr/core/build/tmp/tests-cwd/./ -> file:///home/jenkins/jenkins-agent/workspace/Solr/Solr-Test-main/solr/core/build/tmp/tests-cwd/
2> 240685 INFO (closeThreadPool-2885-thread-1) [] o.e.j.s.h.ContextHandler Started oeje10s.ServletContextHandler@60cdf757{/solr,/solr,b=file:///home/jenkins/jenkins-agent/workspace/Solr/Solr-Test-main/solr/core/build/tmp/tests-cwd/,a=AVAILABLE,h=oeje10s.ServletHandler@5d48f6f{STARTED}}
2> 240686 INFO (closeThreadPool-2885-thread-1) [] o.a.s.e.JettySolrRunner Jetty properties: {solrconfig=solrconfig.xml, solr.data.dir=/home/jenkins/jenkins-agent/workspace/Solr/Solr-Test-main/solr/core/build/tmp/tests-tmp/org.apache.solr.cloud.RecoveryAfterSoftCommitTest_5B303761AD35AC72-001/tempDir-001/jetty1, hostPort=46015, coreRootDirectory=/home/jenkins/jenkins-agent/workspace/Solr/Solr-Test-main/solr/core/build/tmp/tests-tmp/org.apache.solr.cloud.RecoveryAfterSoftCommitTest_5B303761AD35AC72-001/shard-1-001/cores}
2> 240686 ERROR (closeThreadPool-2885-thread-1) [] o.a.s.u.StartupLoggingUtils Missing Java Option solr.logs.dir. Logging may be missing or incomplete.
2> 240686 INFO (closeThreadPool-2885-thread-1) [] o.a.s.s.CoreContainerProvider Using logger factory org.apache.logging.slf4j.Log4jLoggerFactory
2> 240686 INFO (closeThreadPool-2885-thread-1) [] o.a.s.s.CoreContainerProvider ___ _ Welcome to Apache Solr™ version 11.0.0
2> 240686 INFO (closeThreadPool-2885-thread-1) [] o.a.s.s.CoreContainerProvider / __| ___| |_ _ Starting in cloud mode on port null
2> 240686 INFO (closeThreadPool-2885-thread-1) [] o.a.s.s.CoreContainerProvider \__ \/ _ \ | '_| Install dir: /home/jenkins/jenkins-agent/workspace/Solr/Solr-Test-main/solr
2> 240686 INFO (closeThreadPool-2885-thread-1) [] o.a.s.s.CoreContainerProvider |___/\___/_|_| Start time: 2026-09-07T18:32:43.444225115Z
2> 240686 INFO (closeThreadPool-2885-thread-1) [] o.a.s.s.CoreContainerProvider Solr Home: /home/jenkins/jenkins-agent/workspace/Solr/Solr-Test-main/solr/core/build/tmp/tests-tmp/org.apache.solr.cloud.RecoveryAfterSoftCommitTest_5B303761AD35AC72-001/shard-1-001 (source: servlet config: solr.solr.home)
2> 240686 WARN (closeThreadPool-2885-thread-1) [] o.a.s.c.c.SolrZkClient Using default ZkCredentialsInjector. ZkCredentialsInjector is not secure, it creates an empty list of credentials which leads to 'OPEN_ACL_UNSAFE' ACLs to Zookeeper nodes
2> 240686 WARN (closeThreadPool-2885-thread-1) [] o.a.s.c.c.SolrZkClient Using default ZkACLProvider. DefaultZkACLProvider is not secure, it creates 'OPEN_ACL_UNSAFE' ACLs to Zookeeper nodes
2> 240686 INFO (closeThreadPool-2885-thread-1) [] o.a.c.f.i.CuratorFrameworkImpl Starting
2> 240688 INFO (closeThreadPool-2885-thread-1) [] o.a.c.f.i.CuratorFrameworkImpl Default schema
2> 240689 INFO (closeThreadPool-2885-thread-1-EventThread) [] o.a.c.f.s.ConnectionStateManager State change: CONNECTED
2> 240689 INFO (closeThreadPool-2885-thread-1-EventThread) [] o.a.c.f.i.EnsembleTracker New config event received: {}
2> 240689 INFO (closeThreadPool-2885-thread-1-EventThread) [] o.a.c.f.i.EnsembleTracker New config event received: {}
2> 240690 INFO (Curator-Framework-0) [] o.a.c.f.i.CuratorFrameworkImpl backgroundOperationsLoop exiting
2> 240791 INFO (closeThreadPool-2885-thread-1) [] o.a.s.c.SolrXmlConfig Loading solr.xml from /home/jenkins/jenkins-agent/workspace/Solr/Solr-Test-main/solr/core/build/tmp/tests-tmp/org.apa
[...truncated too long message...]
cannot be instantiated.
java.security.policy: error adding Permission, java.net.URLPermission:
java.util.ServiceConfigurationError: Locale provider adapter "CLDR"cannot be instantiated.
java.security.policy: error adding Permission, java.net.URLPermission:
java.util.ServiceConfigurationError: Locale provider adapter "CLDR"cannot be instantiated.
java.security.policy: error adding Permission, java.net.URLPermission:
java.util.ServiceConfigurationError: Locale provider adapter "CLDR"cannot be instantiated.
java.security.policy: error adding Permission, java.net.URLPermission:
java.util.ServiceConfigurationError: Locale provider adapter "CLDR"cannot be instantiated.
java.security.policy: error adding Permission, java.net.URLPermission:
java.util.ServiceConfigurationError: Locale provider adapter "CLDR"cannot be instantiated.
java.security.policy: error adding Permission, java.net.URLPermission:
java.util.ServiceConfigurationError: Locale provider adapter "CLDR"cannot be instantiated.
java.security.policy: error adding Permission, java.net.URLPermission:
java.util.ServiceConfigurationError: Locale provider adapter "CLDR"cannot be instantiated.
java.security.policy: error adding Permission, java.net.URLPermission:
java.util.ServiceConfigurationError: Locale provider adapter "CLDR"cannot be instantiated.
java.security.policy: error adding Permission, java.net.URLPermission:
java.util.ServiceConfigurationError: Locale provider adapter "CLDR"cannot be instantiated.
java.security.policy: error adding Permission, java.net.URLPermission:
java.util.ServiceConfigurationError: Locale provider adapter "CLDR"cannot be instantiated.
java.security.policy: error adding Permission, java.net.URLPermission:
java.util.ServiceConfigurationError: Locale provider adapter "CLDR"cannot be instantiated.
java.security.policy: error adding Permission, java.net.URLPermission:
java.util.ServiceConfigurationError: Locale provider adapter "CLDR"cannot be instantiated.
java.security.policy: error adding Permission, java.net.URLPermission:
java.util.ServiceConfigurationError: Locale provider adapter "CLDR"cannot be instantiated.
java.security.policy: error adding Permission, java.net.URLPermission:
java.util.ServiceConfigurationError: Locale provider adapter "CLDR"cannot be instantiated.
java.security.policy: error adding Permission, java.net.URLPermission:
java.util.ServiceConfigurationError: Locale provider adapter "CLDR"cannot be instantiated.
java.security.policy: error adding Permission, java.net.URLPermission:
java.util.ServiceConfigurationError: Locale provider adapter "CLDR"cannot be instantiated.
java.security.policy: error adding Permission, java.net.URLPermission:
java.util.ServiceConfigurationError: Locale provider adapter "CLDR"cannot be instantiated.
java.security.policy: error adding Permission, java.net.URLPermission:
java.util.ServiceConfigurationError: Locale provider adapter "CLDR"cannot be instantiated.
java.security.policy: error adding Permission, java.net.URLPermission:
java.util.ServiceConfigurationError: Locale provider adapter "CLDR"cannot be instantiated.
:solr:modules:scripting:test (SUCCESS): 24 test(s), 19 skipped
> Task :solr:modules:scripting:wipeTaskTemp
> Task :solr:modules:sql:compileTestJava
> Task :solr:modules:sql:testClasses
> Task :solr:modules:sql:test
WARNING: Using incubator modules: jdk.incubator.vector
WARNING: Using incubator modules: jdk.incubator.vector
WARNING: Using incubator modules: jdk.incubator.vector
WARNING: A command line option has enabled the Security Manager
WARNING: The Security Manager is deprecated and will be removed in a future release
WARNING: A command line option has enabled the Security Manager
WARNING: The Security Manager is deprecated and will be removed in a future release
WARNING: A command line option has enabled the Security Manager
WARNING: The Security Manager is deprecated and will be removed in a future release
java.security.policy: error adding Permission, java.net.URLPermission:
java.util.ServiceConfigurationError: Locale provider adapter "CLDR"cannot be instantiated.
java.security.policy: error adding Permission, java.net.URLPermission:
java.util.ServiceConfigurationError: Locale provider adapter "CLDR"cannot be instantiated.
java.security.policy: error adding Permission, java.net.URLPermission:
java.util.ServiceConfigurationError: Locale provider adapter "CLDR"cannot be instantiated.
java.security.policy: error adding Permission, java.net.URLPermission:
java.util.ServiceConfigurationError: Locale provider adapter "CLDR"cannot be instantiated.
java.security.policy: error adding Permission, java.net.URLPermission:
java.util.ServiceConfigurationError: Locale provider adapter "CLDR"cannot be instantiated.
java.security.policy: error adding Permission, java.net.URLPermission:
java.util.ServiceConfigurationError: Locale provider adapter "CLDR"cannot be instantiated.
java.security.policy: error adding Permission, java.net.URLPermission:
java.util.ServiceConfigurationError: Locale provider adapter "CLDR"cannot be instantiated.
java.security.policy: error adding Permission, java.net.URLPermission:
java.util.ServiceConfigurationError: Locale provider adapter "CLDR"cannot be instantiated.
java.security.policy: error adding Permission, java.net.URLPermission:
java.util.ServiceConfigurationError: Locale provider adapter "CLDR"cannot be instantiated.
java.security.policy: error adding Permission, java.net.URLPermission:
java.util.ServiceConfigurationError: Locale provider adapter "CLDR"cannot be instantiated.
java.security.policy: error adding Permission, java.net.URLPermission:
java.util.ServiceConfigurationError: Locale provider adapter "CLDR"cannot be instantiated.
java.security.policy: error adding Permission, java.net.URLPermission:
java.util.ServiceConfigurationError: Locale provider adapter "CLDR"cannot be instantiated.
java.security.policy: error adding Permission, java.net.URLPermission:
java.util.ServiceConfigurationError: Locale provider adapter "CLDR"cannot be instantiated.
java.security.policy: error adding Permission, java.net.URLPermission:
java.util.ServiceConfigurationError: Locale provider adapter "CLDR"cannot be instantiated.
java.security.policy: error adding Permission, java.net.URLPermission:
java.util.ServiceConfigurationError: Locale provider adapter "CLDR"cannot be instantiated.
:solr:modules:sql:test (SUCCESS): 36 test(s)
> Task :checkWorkingCopyClean
> Task :solr:modules:sql:wipeTaskTemp
The slowest tests (exceeding 500 ms) during this run:
66.36s TestCpuAllowedLimit.testDistribLimit2 (:solr:core)
57.49s TestCpuAllowedLimit.testDistribLimit (:solr:core)
43.76s TestCloudJSONFacetSKG.testRandom (:solr:core)
41.17s PeerSyncReplicationTest.test (:solr:core)
40.27s BasicDistributedZkTest.test (:solr:core)
40.14s HttpJettySolrClientTest.testIdleTimeoutWithHttpClient (:solr:solrj-jetty)
36.42s TestRandomFaceting.testRandomFaceting (:solr:core)
34.84s TestCloudSearcherWarming.testPeersyncFailureReplicationSuccess (:solr:core)
32.85s TestCoordinatorRole.testNRTRestart (:solr:core)
30.84s TestRandomCollapseQParserPlugin.testRandomCollapseWithSort (:solr:core)
The slowest suites (exceeding 1s) during this run:
129.28s TestCpuAllowedLimit (:solr:core)
77.53s TestCoordinatorRole (:solr:core)
71.24s KnnQParserTest (:solr:core)
64.00s MultiThreadedOCPTest (:solr:core)
59.05s TestRecovery (:solr:core)
58.57s ReindexCollectionTest (:solr:core)
56.06s TestTlogReplica (:solr:core)
54.29s CombinedQuerySolrCloudTest (:solr:core)
49.19s HttpJettySolrClientTest (:solr:solrj-jetty)
48.93s TestInPlaceUpdatesStandalone (:solr:core)
ERROR: The following test(s) have failed:
- org.apache.solr.cloud.RecoveryAfterSoftCommitTest.test (:solr:core)
Test history: https://develocity.apache.org/scans/tests?search.rootProjectNames=solr-root&tests.container=org.apache.solr.cloud.RecoveryAfterSoftCommitTest&tests.test=test http://fucit.org/solr-jenkins-reports/history-trend-of-recent-failures.html#series/org.apache.solr.cloud.RecoveryAfterSoftCommitTest.test
Test output: /home/jenkins/jenkins-agent/workspace/Solr/Solr-Test-main/solr/core/build/test-results/test/outputs/OUTPUT-org.apache.solr.cloud.RecoveryAfterSoftCommitTest.txt
Reproduce with: ./gradlew :solr:core:test --tests "org.apache.solr.cloud.RecoveryAfterSoftCommitTest.test" -Ptests.haltonfailure=false "-Ptests.jvmargs=-XX:TieredStopAtLevel=1 -XX:+UseParallelGC -XX:ActiveProcessorCount=1 -XX:ReservedCodeCacheSize=120m" -Ptests.seed=5B303761AD35AC72 -Ptests.multiplier=2 -Ptests.useSecurityManager=true -Ptests.badapples=false -Ptests.file.encoding=UTF-8
[Incubating] Problems report is available at: file:///home/jenkins/jenkins-agent/workspace/Solr/Solr-Test-main/build/reports/problems/problems-report.html
Deprecated Gradle features were used in this build, making it incompatible with Gradle 10.
You can use '--warning-mode all' to show the individual deprecation warnings and determine if they come from your own scripts or plugins.
For more on this, please refer to https://docs.gradle.org/9.7.0/userguide/command_line_interface.html#sec:command_line_warnings in the Gradle documentation.
BUILD SUCCESSFUL in 37m 39s
156 actionable tasks: 156 executed
Publishing Build Scan to Develocity...
The Develocity server (develocity.apache.org) rejected the credential with prefix '7x3jzizm4zpygv7psbkg6byvm4'.
Your credential has expired.
Build step 'Invoke Gradle script' changed build result to SUCCESS
Archiving artifacts
‘**/*.events’ doesn’t match anything: ‘**’ exists but not ‘**/*.events’
No artifacts found that match the file pattern "**/*.events,heapdumps/**,**/hs_err_pid*". Configuration error?
Recording test results
[Checks API] No suitable checks publisher found.
Build step 'Publish JUnit test result report' changed build result to UNSTABLE
Email was triggered for: Unstable (Test Failures)
Sending email for trigger: Unstable (Test Failures)