You are viewing a plain text version of this content. The canonical link for it is here.
Posted to notifications@qpid.apache.org by Apache Jenkins Server <je...@builds.apache.org> on 2012/09/24 04:47:04 UTC
Build failed in Jenkins: Qpid-Java-Java-Test-IBMJDK1.6 #218
See <https://builds.apache.org/job/Qpid-Java-Java-Test-IBMJDK1.6/218/changes>
Changes:
[robbie] QPID-4341: ensure the Topic perftests actually use Topic destinations
[robbie] NO-JIRA: move test-only dependency on common into module.test.depends. Clarify a comment slightly.
------------------------------------------
[...truncated 2810 lines...]
libs:
copy-bin:
copy-etc:
postbuild:
build:
test:
[echo] Using profile:java-mms.0-10
[junit] Running org.apache.qpid.server.security.access.plugins.AccessControlTest
[junit] Tests run: 11, Failures: 0, Errors: 0, Time elapsed: 0.213 sec
[junit] Running org.apache.qpid.server.security.access.plugins.PlainConfigurationTest
[junit] Tests run: 22, Failures: 0, Errors: 0, Time elapsed: 0.359 sec
[junit] Running org.apache.qpid.server.security.access.plugins.RuleSetTest
[junit] Tests run: 20, Failures: 0, Errors: 0, Time elapsed: 0.049 sec
[echo] Running ant for module : broker-plugins/access-control
[delete] Deleting: <https://builds.apache.org/job/Qpid-Java-Java-Test-IBMJDK1.6/ws/trunk/qpid/java/build/scratch/test-java-mms.0-10.properties>
touch-failed:
[echo] Running ant for module : broker-plugins/firewall
[delete] Deleting: <https://builds.apache.org/job/Qpid-Java-Java-Test-IBMJDK1.6/ws/trunk/qpid/java/build/scratch/test-java-mms.0-10.properties>
prepare:
precompile:
compile:
[echo] Targeting : 1.5
copy-metainf-resources:
copy-module-metainf:
jar.manifest:
jar.nomanifest:
jar:
precompile-tests:
compile-tests:
jar-tests:
jar-sources:
libs:
copy-bin:
copy-etc:
postbuild:
build:
test:
[echo] Using profile:java-mms.0-10
[junit] Running org.apache.qpid.server.security.access.FirewallConfigurationTest
[junit] Tests run: 5, Failures: 0, Errors: 0, Time elapsed: 2.168 sec
[junit] Running org.apache.qpid.server.security.access.FirewallPluginTest
[junit] Tests run: 10, Failures: 0, Errors: 0, Time elapsed: 0.915 sec
[echo] Running ant for module : broker-plugins/firewall
[delete] Deleting: <https://builds.apache.org/job/Qpid-Java-Java-Test-IBMJDK1.6/ws/trunk/qpid/java/build/scratch/test-java-mms.0-10.properties>
touch-failed:
[echo] Running ant for module : broker-plugins/management-http
[delete] Deleting: <https://builds.apache.org/job/Qpid-Java-Java-Test-IBMJDK1.6/ws/trunk/qpid/java/build/scratch/test-java-mms.0-10.properties>
prepare:
unwardojo:
precompile:
compile:
[echo] Targeting : 1.5
copy-metainf-resources:
copy-module-metainf:
jar.manifest:
jar.nomanifest:
jar:
precompile-tests:
compile-tests:
jar-tests:
jar-sources:
libs:
copy-bin:
copy-etc:
postbuild:
build:
test:
[echo] Using profile:java-mms.0-10
[junit] Running org.apache.qpid.server.management.plugin.servlet.rest.AuthenticationProviderRestTest
[junit] Tests run: 1, Failures: 0, Errors: 0, Time elapsed: 2.008 sec
[junit] Running org.apache.qpid.server.management.plugin.servlet.rest.BasicAuthRestTest
[junit] Tests run: 4, Failures: 0, Errors: 0, Time elapsed: 1.668 sec
[junit] Running org.apache.qpid.server.management.plugin.servlet.rest.BindingRestTest
[junit] Tests run: 7, Failures: 0, Errors: 0, Time elapsed: 1.765 sec
[junit] Running org.apache.qpid.server.management.plugin.servlet.rest.BrokerRestHttpsTest
[junit] Tests run: 1, Failures: 1, Errors: 0, Time elapsed: 0.433 sec
[junit] TEST org.apache.qpid.server.management.plugin.servlet.rest.BrokerRestHttpsTest FAILED
[junit] Running org.apache.qpid.server.management.plugin.servlet.rest.BrokerRestTest
[junit] Tests run: 1, Failures: 0, Errors: 0, Time elapsed: 0.263 sec
[junit] Running org.apache.qpid.server.management.plugin.servlet.rest.ConfiguredObjectToMapConverterTest
[junit] Tests run: 4, Failures: 0, Errors: 0, Time elapsed: 0.042 sec
[junit] Running org.apache.qpid.server.management.plugin.servlet.rest.ConnectionRestTest
[junit] Tests run: 7, Failures: 0, Errors: 0, Time elapsed: 2.364 sec
[junit] Running org.apache.qpid.server.management.plugin.servlet.rest.ExchangeRestTest
[junit] Tests run: 3, Failures: 0, Errors: 0, Time elapsed: 0.668 sec
[junit] Running org.apache.qpid.server.management.plugin.servlet.rest.GroupProviderRestTest
[junit] Tests run: 3, Failures: 0, Errors: 0, Time elapsed: 0.687 sec
[junit] Running org.apache.qpid.server.management.plugin.servlet.rest.GroupRestTest
[junit] Tests run: 3, Failures: 0, Errors: 0, Time elapsed: 0.617 sec
[junit] Running org.apache.qpid.server.management.plugin.servlet.rest.LogRecordsRestTest
[junit] Tests run: 1, Failures: 0, Errors: 0, Time elapsed: 0.242 sec
[junit] Running org.apache.qpid.server.management.plugin.servlet.rest.MessagesRestTest
[junit] Tests run: 5, Failures: 0, Errors: 0, Time elapsed: 1.25 sec
[junit] Running org.apache.qpid.server.management.plugin.servlet.rest.PortRestTest
[junit] Tests run: 2, Failures: 0, Errors: 0, Time elapsed: 0.403 sec
[junit] Running org.apache.qpid.server.management.plugin.servlet.rest.QueueRestTest
[junit] Tests run: 3, Failures: 0, Errors: 0, Time elapsed: 0.713 sec
[junit] Running org.apache.qpid.server.management.plugin.servlet.rest.SaslRestTest
[junit] Tests run: 1, Failures: 0, Errors: 0, Time elapsed: 0.206 sec
[junit] Running org.apache.qpid.server.management.plugin.servlet.rest.StructureRestTest
[junit] Tests run: 1, Failures: 0, Errors: 0, Time elapsed: 0.235 sec
[junit] Running org.apache.qpid.server.management.plugin.servlet.rest.UserRestTest
[junit] Tests run: 4, Failures: 0, Errors: 0, Time elapsed: 0.802 sec
[junit] Running org.apache.qpid.server.management.plugin.servlet.rest.VirtualHostRestTest
[junit] Tests run: 15, Failures: 0, Errors: 0, Time elapsed: 3.158 sec
[junit] Running org.apache.qpid.server.management.plugin.session.LoginLogoutReporterTest
[junit] Tests run: 2, Failures: 0, Errors: 0, Time elapsed: 0.021 sec
[junit] Running org.apache.qpid.systest.rest.acl.GroupRestACLTest
[junit] Tests run: 4, Failures: 0, Errors: 0, Time elapsed: 0.943 sec
[junit] Running org.apache.qpid.systest.rest.acl.UserRestACLTest
[junit] Tests run: 3, Failures: 0, Errors: 0, Time elapsed: 0.679 sec
[junit] Tests FAILED
[echo] Running ant for module : broker-plugins/management-http
[delete] Deleting: <https://builds.apache.org/job/Qpid-Java-Java-Test-IBMJDK1.6/ws/trunk/qpid/java/build/scratch/test-java-mms.0-10.properties>
touch-failed:
[touch] Creating <https://builds.apache.org/job/Qpid-Java-Java-Test-IBMJDK1.6/ws/trunk/qpid/java/build/results/broker-plugins/management-http/FAILED>
[touch] Creating <https://builds.apache.org/job/Qpid-Java-Java-Test-IBMJDK1.6/ws/trunk/qpid/java/build/results/FAILED>
[echo] Running ant for module : broker-plugins/management-jmx
[delete] Deleting: <https://builds.apache.org/job/Qpid-Java-Java-Test-IBMJDK1.6/ws/trunk/qpid/java/build/scratch/test-java-mms.0-10.properties>
prepare:
precompile:
compile:
[echo] Targeting : 1.5
copy-metainf-resources:
copy-module-metainf:
jar.manifest:
jar.nomanifest:
jar:
precompile-tests:
compile-tests:
jar-tests:
jar-sources:
libs:
copy-bin:
copy-etc:
postbuild:
build:
test:
[echo] Using profile:java-mms.0-10
[junit] Running org.apache.qpid.server.jmx.ManagementLogActorTest
[junit] Tests run: 1, Failures: 0, Errors: 0, Time elapsed: 0.89 sec
[junit] Running org.apache.qpid.server.jmx.mbeans.ConnectionMBeanTest
[junit] Tests run: 16, Failures: 0, Errors: 0, Time elapsed: 0.341 sec
[junit] Running org.apache.qpid.server.jmx.mbeans.ExchangeMBeanTest
[junit] Tests run: 10, Failures: 0, Errors: 0, Time elapsed: 0.09 sec
[junit] Running org.apache.qpid.server.jmx.mbeans.LoggingManagementMBeanTest
[junit] Tests run: 20, Failures: 0, Errors: 0, Time elapsed: 0.043 sec
[junit] Running org.apache.qpid.server.jmx.mbeans.QueueMBeanTest
[junit] Tests run: 40, Failures: 0, Errors: 0, Time elapsed: 0.144 sec
[junit] Running org.apache.qpid.server.jmx.mbeans.ServerInformationMBeanTest
[junit] Tests run: 5, Failures: 0, Errors: 0, Time elapsed: 0.028 sec
[junit] Running org.apache.qpid.server.jmx.mbeans.UserManagementMBeanTest
[junit] Tests run: 10, Failures: 0, Errors: 0, Time elapsed: 0.031 sec
[junit] Running org.apache.qpid.server.jmx.mbeans.VirtualHostManagerMBeanTest
[junit] Tests run: 9, Failures: 0, Errors: 0, Time elapsed: 0.029 sec
[junit] Running org.apache.qpid.systest.management.jmx.BrokerManagementTest
[junit] Tests run: 3, Failures: 0, Errors: 0, Time elapsed: 1.181 sec
[junit] Running org.apache.qpid.systest.management.jmx.ConnectionManagementTest
[junit] Tests run: 5, Failures: 0, Errors: 0, Time elapsed: 1.521 sec
[junit] Running org.apache.qpid.systest.management.jmx.LoggingManagementTest
[junit] Tests run: 3, Failures: 0, Errors: 0, Time elapsed: 0.518 sec
[junit] Running org.apache.qpid.systest.management.jmx.ManagementActorLoggingTest
[junit] Tests run: 11, Failures: 0, Errors: 0, Time elapsed: 1.567 sec
[junit] Running org.apache.qpid.systest.management.jmx.ManagementLoggingTest
[junit] Tests run: 5, Failures: 0, Errors: 0, Time elapsed: 0.688 sec
[junit] Running org.apache.qpid.systest.management.jmx.QueueManagementTest
[junit] Tests run: 14, Failures: 0, Errors: 0, Time elapsed: 4.468 sec
[junit] Running org.apache.qpid.systest.management.jmx.StatisticsTest
[junit] Tests run: 5, Failures: 0, Errors: 0, Time elapsed: 0.823 sec
[junit] Running org.apache.qpid.systest.management.jmx.UserManagementTest
[junit] Tests run: 7, Failures: 0, Errors: 0, Time elapsed: 0.947 sec
[junit] Running org.apache.qpid.systest.management.jmx.UserManagementWithBase64MD5PasswordsTest
[junit] Tests run: 7, Failures: 0, Errors: 0, Time elapsed: 0.917 sec
[echo] Running ant for module : broker-plugins/management-jmx
[delete] Deleting: <https://builds.apache.org/job/Qpid-Java-Java-Test-IBMJDK1.6/ws/trunk/qpid/java/build/scratch/test-java-mms.0-10.properties>
touch-failed:
BUILD FAILED
<https://builds.apache.org/job/Qpid-Java-Java-Test-IBMJDK1.6/ws/trunk/qpid/java/build.xml>:100: TEST SUITE FAILED
Total time: 15 minutes 48 seconds
Build step 'Invoke Ant' marked build as failure
[locks-and-latches] Releasing all the locks
[locks-and-latches] All the locks released
Recording test results
Jenkins build is back to normal : Qpid-Java-Java-Test-IBMJDK1.6
#219
Posted by Apache Jenkins Server <je...@builds.apache.org>.
See <https://builds.apache.org/job/Qpid-Java-Java-Test-IBMJDK1.6/219/>