You are viewing a plain text version of this content. The canonical link for it is here.
Posted to builds@beam.apache.org by Apache Jenkins Server <je...@builds.apache.org> on 2019/07/10 03:00:03 UTC
Build failed in Jenkins:
beam_PostCommit_Java11_ValidatesRunner_PortabilityApi_Dataflow #744
See <https://builds.apache.org/job/beam_PostCommit_Java11_ValidatesRunner_PortabilityApi_Dataflow/744/display/redirect?page=changes>
Changes:
[kamil.wasilewski] [BEAM-7535] Created Jenkins job for BQ performance tests
[kamil.wasilewski] [BEAM-7535] Delete existing data if the table already exists
[hannahjiang] BEAM-3645 add thread lock
[cademarkegard] [BEAM-7690] Port WordCountTest off DoFnTester
[chambers] Update Python Dataflow runner to patch side input coders on the unified
[iemejia] [BEAM-7653] Add PTransformTranslator for Combine.GroupedValues
[pachristopher] Update pyarrow version requirement in setup.py
------------------------------------------
[...truncated 37.82 KB...]
> Task :sdks:java:core:compileTestJava FROM-CACHE
> Task :sdks:java:core:testClasses
> Task :sdks:java:extensions:protobuf:compileJava FROM-CACHE
> Task :sdks:java:extensions:protobuf:classes UP-TO-DATE
> Task :sdks:java:extensions:protobuf:jar
> Task :sdks:java:harness:compileJava FROM-CACHE
> Task :sdks:java:harness:classes UP-TO-DATE
> Task :sdks:go:resolveBuildDependencies
Resolving golang.org/x/crypto: commit='d9133f5469342136e669e85192a26056b587f503', urls=[https://go.googlesource.com/crypto]
> Task :sdks:java:io:google-cloud-platform:compileJava FROM-CACHE
> Task :sdks:java:io:google-cloud-platform:classes UP-TO-DATE
> Task :sdks:java:io:google-cloud-platform:jar
> Task :runners:google-cloud-dataflow-java:compileJava FROM-CACHE
> Task :runners:google-cloud-dataflow-java:classes
> Task :runners:google-cloud-dataflow-java:jar
> Task :vendor:sdks-java-extensions-protobuf:shadowJar
> Task :sdks:go:resolveBuildDependencies
Resolving golang.org/x/debug: commit='95515998a8a4bd7448134b2cb5971dbeb12e0b77', urls=[https://go.googlesource.com/debug]
Resolving golang.org/x/net: commit='2fb46b16b8dda405028c50f7c7f0f9dd1fa6bfb1', urls=[https://go.googlesource.com/net]
Resolving golang.org/x/oauth2: commit='a032972e28060ca4f5644acffae3dfc268cc09db', urls=[https://go.googlesource.com/oauth2]
Resolving golang.org/x/sync: commit='fd80eb99c8f653c847d294a001bdf2a3a6f768f5', urls=[https://go.googlesource.com/sync]
> Task :sdks:java:core:shadowTestJar
> Task :sdks:go:resolveBuildDependencies
Resolving golang.org/x/sys: commit='37707fdb30a5b38865cfb95e5aab41707daec7fd', urls=[https://go.googlesource.com/sys]
Resolving cached github.com/coreos/etcd: commit='11214aa33bf5a47d3d9d8dafe0f6b97237dfe921', urls=[https://github.com/coreos/etcd.git, git@github.com:coreos/etcd.git]
Resolving cached github.com/coreos/etcd: commit='11214aa33bf5a47d3d9d8dafe0f6b97237dfe921', urls=[https://github.com/coreos/etcd.git, git@github.com:coreos/etcd.git]
> Task :sdks:java:harness:shadowJar
> Task :sdks:java:harness:jar
> Task :sdks:java:container:copyDockerfileDependencies
> Task :runners:java-fn-execution:compileJava FROM-CACHE
> Task :runners:java-fn-execution:classes UP-TO-DATE
> Task :runners:java-fn-execution:jar
> Task :runners:google-cloud-dataflow-java:worker:compileJava
Note: Some input files use or override a deprecated API.
Note: Recompile with -Xlint:deprecation for details.
Note: Some input files use unchecked or unsafe operations.
Note: Recompile with -Xlint:unchecked for details.
> Task :runners:google-cloud-dataflow-java:worker:classes
> Task :runners:google-cloud-dataflow-java:worker:shadowJar
> Task :sdks:go:resolveBuildDependencies
Resolving google.golang.org/api: commit='386d4e5f4f92f86e6aec85985761bba4b938a2d5', urls=[https://code.googlesource.com/google-api-go-client]
Resolving google.golang.org/genproto: commit='2b5a72b8730b0b16380010cfe5286c42108d88e7', urls=[https://github.com/google/go-genproto]
Resolving google.golang.org/grpc: commit='7646b5360d049a7ca31e9133315db43456f39e2e', urls=[https://github.com/grpc/grpc-go]
Resolving cached github.com/coreos/etcd: commit='11214aa33bf5a47d3d9d8dafe0f6b97237dfe921', urls=[https://github.com/coreos/etcd.git, git@github.com:coreos/etcd.git]
Resolving cached github.com/coreos/etcd: commit='11214aa33bf5a47d3d9d8dafe0f6b97237dfe921', urls=[https://github.com/coreos/etcd.git, git@github.com:coreos/etcd.git]
> Task :sdks:go:installDependencies
> Task :sdks:go:buildLinuxAmd64
> Task :sdks:go:goBuild
> Task :sdks:java:container:resolveBuildDependencies
Resolving ./github.com/apache/beam/sdks/go@<https://builds.apache.org/job/beam_PostCommit_Java11_ValidatesRunner_PortabilityApi_Dataflow/ws/src/sdks/go>
> Task :sdks:java:container:installDependencies
> Task :sdks:java:container:buildLinuxAmd64
> Task :sdks:java:container:goBuild
> Task :sdks:java:container:dockerPrepare
> Task :sdks:java:container:docker
> Task :runners:google-cloud-dataflow-java:buildAndPushDockerContainer
WARNING: `gcloud docker` will not be supported for Docker client versions above 18.03.
As an alternative, use `gcloud auth configure-docker` to configure `docker` to
use `gcloud` as a credential helper, then use `docker` as you would for non-GCR
registries, e.g. `docker pull gcr.io/project-id/my-image`. Add
`--verbosity=error` to silence this warning: `gcloud docker
--verbosity=error -- pull gcr.io/project-id/my-image`.
See: https://cloud.google.com/container-registry/docs/support/deprecation-notices#gcloud-docker
The push refers to repository [us.gcr.io/apache-beam-testing/java-postcommit-it/java]
940b4fb09470: Preparing
1313e4a1bd19: Preparing
8d0c7489f10f: Preparing
150134b77bf0: Preparing
f7d12d471667: Preparing
f350d0146bb3: Preparing
e38df31d449c: Preparing
af5ae4841776: Preparing
b17cc31e431b: Preparing
12cb127eee44: Preparing
604829a174eb: Preparing
fbb641a8b943: Preparing
604829a174eb: Waiting
fbb641a8b943: Waiting
f350d0146bb3: Waiting
e38df31d449c: Waiting
1313e4a1bd19: Layer already exists
f7d12d471667: Layer already exists
8d0c7489f10f: Layer already exists
940b4fb09470: Layer already exists
150134b77bf0: Layer already exists
af5ae4841776: Layer already exists
f350d0146bb3: Layer already exists
e38df31d449c: Layer already exists
b17cc31e431b: Layer already exists
12cb127eee44: Layer already exists
604829a174eb: Layer already exists
fbb641a8b943: Layer already exists
20190403225916: digest: sha256:113fa82e6d8fced5253734660525f85a82b72d7b5313e19474602d26be100c80 size: 2841
2e78a4447c38: Preparing
81a5e7fd80ef: Preparing
f9b853d651d9: Preparing
659dde811aa4: Preparing
295981d74016: Preparing
cc9b19204d3c: Preparing
359449e22bf2: Preparing
083ba48e5bf4: Preparing
3e4107bb54ad: Preparing
4230ff7f2288: Preparing
2c719774c1e1: Preparing
ec62f19bb3aa: Preparing
f94641f1fe1f: Preparing
359449e22bf2: Waiting
083ba48e5bf4: Waiting
ec62f19bb3aa: Waiting
f94641f1fe1f: Waiting
3e4107bb54ad: Waiting
2c719774c1e1: Waiting
4230ff7f2288: Waiting
cc9b19204d3c: Waiting
81a5e7fd80ef: Pushed
f9b853d651d9: Pushed
359449e22bf2: Layer already exists
083ba48e5bf4: Layer already exists
3e4107bb54ad: Layer already exists
4230ff7f2288: Layer already exists
2c719774c1e1: Layer already exists
295981d74016: Pushed
ec62f19bb3aa: Layer already exists
f94641f1fe1f: Layer already exists
2e78a4447c38: Pushed
cc9b19204d3c: Pushed
659dde811aa4: Pushed
20190710002222: digest: sha256:c4b2f3c955866dd904e7fc62588dbb0bf1f34df9d52744e0687d65ecab4a6887 size: 3056
> Task :runners:google-cloud-dataflow-java:validatesRunnerFnApiWorkerTest
org.apache.beam.sdk.transforms.ParDoTest$MultipleInputsAndOutputTests > testParDoWithOnlyTaggedOutput FAILED
java.lang.RuntimeException at ParDoTest.java:688
org.apache.beam.sdk.transforms.CombineTest$WindowingTests > testGlobalCombineWithDefaultsAndTriggers FAILED
java.lang.RuntimeException at CombineTest.java:1241
org.apache.beam.sdk.PipelineTest > testTupleInjectionTransform FAILED
java.lang.RuntimeException at PipelineTest.java:344
org.apache.beam.sdk.transforms.ImpulseTest > testImpulse FAILED
java.lang.RuntimeException at ImpulseTest.java:47
org.apache.beam.sdk.transforms.GroupByKeyTest$BasicTests > testLargeKeys1MB FAILED
java.lang.RuntimeException at GroupByKeyTest.java:365
org.apache.beam.sdk.transforms.join.CoGroupByKeyTest > testCoGroupByKey FAILED
java.lang.RuntimeException at CoGroupByKeyTest.java:296
org.apache.beam.sdk.transforms.ParDoTest$StateCoderInferenceTests > testCombiningStateCoderInference FAILED
java.lang.RuntimeException at ParDoTest.java:2369
org.apache.beam.sdk.values.PCollectionTupleTest > testComposePCollectionTuple FAILED
java.lang.RuntimeException at PCollectionTupleTest.java:106
org.apache.beam.sdk.transforms.GroupByKeyTest$WindowTests > testGroupByKeyMergingWindows FAILED
java.lang.RuntimeException at GroupByKeyTest.java:480
org.apache.beam.sdk.transforms.ViewTest > testMapAsEntrySetSideInput FAILED
java.lang.RuntimeException at ViewTest.java:977
org.apache.beam.sdk.transforms.CombineTest$CombineWithContextTests > testSimpleCombineWithContext FAILED
java.lang.RuntimeException at CombineTest.java:997
org.apache.beam.sdk.transforms.WithTimestampsTest > withTimestampsShouldApplyTimestamps FAILED
java.lang.RuntimeException at WithTimestampsTest.java:78
org.apache.beam.sdk.transforms.ReifyTimestampsTest > extractFromValuesWhenValueTimestampedLaterSucceeds FAILED
java.lang.RuntimeException at ReifyTimestampsTest.java:128
org.apache.beam.sdk.transforms.windowing.WindowTest > testTimestampCombinerEndOfWindow FAILED
java.lang.RuntimeException at WindowTest.java:498
org.apache.beam.sdk.transforms.CreateTest > testCreateWithKVVoidType FAILED
java.lang.RuntimeException at CreateTest.java:337
org.apache.beam.sdk.transforms.KeysTest > testKeysEmpty FAILED
java.lang.RuntimeException at KeysTest.java:73
org.apache.beam.sdk.transforms.ParDoTest$TimestampTests > testParDoShiftTimestampUnlimited FAILED
java.lang.RuntimeException at ParDoTest.java:1393
org.apache.beam.sdk.transforms.ReshuffleTest > testReshuffleAfterFixedWindows FAILED
java.lang.RuntimeException at ReshuffleTest.java:231
org.apache.beam.sdk.testing.PAssertTest > testEmptyFalse FAILED
java.lang.AssertionError at PAssertTest.java:487
org.apache.beam.sdk.transforms.ViewTest > testEmptyIterableSideInput FAILED
java.lang.RuntimeException at ViewTest.java:470
org.apache.beam.sdk.transforms.windowing.WindowingTest > testWindowPreservation FAILED
java.lang.RuntimeException at WindowingTest.java:197
156 tests completed, 21 failed, 2 skipped
> Task :runners:google-cloud-dataflow-java:validatesRunnerFnApiWorkerTest FAILED
> Task :runners:google-cloud-dataflow-java:cleanUpDockerImages
Untagged: us.gcr.io/apache-beam-testing/java-postcommit-it/java:20190710002222
Untagged: us.gcr.io/apache-beam-testing/java-postcommit-it/java@sha256:c4b2f3c955866dd904e7fc62588dbb0bf1f34df9d52744e0687d65ecab4a6887
Digests:
- us.gcr.io/apache-beam-testing/java-postcommit-it/java@sha256:c4b2f3c955866dd904e7fc62588dbb0bf1f34df9d52744e0687d65ecab4a6887
Associated tags:
- 20190710002222
Tags:
- us.gcr.io/apache-beam-testing/java-postcommit-it/java:20190710002222
Deleted [us.gcr.io/apache-beam-testing/java-postcommit-it/java:20190710002222].
Deleted [us.gcr.io/apache-beam-testing/java-postcommit-it/java@sha256:c4b2f3c955866dd904e7fc62588dbb0bf1f34df9d52744e0687d65ecab4a6887].
FAILURE: Build failed with an exception.
* What went wrong:
Execution failed for task ':runners:google-cloud-dataflow-java:validatesRunnerFnApiWorkerTest'.
> There were failing tests. See the report at: file://<https://builds.apache.org/job/beam_PostCommit_Java11_ValidatesRunner_PortabilityApi_Dataflow/ws/src/runners/google-cloud-dataflow-java/build/reports/tests/validatesRunnerFnApiWorkerTest/index.html>
* Try:
Run with --stacktrace option to get the stack trace. Run with --info or --debug option to get more log output. Run with --scan to get full insights.
* Get more help at https://help.gradle.org
Deprecated Gradle features were used in this build, making it incompatible with Gradle 6.0.
Use '--warning-mode all' to show the individual deprecation warnings.
See https://docs.gradle.org/5.2.1/userguide/command_line_interface.html#sec:command_line_warnings
BUILD FAILED in 2h 37m 51s
79 actionable tasks: 60 executed, 18 from cache, 1 up-to-date
Publishing build scan...
https://gradle.com/s/xmx2yefgncggq
Build step 'Invoke Gradle script' changed build result to FAILURE
Build step 'Invoke Gradle script' marked build as failure
---------------------------------------------------------------------
To unsubscribe, e-mail: builds-unsubscribe@beam.apache.org
For additional commands, e-mail: builds-help@beam.apache.org
Jenkins build is back to normal :
beam_PostCommit_Java11_ValidatesRunner_PortabilityApi_Dataflow #745
Posted by Apache Jenkins Server <je...@builds.apache.org>.
See <https://builds.apache.org/job/beam_PostCommit_Java11_ValidatesRunner_PortabilityApi_Dataflow/745/display/redirect>
---------------------------------------------------------------------
To unsubscribe, e-mail: builds-unsubscribe@beam.apache.org
For additional commands, e-mail: builds-help@beam.apache.org