You are viewing a plain text version of this content. The canonical link for it is here.
Posted to builds@beam.apache.org by Apache Jenkins Server <je...@builds.apache.org> on 2022/04/14 06:16:30 UTC
Build failed in Jenkins: beam_PostCommit_XVR_Samza #1055
See <https://ci-beam.apache.org/job/beam_PostCommit_XVR_Samza/1055/display/redirect>
Changes:
------------------------------------------
[...truncated 946.58 KB...]
payload: "\202SNAPPY\000\000\000\000\001\000\000\000\001\000\000\000\312\214\002\360^\254\355\000\005sr\000,org.apache.beam.sdk.coders.SerializableCoder\010\364 \216\305ynl\002\000\001L\000\004typet\000\021Ljava/lang/Class;xr\000&ofV\000\024Custom\005P8j\260\010\235\013;\035\013\002\000\000xr\000 j\213\000\005/\034C\335\325\211\256\274~\370\001/\020pvr\000;N1\000Pio.BoundedReadFromUnb\t\021`Source$Shardd\236\240U\205\000j\363\002\000\000xp"
>
>
>
coders: <
key: "ArSWCcVyXUTimestampedValueCoder"
value: <
spec: <
urn: "beam:coders:javasdk:0.1"
payload: "\202SNAPPY\000\000\000\000\001\000\000\000\001\000\000\001?\315\003\270\254\355\000\005sr\000Aorg.apache.beam.sdk.values.TimestampedV\001\022\000$>\021\000LCoder\364\376\202p\274iX-\002\000\001L\000\nv\001)\005\030\034t\000\"Lorg/\t]\000/\001],/sdk/coders/\005$\020;xr\000*N\202\000\t%(.Structured\005/8s\277\022\016\325\3246\021\002\000\000xr\000 j9\000\005/\034C\335\325\211\256\274~\370\001/\020psr\000,j1\000(Serializabl\t\277\034\010\364 \216\305ynl\005\327\\\004typet\000\021Ljava/lang/Class\001\300\000&jV\000\024Custom\005\215Pj\260\010\235\013;\035\013\002\000\000xq\000~\000\003vr\000;N;\000Pio.BoundedReadFromUnb\t\021`Source$Shardd\236\240U\205\000j\363\002\000\000xp"
>
>
>
coders: <
key: "ArSWCcVyXUValueWithRecordIdCoder"
value: <
spec: <
urn: "beam:coders:javasdk:0.1"
payload: "\202SNAPPY\000\000\000\000\001\000\000\000\001\000\000\001\213\311\005\320\254\355\000\005sr\000Corg.apache.beam.sdk.values.ValueWithRecordId$B\022\000LCoder{\343\376bQ\014\204>\002\000\002L\000\007i\t\025\034t\000+Lorg/\t\\\000/\001\\\024/sdk/c\0012(s/ByteArray\005B\014;L\000\n\005u\005\016\010t\000\"n;\000\005$\020;xr\000*N\274\000\t`(.Structured\005/8s\277\022\016\325\3246\021\002\000\000xr\000 j9\000\005/\034C\335\325\211\256\274~\370\001/\020psr\000)j1\0006\312\000\034\351\277\005|\263\3746\333\001:\010r\000&j8\000\024Atomic\005o\034\307\354\265\314\205tPF\0015 q\000~\000\003sr\000-N;\000$io.kafka.K\001\006\000R%\227\005B<I\320\251Y\032\341{#\002\000\001L\000\007kv\005\025\010t\000$nH\001\000K\t&\000;\025s\000\"Ns\000-P\r- j\000\275\271\035\243\3126\002!\353\010\010ke)\277\001\264\000\0022\303\001\005\022\025Y\000(jY\000\030Nullabl)\372\034E\333\0336>\220\247\007\005\307]\022.O\000\001\014,\006sq\000~\000\016q\000~\000\020"
>
>
>
coders: <
key: "ArSWCcVyXUVarIntCoder"
value: <
spec: <
urn: "beam:coders:javasdk:0.1"
payload: "\202SNAPPY\000\000\000\000\001\000\000\000\001\000\000\000\210\330\001\350\254\355\000\005sr\000&org.apache.beam.sdk.coders.VarIntCoder\300K2\332\251KVh\002\000\000xrr5\000\024Atomic\0055 \307\354\265\314\205tPF\002\0055\000*jj\000$Structured\0059\034s\277\022\016\325\3246\021\t9\000 j9\000\005/0C\335\325\211\256\274~\370\002\000\000xp"
>
>
>
coders: <
key: "ArSWCcVyXUVoidCoder"
value: <
spec: <
urn: "beam:coders:javasdk:0.1"
payload: "\202SNAPPY\000\000\000\000\001\000\000\000\001\000\000\000\210\326\001\350\254\355\000\005sr\000$org.apache.beam.sdk.coders.VoidCoder\271\277U\233\350\r\257U\002\000\000xr\000&j3\000\024Atomic\0055 \307\354\265\314\205tPF\002\0055\000*j5\000$Structured\0059\034s\277\022\016\325\3246\021\t9\000 j9\000\005/0C\335\325\211\256\274~\370\002\000\000xp"
>
>
>
coders: <
key: "c0"
value: <
spec: <
urn: "beam:coder:bytes:v1"
>
>
>
coders: <
key: "c1"
value: <
spec: <
urn: "beam:coder:global_window:v1"
>
>
>
coders: <
key: "c2"
value: <
spec: <
urn: "beam:go:coder:custom:v1"
payload: "Cgd2YXJpbnR6EgIIAhpdCklnaXRodWIuY29tL2FwYWNoZS9iZWFtL3Nka3MvdjIvZ28vcGtnL2JlYW0vY29yZS9ydW50aW1lL2NvZGVyeC5lbmNWYXJJbnRaEhAIFiIECBlADyoGCBQSAggIImkKSWdpdGh1Yi5jb20vYXBhY2hlL2JlYW0vc2Rrcy92Mi9nby9wa2cvYmVhbS9jb3JlL3J1bnRpbWUvY29kZXJ4LmRlY1ZhckludFoSHAgWIgQIGUADIgYIFBICCAgqBAgZQA8qBAgZQAE="
>
>
>
coders: <
key: "c3"
value: <
spec: <
urn: "beam:coder:length_prefix:v1"
>
component_coder_ids: "c2"
>
>
coders: <
key: "c4"
value: <
spec: <
urn: "beam:coder:kv:v1"
>
component_coder_ids: "c0"
component_coder_ids: "c0"
>
>
environments: <
key: "ArSWCcVyXUbeam:env:docker:v1"
value: <
urn: "beam:env:docker:v1"
payload: "\n apache/beam_java8_sdk:2.39.0.dev"
capabilities: "beam:coder:bytes:v1"
capabilities: "beam:coder:bool:v1"
capabilities: "beam:coder:varint:v1"
capabilities: "beam:coder:string_utf8:v1"
capabilities: "beam:coder:iterable:v1"
capabilities: "beam:coder:timer:v1"
capabilities: "beam:coder:kv:v1"
capabilities: "beam:coder:length_prefix:v1"
capabilities: "beam:coder:global_window:v1"
capabilities: "beam:coder:interval_window:v1"
capabilities: "beam:coder:custom_window:v1"
capabilities: "beam:coder:windowed_value:v1"
capabilities: "beam:coder:double:v1"
capabilities: "beam:coder:row:v1"
capabilities: "beam:coder:param_windowed_value:v1"
capabilities: "beam:coder:state_backed_iterable:v1"
capabilities: "beam:coder:sharded_key:v1"
capabilities: "beam:coder:nullable:v1"
capabilities: "beam:protocol:multi_core_bundle_processing:v1"
capabilities: "beam:protocol:progress_reporting:v1"
capabilities: "beam:protocol:harness_monitoring_infos:v1"
capabilities: "beam:protocol:control_request_elements_embedding:v1"
capabilities: "beam:protocol:state_caching:v1"
capabilities: "beam:version:sdk_base:apache/beam_java8_sdk:2.39.0.dev"
capabilities: "beam:transform:sdf_truncate_sized_restrictions:v1"
capabilities: "beam:transform:to_string:v1"
dependencies: <
type_urn: "beam:artifact:type:file:v1"
type_payload: "\nL/tmp/artifacts/icedtea-sound-ebvtNFkfFXg4aaYFuDnwKpwDSjzsaZqlqv5iKxPTr-U.jar\022@79bbed34591f15783869a605b839f02a9c034a3cec699aa5aafe622b13d3afe5"
role_urn: "beam:artifact:role:staging_to:v1"
role_payload: "\n=icedtea-sound-ebvtNFkfFXg4aaYFuDnwKpwDSjzsaZqlqv5iKxPTr-U.jar"
>
dependencies: <
type_urn: "beam:artifact:type:file:v1"
type_payload: "\nF/tmp/artifacts/jaccess-ULFTCPsb6cLYZ0f1BG1FQfczmHNaZCx8plXuRDKpBqE.jar\022@50b15308fb1be9c2d86747f5046d4541f73398735a642c7ca655ee4432a906a1"
role_urn: "beam:artifact:role:staging_to:v1"
role_payload: "\n7jaccess-ULFTCPsb6cLYZ0f1BG1FQfczmHNaZCx8plXuRDKpBqE.jar"
>
dependencies: <
type_urn: "beam:artifact:type:file:v1"
type_payload: "\nI/tmp/artifacts/localedata-dUHqyGxaTVCjfTI8MckPYarZ3_mwf62udkxaHi1aKns.jar\022@7541eac86c5a4d50a37d323c31c90f61aad9dff9b07fadae764c5a1e2d5a2a7b"
role_urn: "beam:artifact:role:staging_to:v1"
role_payload: "\n:localedata-dUHqyGxaTVCjfTI8MckPYarZ3_mwf62udkxaHi1aKns.jar"
>
dependencies: <
type_urn: "beam:artifact:type:file:v1"
type_payload: "\nF/tmp/artifacts/nashorn-XdUndQGroXOP9NCsfITpBERYcbbGXVHLjbvNWXCh-3A.jar\022@5dd5277501aba1738ff4d0ac7c84e904445871b6c65d51cb8dbbcd5970a1fb70"
role_urn: "beam:artifact:role:staging_to:v1"
role_payload: "\n7nashorn-XdUndQGroXOP9NCsfITpBERYcbbGXVHLjbvNWXCh-3A.jar"
>
dependencies: <
type_urn: "beam:artifact:type:file:v1"
type_payload: "\nG/tmp/artifacts/cldrdata-YqzuKX1QnLCOo0cwjKRdBhGrip_ltIJZg-APT60tUPA.jar\022@62acee297d509cb08ea347308ca45d0611ab8a9fe5b4825983e00f4fad2d50f0"
role_urn: "beam:artifact:role:staging_to:v1"
role_payload: "\n8cldrdata-YqzuKX1QnLCOo0cwjKRdBhGrip_ltIJZg-APT60tUPA.jar"
>
dependencies: <
type_urn: "beam:artifact:type:file:v1"
type_payload: "\nD/tmp/artifacts/dnsns-dhEp186udEF6X6chZus-RJzWRmzlccxx1_btlXWayVI.jar\022@761129d7ceae74417a5fa72166eb3e449cd6466ce571cc71d7f6ed95759ac952"
role_urn: "beam:artifact:role:staging_to:v1"
role_payload: "\n5dnsns-dhEp186udEF6X6chZus-RJzWRmzlccxx1_btlXWayVI.jar"
>
dependencies: <
type_urn: "beam:artifact:type:file:v1"
type_payload: "\nr/tmp/artifacts/beam-sdks-java-io-expansion-service-2.39.0-SNAPSHOT-WdCejIimKOpNkzCxX-1mqrIXkGjLM_FeeKFLyitKDgw.jar\022@59d09e8c88a628ea4d9330b15fed66aab2179068cb33f15e78a14bca2b4a0e0c"
role_urn: "beam:artifact:role:staging_to:v1"
role_payload: "\ncbeam-sdks-java-io-expansion-service-2.39.0-SNAPSHOT-WdCejIimKOpNkzCxX-1mqrIXkGjLM_FeeKFLyitKDgw.jar"
>
>
>
environments: <
key: "go"
value: <
urn: "beam:env:docker:v1"
payload: "\n\026apache/beam_go_sdk:dev"
capabilities: "beam:protocol:progress_reporting:v0"
capabilities: "beam:protocol:multi_core_bundle_processing:v1"
capabilities: "beam:version:sdk_base:go"
capabilities: "beam:coder:bytes:v1"
capabilities: "beam:coder:bool:v1"
capabilities: "beam:coder:varint:v1"
capabilities: "beam:coder:double:v1"
capabilities: "beam:coder:string_utf8:v1"
capabilities: "beam:coder:length_prefix:v1"
capabilities: "beam:coder:kv:v1"
capabilities: "beam:coder:iterable:v1"
capabilities: "beam:coder:state_backed_iterable:v1"
capabilities: "beam:coder:windowed_value:v1"
capabilities: "beam:coder:global_window:v1"
capabilities: "beam:coder:interval_window:v1"
capabilities: "beam:coder:row:v1"
capabilities: "beam:coder:nullable:v1"
dependencies: <
type_urn: "beam:artifact:type:file:v1"
role_urn: "beam:artifact:role:go_worker_binary:v1"
>
>
>
>
root_transform_ids: "e4"
root_transform_ids: "e5"
root_transform_ids: "s1"
root_transform_ids: "s3"
requirements: "beam:requirement:pardo:splittable_dofn:v1"
2022/04/14 05:57:24 Cross-compiling <https://ci-beam.apache.org/job/beam_PostCommit_XVR_Samza/ws/src/sdks/go/test/integration/io/xlang/kafka/kafka_test.go> as /tmp/worker-2-1649915844125880383
2022/04/14 05:57:25 Prepared job with id: go-testkafkaio_basicreadwrite_313ff4d0-11df-4be8-bb36-316aba5ef8a4 and staging token: go-testkafkaio_basicreadwrite_313ff4d0-11df-4be8-bb36-316aba5ef8a4
2022/04/14 05:57:26 Staged binary artifact with token:
2022/04/14 05:57:26 Submitted job: go0testkafkaio0basicreadwrite-jenkins-0414055726-880a24b2_eb98a6ba-888e-4483-adc3-7ec25b52db89
2022/04/14 05:57:26 Job state: STOPPED
2022/04/14 05:57:26 Job state: STARTING
2022/04/14 05:57:26 Job state: RUNNING
2022/04/14 05:57:37 Job state: DONE
--- PASS: TestKafkaIO_BasicReadWrite (31.66s)
PASS
ok github.com/apache/beam/sdks/v2/go/test/integration/io/xlang/kafka 37.690s
FAIL
> Task :runners:samza:job-server:validatesCrossLanguageRunnerGoUsingJava FAILED
> Task :runners:samza:job-server:validatesCrossLanguageRunnerJavaUsingJava
> Task :runners:samza:job-server:validatesCrossLanguageRunnerJavaUsingPython
> Task :runners:samza:job-server:validatesCrossLanguageRunnerJavaUsingPythonOnly
> Task :runners:samza:job-server:validatesCrossLanguageRunnerPythonUsingJava
> Task :runners:samza:job-server:validatesCrossLanguageRunnerPythonUsingPython
> Task :runners:samza:job-server:validatesCrossLanguageRunnerPythonUsingSql
> Task :runners:samza:job-server:validatesCrossLanguageRunnerCleanup
> Task :runners:samza:job-server:samzaJobServerCleanup
FAILURE: Build failed with an exception.
* Where:
Build file '<https://ci-beam.apache.org/job/beam_PostCommit_XVR_Samza/ws/src/sdks/go/test/build.gradle'> line: 195
* What went wrong:
Execution failed for task ':runners:samza:job-server:validatesCrossLanguageRunnerGoUsingJava'.
> Process 'command 'sh'' finished with non-zero exit value 1
* Try:
> Run with --stacktrace option to get the stack trace.
> Run with --info or --debug option to get more log output.
> Run with --scan to get full insights.
* Get more help at https://help.gradle.org
Deprecated Gradle features were used in this build, making it incompatible with Gradle 8.0.
You can use '--warning-mode all' to show the individual deprecation warnings and determine if they come from your own scripts or plugins.
See https://docs.gradle.org/7.3.2/userguide/command_line_interface.html#sec:command_line_warnings
Execution optimizations have been disabled for 1 invalid unit(s) of work during this build to ensure correctness.
Please consult deprecation warnings for more details.
BUILD FAILED in 34m 3s
246 actionable tasks: 163 executed, 72 from cache, 11 up-to-date
Publishing build scan...
https://gradle.com/s/enaw4hbtjqzwm
Build step 'Invoke Gradle script' changed build result to FAILURE
Build step 'Invoke Gradle script' marked build as failure
---------------------------------------------------------------------
To unsubscribe, e-mail: builds-unsubscribe@beam.apache.org
For additional commands, e-mail: builds-help@beam.apache.org
Jenkins build is back to normal : beam_PostCommit_XVR_Samza #1067
Posted by Apache Jenkins Server <je...@builds.apache.org>.
See <https://ci-beam.apache.org/job/beam_PostCommit_XVR_Samza/1067/display/redirect>
---------------------------------------------------------------------
To unsubscribe, e-mail: builds-unsubscribe@beam.apache.org
For additional commands, e-mail: builds-help@beam.apache.org
Build failed in Jenkins: beam_PostCommit_XVR_Samza #1066
Posted by Apache Jenkins Server <je...@builds.apache.org>.
See <https://ci-beam.apache.org/job/beam_PostCommit_XVR_Samza/1066/display/redirect>
Changes:
------------------------------------------
[...truncated 1.30 MB...]
payload: "\202SNAPPY\000\000\000\000\001\000\000\000\001\000\000\000\312\214\002\360^\254\355\000\005sr\000,org.apache.beam.sdk.coders.SerializableCoder\010\364 \216\305ynl\002\000\001L\000\004typet\000\021Ljava/lang/Class;xr\000&ofV\000\024Custom\005P8j\260\010\235\013;\035\013\002\000\000xr\000 j\213\000\005/\034C\335\325\211\256\274~\370\001/\020pvr\000;N1\000Pio.BoundedReadFromUnb\t\021`Source$Shardd\236\240U\205\000j\363\002\000\000xp"
>
>
>
coders: <
key: "FDlMTjPfLYTimestampedValueCoder"
value: <
spec: <
urn: "beam:coders:javasdk:0.1"
payload: "\202SNAPPY\000\000\000\000\001\000\000\000\001\000\000\001?\315\003\270\254\355\000\005sr\000Aorg.apache.beam.sdk.values.TimestampedV\001\022\000$>\021\000LCoder\364\376\202p\274iX-\002\000\001L\000\nv\001)\005\030\034t\000\"Lorg/\t]\000/\001],/sdk/coders/\005$\020;xr\000*N\202\000\t%(.Structured\005/8s\277\022\016\325\3246\021\002\000\000xr\000 j9\000\005/\034C\335\325\211\256\274~\370\001/\020psr\000,j1\000(Serializabl\t\277\034\010\364 \216\305ynl\005\327\\\004typet\000\021Ljava/lang/Class\001\300\000&jV\000\024Custom\005\215Pj\260\010\235\013;\035\013\002\000\000xq\000~\000\003vr\000;N;\000Pio.BoundedReadFromUnb\t\021`Source$Shardd\236\240U\205\000j\363\002\000\000xp"
>
>
>
coders: <
key: "FDlMTjPfLYValueWithRecordIdCoder"
value: <
spec: <
urn: "beam:coders:javasdk:0.1"
payload: "\202SNAPPY\000\000\000\000\001\000\000\000\001\000\000\001\213\311\005\320\254\355\000\005sr\000Corg.apache.beam.sdk.values.ValueWithRecordId$B\022\000LCoder{\343\376bQ\014\204>\002\000\002L\000\007i\t\025\034t\000+Lorg/\t\\\000/\001\\\024/sdk/c\0012(s/ByteArray\005B\014;L\000\n\005u\005\016\010t\000\"n;\000\005$\020;xr\000*N\274\000\t`(.Structured\005/8s\277\022\016\325\3246\021\002\000\000xr\000 j9\000\005/\034C\335\325\211\256\274~\370\001/\020psr\000)j1\0006\312\000\034\351\277\005|\263\3746\333\001:\010r\000&j8\000\024Atomic\005o\034\307\354\265\314\205tPF\0015 q\000~\000\003sr\000-N;\000$io.kafka.K\001\006\000R%\227\005B<I\320\251Y\032\341{#\002\000\001L\000\007kv\005\025\010t\000$nH\001\000K\t&\000;\025s\000\"Ns\000-P\r- j\000\275\271\035\243\3126\002!\353\010\010ke)\277\001\264\000\0022\303\001\005\022\025Y\000(jY\000\030Nullabl)\372\034E\333\0336>\220\247\007\005\307]\022.O\000\001\014,\006sq\000~\000\016q\000~\000\020"
>
>
>
coders: <
key: "FDlMTjPfLYVarIntCoder"
value: <
spec: <
urn: "beam:coders:javasdk:0.1"
payload: "\202SNAPPY\000\000\000\000\001\000\000\000\001\000\000\000\210\330\001\350\254\355\000\005sr\000&org.apache.beam.sdk.coders.VarIntCoder\300K2\332\251KVh\002\000\000xrr5\000\024Atomic\0055 \307\354\265\314\205tPF\002\0055\000*jj\000$Structured\0059\034s\277\022\016\325\3246\021\t9\000 j9\000\005/0C\335\325\211\256\274~\370\002\000\000xp"
>
>
>
coders: <
key: "FDlMTjPfLYVoidCoder"
value: <
spec: <
urn: "beam:coders:javasdk:0.1"
payload: "\202SNAPPY\000\000\000\000\001\000\000\000\001\000\000\000\210\326\001\350\254\355\000\005sr\000$org.apache.beam.sdk.coders.VoidCoder\271\277U\233\350\r\257U\002\000\000xr\000&j3\000\024Atomic\0055 \307\354\265\314\205tPF\002\0055\000*j5\000$Structured\0059\034s\277\022\016\325\3246\021\t9\000 j9\000\005/0C\335\325\211\256\274~\370\002\000\000xp"
>
>
>
coders: <
key: "c0"
value: <
spec: <
urn: "beam:coder:bytes:v1"
>
>
>
coders: <
key: "c1"
value: <
spec: <
urn: "beam:coder:global_window:v1"
>
>
>
coders: <
key: "c2"
value: <
spec: <
urn: "beam:go:coder:custom:v1"
payload: "Cgd2YXJpbnR6EgIIAhpdCklnaXRodWIuY29tL2FwYWNoZS9iZWFtL3Nka3MvdjIvZ28vcGtnL2JlYW0vY29yZS9ydW50aW1lL2NvZGVyeC5lbmNWYXJJbnRaEhAIFiIECBlADyoGCBQSAggIImkKSWdpdGh1Yi5jb20vYXBhY2hlL2JlYW0vc2Rrcy92Mi9nby9wa2cvYmVhbS9jb3JlL3J1bnRpbWUvY29kZXJ4LmRlY1ZhckludFoSHAgWIgQIGUADIgYIFBICCAgqBAgZQA8qBAgZQAE="
>
>
>
coders: <
key: "c3"
value: <
spec: <
urn: "beam:coder:length_prefix:v1"
>
component_coder_ids: "c2"
>
>
coders: <
key: "c4"
value: <
spec: <
urn: "beam:coder:kv:v1"
>
component_coder_ids: "c0"
component_coder_ids: "c0"
>
>
environments: <
key: "FDlMTjPfLYbeam:env:docker:v1"
value: <
urn: "beam:env:docker:v1"
payload: "\n apache/beam_java8_sdk:2.39.0.dev"
capabilities: "beam:coder:bytes:v1"
capabilities: "beam:coder:bool:v1"
capabilities: "beam:coder:varint:v1"
capabilities: "beam:coder:string_utf8:v1"
capabilities: "beam:coder:iterable:v1"
capabilities: "beam:coder:timer:v1"
capabilities: "beam:coder:kv:v1"
capabilities: "beam:coder:length_prefix:v1"
capabilities: "beam:coder:global_window:v1"
capabilities: "beam:coder:interval_window:v1"
capabilities: "beam:coder:custom_window:v1"
capabilities: "beam:coder:windowed_value:v1"
capabilities: "beam:coder:double:v1"
capabilities: "beam:coder:row:v1"
capabilities: "beam:coder:param_windowed_value:v1"
capabilities: "beam:coder:state_backed_iterable:v1"
capabilities: "beam:coder:sharded_key:v1"
capabilities: "beam:coder:nullable:v1"
capabilities: "beam:protocol:multi_core_bundle_processing:v1"
capabilities: "beam:protocol:progress_reporting:v1"
capabilities: "beam:protocol:harness_monitoring_infos:v1"
capabilities: "beam:protocol:control_request_elements_embedding:v1"
capabilities: "beam:protocol:state_caching:v1"
capabilities: "beam:version:sdk_base:apache/beam_java8_sdk:2.39.0.dev"
capabilities: "beam:transform:sdf_truncate_sized_restrictions:v1"
capabilities: "beam:transform:to_string:v1"
dependencies: <
type_urn: "beam:artifact:type:file:v1"
type_payload: "\nL/tmp/artifacts/icedtea-sound-ebvtNFkfFXg4aaYFuDnwKpwDSjzsaZqlqv5iKxPTr-U.jar\022@79bbed34591f15783869a605b839f02a9c034a3cec699aa5aafe622b13d3afe5"
role_urn: "beam:artifact:role:staging_to:v1"
role_payload: "\n=icedtea-sound-ebvtNFkfFXg4aaYFuDnwKpwDSjzsaZqlqv5iKxPTr-U.jar"
>
dependencies: <
type_urn: "beam:artifact:type:file:v1"
type_payload: "\nF/tmp/artifacts/jaccess-ULFTCPsb6cLYZ0f1BG1FQfczmHNaZCx8plXuRDKpBqE.jar\022@50b15308fb1be9c2d86747f5046d4541f73398735a642c7ca655ee4432a906a1"
role_urn: "beam:artifact:role:staging_to:v1"
role_payload: "\n7jaccess-ULFTCPsb6cLYZ0f1BG1FQfczmHNaZCx8plXuRDKpBqE.jar"
>
dependencies: <
type_urn: "beam:artifact:type:file:v1"
type_payload: "\nI/tmp/artifacts/localedata-dUHqyGxaTVCjfTI8MckPYarZ3_mwf62udkxaHi1aKns.jar\022@7541eac86c5a4d50a37d323c31c90f61aad9dff9b07fadae764c5a1e2d5a2a7b"
role_urn: "beam:artifact:role:staging_to:v1"
role_payload: "\n:localedata-dUHqyGxaTVCjfTI8MckPYarZ3_mwf62udkxaHi1aKns.jar"
>
dependencies: <
type_urn: "beam:artifact:type:file:v1"
type_payload: "\nF/tmp/artifacts/nashorn-XdUndQGroXOP9NCsfITpBERYcbbGXVHLjbvNWXCh-3A.jar\022@5dd5277501aba1738ff4d0ac7c84e904445871b6c65d51cb8dbbcd5970a1fb70"
role_urn: "beam:artifact:role:staging_to:v1"
role_payload: "\n7nashorn-XdUndQGroXOP9NCsfITpBERYcbbGXVHLjbvNWXCh-3A.jar"
>
dependencies: <
type_urn: "beam:artifact:type:file:v1"
type_payload: "\nG/tmp/artifacts/cldrdata-YqzuKX1QnLCOo0cwjKRdBhGrip_ltIJZg-APT60tUPA.jar\022@62acee297d509cb08ea347308ca45d0611ab8a9fe5b4825983e00f4fad2d50f0"
role_urn: "beam:artifact:role:staging_to:v1"
role_payload: "\n8cldrdata-YqzuKX1QnLCOo0cwjKRdBhGrip_ltIJZg-APT60tUPA.jar"
>
dependencies: <
type_urn: "beam:artifact:type:file:v1"
type_payload: "\nD/tmp/artifacts/dnsns-dhEp186udEF6X6chZus-RJzWRmzlccxx1_btlXWayVI.jar\022@761129d7ceae74417a5fa72166eb3e449cd6466ce571cc71d7f6ed95759ac952"
role_urn: "beam:artifact:role:staging_to:v1"
role_payload: "\n5dnsns-dhEp186udEF6X6chZus-RJzWRmzlccxx1_btlXWayVI.jar"
>
dependencies: <
type_urn: "beam:artifact:type:file:v1"
type_payload: "\nr/tmp/artifacts/beam-sdks-java-io-expansion-service-2.39.0-SNAPSHOT-WdCejIimKOpNkzCxX-1mqrIXkGjLM_FeeKFLyitKDgw.jar\022@59d09e8c88a628ea4d9330b15fed66aab2179068cb33f15e78a14bca2b4a0e0c"
role_urn: "beam:artifact:role:staging_to:v1"
role_payload: "\ncbeam-sdks-java-io-expansion-service-2.39.0-SNAPSHOT-WdCejIimKOpNkzCxX-1mqrIXkGjLM_FeeKFLyitKDgw.jar"
>
>
>
environments: <
key: "go"
value: <
urn: "beam:env:docker:v1"
payload: "\n\026apache/beam_go_sdk:dev"
capabilities: "beam:protocol:progress_reporting:v0"
capabilities: "beam:protocol:multi_core_bundle_processing:v1"
capabilities: "beam:version:sdk_base:go"
capabilities: "beam:coder:bytes:v1"
capabilities: "beam:coder:bool:v1"
capabilities: "beam:coder:varint:v1"
capabilities: "beam:coder:double:v1"
capabilities: "beam:coder:string_utf8:v1"
capabilities: "beam:coder:length_prefix:v1"
capabilities: "beam:coder:kv:v1"
capabilities: "beam:coder:iterable:v1"
capabilities: "beam:coder:state_backed_iterable:v1"
capabilities: "beam:coder:windowed_value:v1"
capabilities: "beam:coder:global_window:v1"
capabilities: "beam:coder:interval_window:v1"
capabilities: "beam:coder:row:v1"
capabilities: "beam:coder:nullable:v1"
dependencies: <
type_urn: "beam:artifact:type:file:v1"
role_urn: "beam:artifact:role:go_worker_binary:v1"
>
>
>
>
root_transform_ids: "s1"
root_transform_ids: "e4"
root_transform_ids: "e5"
root_transform_ids: "s3"
requirements: "beam:requirement:pardo:splittable_dofn:v1"
2022/04/16 23:57:14 Cross-compiling <https://ci-beam.apache.org/job/beam_PostCommit_XVR_Samza/ws/src/sdks/go/test/integration/io/xlang/kafka/kafka_test.go> as /tmp/worker-2-1650153434891651360
2022/04/16 23:57:16 Prepared job with id: go-testkafkaio_basicreadwrite_df9da961-61ca-44fb-b579-e73e83fc160b and staging token: go-testkafkaio_basicreadwrite_df9da961-61ca-44fb-b579-e73e83fc160b
2022/04/16 23:57:16 Staged binary artifact with token:
2022/04/16 23:57:16 Submitted job: go0testkafkaio0basicreadwrite-jenkins-0416235716-7f336031_eb167193-350c-49ee-9712-00a4958a468c
2022/04/16 23:57:16 Job state: STOPPED
2022/04/16 23:57:16 Job state: STARTING
2022/04/16 23:57:16 Job state: RUNNING
2022/04/16 23:57:26 Job state: DONE
--- PASS: TestKafkaIO_BasicReadWrite (27.75s)
PASS
ok github.com/apache/beam/sdks/v2/go/test/integration/io/xlang/kafka 33.777s
FAIL
> Task :runners:samza:job-server:validatesCrossLanguageRunnerGoUsingJava FAILED
> Task :runners:samza:job-server:validatesCrossLanguageRunnerJavaUsingJava
> Task :runners:samza:job-server:validatesCrossLanguageRunnerJavaUsingPython
> Task :runners:samza:job-server:validatesCrossLanguageRunnerJavaUsingPythonOnly
> Task :runners:samza:job-server:validatesCrossLanguageRunnerPythonUsingJava
> Task :runners:samza:job-server:validatesCrossLanguageRunnerPythonUsingPython
> Task :runners:samza:job-server:validatesCrossLanguageRunnerPythonUsingSql
> Task :runners:samza:job-server:validatesCrossLanguageRunnerCleanup
> Task :runners:samza:job-server:samzaJobServerCleanup
FAILURE: Build failed with an exception.
* Where:
Build file '<https://ci-beam.apache.org/job/beam_PostCommit_XVR_Samza/ws/src/sdks/go/test/build.gradle'> line: 195
* What went wrong:
Execution failed for task ':runners:samza:job-server:validatesCrossLanguageRunnerGoUsingJava'.
> Process 'command 'sh'' finished with non-zero exit value 1
* Try:
> Run with --stacktrace option to get the stack trace.
> Run with --info or --debug option to get more log output.
> Run with --scan to get full insights.
* Get more help at https://help.gradle.org
Deprecated Gradle features were used in this build, making it incompatible with Gradle 8.0.
You can use '--warning-mode all' to show the individual deprecation warnings and determine if they come from your own scripts or plugins.
See https://docs.gradle.org/7.4/userguide/command_line_interface.html#sec:command_line_warnings
Execution optimizations have been disabled for 1 invalid unit(s) of work during this build to ensure correctness.
Please consult deprecation warnings for more details.
BUILD FAILED in 33m 33s
246 actionable tasks: 163 executed, 72 from cache, 11 up-to-date
Publishing build scan...
https://gradle.com/s/s5oyislukh7jy
Build step 'Invoke Gradle script' changed build result to FAILURE
Build step 'Invoke Gradle script' marked build as failure
---------------------------------------------------------------------
To unsubscribe, e-mail: builds-unsubscribe@beam.apache.org
For additional commands, e-mail: builds-help@beam.apache.org
Build failed in Jenkins: beam_PostCommit_XVR_Samza #1065
Posted by Apache Jenkins Server <je...@builds.apache.org>.
See <https://ci-beam.apache.org/job/beam_PostCommit_XVR_Samza/1065/display/redirect>
Changes:
------------------------------------------
[...truncated 966.17 KB...]
payload: "\202SNAPPY\000\000\000\000\001\000\000\000\001\000\000\000\312\214\002\360^\254\355\000\005sr\000,org.apache.beam.sdk.coders.SerializableCoder\010\364 \216\305ynl\002\000\001L\000\004typet\000\021Ljava/lang/Class;xr\000&ofV\000\024Custom\005P8j\260\010\235\013;\035\013\002\000\000xr\000 j\213\000\005/\034C\335\325\211\256\274~\370\001/\020pvr\000;N1\000Pio.BoundedReadFromUnb\t\021`Source$Shardd\236\240U\205\000j\363\002\000\000xp"
>
>
>
coders: <
key: "NPZXskgodVTimestampedValueCoder"
value: <
spec: <
urn: "beam:coders:javasdk:0.1"
payload: "\202SNAPPY\000\000\000\000\001\000\000\000\001\000\000\001?\315\003\270\254\355\000\005sr\000Aorg.apache.beam.sdk.values.TimestampedV\001\022\000$>\021\000LCoder\364\376\202p\274iX-\002\000\001L\000\nv\001)\005\030\034t\000\"Lorg/\t]\000/\001],/sdk/coders/\005$\020;xr\000*N\202\000\t%(.Structured\005/8s\277\022\016\325\3246\021\002\000\000xr\000 j9\000\005/\034C\335\325\211\256\274~\370\001/\020psr\000,j1\000(Serializabl\t\277\034\010\364 \216\305ynl\005\327\\\004typet\000\021Ljava/lang/Class\001\300\000&jV\000\024Custom\005\215Pj\260\010\235\013;\035\013\002\000\000xq\000~\000\003vr\000;N;\000Pio.BoundedReadFromUnb\t\021`Source$Shardd\236\240U\205\000j\363\002\000\000xp"
>
>
>
coders: <
key: "NPZXskgodVValueWithRecordIdCoder"
value: <
spec: <
urn: "beam:coders:javasdk:0.1"
payload: "\202SNAPPY\000\000\000\000\001\000\000\000\001\000\000\001\213\311\005\320\254\355\000\005sr\000Corg.apache.beam.sdk.values.ValueWithRecordId$B\022\000LCoder{\343\376bQ\014\204>\002\000\002L\000\007i\t\025\034t\000+Lorg/\t\\\000/\001\\\024/sdk/c\0012(s/ByteArray\005B\014;L\000\n\005u\005\016\010t\000\"n;\000\005$\020;xr\000*N\274\000\t`(.Structured\005/8s\277\022\016\325\3246\021\002\000\000xr\000 j9\000\005/\034C\335\325\211\256\274~\370\001/\020psr\000)j1\0006\312\000\034\351\277\005|\263\3746\333\001:\010r\000&j8\000\024Atomic\005o\034\307\354\265\314\205tPF\0015 q\000~\000\003sr\000-N;\000$io.kafka.K\001\006\000R%\227\005B<I\320\251Y\032\341{#\002\000\001L\000\007kv\005\025\010t\000$nH\001\000K\t&\000;\025s\000\"Ns\000-P\r- j\000\275\271\035\243\3126\002!\353\010\010ke)\277\001\264\000\0022\303\001\005\022\025Y\000(jY\000\030Nullabl)\372\034E\333\0336>\220\247\007\005\307]\022.O\000\001\014,\006sq\000~\000\016q\000~\000\020"
>
>
>
coders: <
key: "NPZXskgodVVarIntCoder"
value: <
spec: <
urn: "beam:coders:javasdk:0.1"
payload: "\202SNAPPY\000\000\000\000\001\000\000\000\001\000\000\000\210\330\001\350\254\355\000\005sr\000&org.apache.beam.sdk.coders.VarIntCoder\300K2\332\251KVh\002\000\000xrr5\000\024Atomic\0055 \307\354\265\314\205tPF\002\0055\000*jj\000$Structured\0059\034s\277\022\016\325\3246\021\t9\000 j9\000\005/0C\335\325\211\256\274~\370\002\000\000xp"
>
>
>
coders: <
key: "NPZXskgodVVoidCoder"
value: <
spec: <
urn: "beam:coders:javasdk:0.1"
payload: "\202SNAPPY\000\000\000\000\001\000\000\000\001\000\000\000\210\326\001\350\254\355\000\005sr\000$org.apache.beam.sdk.coders.VoidCoder\271\277U\233\350\r\257U\002\000\000xr\000&j3\000\024Atomic\0055 \307\354\265\314\205tPF\002\0055\000*j5\000$Structured\0059\034s\277\022\016\325\3246\021\t9\000 j9\000\005/0C\335\325\211\256\274~\370\002\000\000xp"
>
>
>
coders: <
key: "c0"
value: <
spec: <
urn: "beam:coder:bytes:v1"
>
>
>
coders: <
key: "c1"
value: <
spec: <
urn: "beam:coder:global_window:v1"
>
>
>
coders: <
key: "c2"
value: <
spec: <
urn: "beam:go:coder:custom:v1"
payload: "Cgd2YXJpbnR6EgIIAhpdCklnaXRodWIuY29tL2FwYWNoZS9iZWFtL3Nka3MvdjIvZ28vcGtnL2JlYW0vY29yZS9ydW50aW1lL2NvZGVyeC5lbmNWYXJJbnRaEhAIFiIECBlADyoGCBQSAggIImkKSWdpdGh1Yi5jb20vYXBhY2hlL2JlYW0vc2Rrcy92Mi9nby9wa2cvYmVhbS9jb3JlL3J1bnRpbWUvY29kZXJ4LmRlY1ZhckludFoSHAgWIgQIGUADIgYIFBICCAgqBAgZQA8qBAgZQAE="
>
>
>
coders: <
key: "c3"
value: <
spec: <
urn: "beam:coder:length_prefix:v1"
>
component_coder_ids: "c2"
>
>
coders: <
key: "c4"
value: <
spec: <
urn: "beam:coder:kv:v1"
>
component_coder_ids: "c0"
component_coder_ids: "c0"
>
>
environments: <
key: "NPZXskgodVbeam:env:docker:v1"
value: <
urn: "beam:env:docker:v1"
payload: "\n apache/beam_java8_sdk:2.39.0.dev"
capabilities: "beam:coder:bytes:v1"
capabilities: "beam:coder:bool:v1"
capabilities: "beam:coder:varint:v1"
capabilities: "beam:coder:string_utf8:v1"
capabilities: "beam:coder:iterable:v1"
capabilities: "beam:coder:timer:v1"
capabilities: "beam:coder:kv:v1"
capabilities: "beam:coder:length_prefix:v1"
capabilities: "beam:coder:global_window:v1"
capabilities: "beam:coder:interval_window:v1"
capabilities: "beam:coder:custom_window:v1"
capabilities: "beam:coder:windowed_value:v1"
capabilities: "beam:coder:double:v1"
capabilities: "beam:coder:row:v1"
capabilities: "beam:coder:param_windowed_value:v1"
capabilities: "beam:coder:state_backed_iterable:v1"
capabilities: "beam:coder:sharded_key:v1"
capabilities: "beam:coder:nullable:v1"
capabilities: "beam:protocol:multi_core_bundle_processing:v1"
capabilities: "beam:protocol:progress_reporting:v1"
capabilities: "beam:protocol:harness_monitoring_infos:v1"
capabilities: "beam:protocol:control_request_elements_embedding:v1"
capabilities: "beam:protocol:state_caching:v1"
capabilities: "beam:version:sdk_base:apache/beam_java8_sdk:2.39.0.dev"
capabilities: "beam:transform:sdf_truncate_sized_restrictions:v1"
capabilities: "beam:transform:to_string:v1"
dependencies: <
type_urn: "beam:artifact:type:file:v1"
type_payload: "\nL/tmp/artifacts/icedtea-sound-ebvtNFkfFXg4aaYFuDnwKpwDSjzsaZqlqv5iKxPTr-U.jar\022@79bbed34591f15783869a605b839f02a9c034a3cec699aa5aafe622b13d3afe5"
role_urn: "beam:artifact:role:staging_to:v1"
role_payload: "\n=icedtea-sound-ebvtNFkfFXg4aaYFuDnwKpwDSjzsaZqlqv5iKxPTr-U.jar"
>
dependencies: <
type_urn: "beam:artifact:type:file:v1"
type_payload: "\nF/tmp/artifacts/jaccess-ULFTCPsb6cLYZ0f1BG1FQfczmHNaZCx8plXuRDKpBqE.jar\022@50b15308fb1be9c2d86747f5046d4541f73398735a642c7ca655ee4432a906a1"
role_urn: "beam:artifact:role:staging_to:v1"
role_payload: "\n7jaccess-ULFTCPsb6cLYZ0f1BG1FQfczmHNaZCx8plXuRDKpBqE.jar"
>
dependencies: <
type_urn: "beam:artifact:type:file:v1"
type_payload: "\nI/tmp/artifacts/localedata-dUHqyGxaTVCjfTI8MckPYarZ3_mwf62udkxaHi1aKns.jar\022@7541eac86c5a4d50a37d323c31c90f61aad9dff9b07fadae764c5a1e2d5a2a7b"
role_urn: "beam:artifact:role:staging_to:v1"
role_payload: "\n:localedata-dUHqyGxaTVCjfTI8MckPYarZ3_mwf62udkxaHi1aKns.jar"
>
dependencies: <
type_urn: "beam:artifact:type:file:v1"
type_payload: "\nF/tmp/artifacts/nashorn-XdUndQGroXOP9NCsfITpBERYcbbGXVHLjbvNWXCh-3A.jar\022@5dd5277501aba1738ff4d0ac7c84e904445871b6c65d51cb8dbbcd5970a1fb70"
role_urn: "beam:artifact:role:staging_to:v1"
role_payload: "\n7nashorn-XdUndQGroXOP9NCsfITpBERYcbbGXVHLjbvNWXCh-3A.jar"
>
dependencies: <
type_urn: "beam:artifact:type:file:v1"
type_payload: "\nG/tmp/artifacts/cldrdata-YqzuKX1QnLCOo0cwjKRdBhGrip_ltIJZg-APT60tUPA.jar\022@62acee297d509cb08ea347308ca45d0611ab8a9fe5b4825983e00f4fad2d50f0"
role_urn: "beam:artifact:role:staging_to:v1"
role_payload: "\n8cldrdata-YqzuKX1QnLCOo0cwjKRdBhGrip_ltIJZg-APT60tUPA.jar"
>
dependencies: <
type_urn: "beam:artifact:type:file:v1"
type_payload: "\nD/tmp/artifacts/dnsns-dhEp186udEF6X6chZus-RJzWRmzlccxx1_btlXWayVI.jar\022@761129d7ceae74417a5fa72166eb3e449cd6466ce571cc71d7f6ed95759ac952"
role_urn: "beam:artifact:role:staging_to:v1"
role_payload: "\n5dnsns-dhEp186udEF6X6chZus-RJzWRmzlccxx1_btlXWayVI.jar"
>
dependencies: <
type_urn: "beam:artifact:type:file:v1"
type_payload: "\nr/tmp/artifacts/beam-sdks-java-io-expansion-service-2.39.0-SNAPSHOT-WdCejIimKOpNkzCxX-1mqrIXkGjLM_FeeKFLyitKDgw.jar\022@59d09e8c88a628ea4d9330b15fed66aab2179068cb33f15e78a14bca2b4a0e0c"
role_urn: "beam:artifact:role:staging_to:v1"
role_payload: "\ncbeam-sdks-java-io-expansion-service-2.39.0-SNAPSHOT-WdCejIimKOpNkzCxX-1mqrIXkGjLM_FeeKFLyitKDgw.jar"
>
>
>
environments: <
key: "go"
value: <
urn: "beam:env:docker:v1"
payload: "\n\026apache/beam_go_sdk:dev"
capabilities: "beam:protocol:progress_reporting:v0"
capabilities: "beam:protocol:multi_core_bundle_processing:v1"
capabilities: "beam:version:sdk_base:go"
capabilities: "beam:coder:bytes:v1"
capabilities: "beam:coder:bool:v1"
capabilities: "beam:coder:varint:v1"
capabilities: "beam:coder:double:v1"
capabilities: "beam:coder:string_utf8:v1"
capabilities: "beam:coder:length_prefix:v1"
capabilities: "beam:coder:kv:v1"
capabilities: "beam:coder:iterable:v1"
capabilities: "beam:coder:state_backed_iterable:v1"
capabilities: "beam:coder:windowed_value:v1"
capabilities: "beam:coder:global_window:v1"
capabilities: "beam:coder:interval_window:v1"
capabilities: "beam:coder:row:v1"
capabilities: "beam:coder:nullable:v1"
dependencies: <
type_urn: "beam:artifact:type:file:v1"
role_urn: "beam:artifact:role:go_worker_binary:v1"
>
>
>
>
root_transform_ids: "s1"
root_transform_ids: "e4"
root_transform_ids: "e5"
root_transform_ids: "s3"
requirements: "beam:requirement:pardo:splittable_dofn:v1"
2022/04/16 17:55:52 Cross-compiling <https://ci-beam.apache.org/job/beam_PostCommit_XVR_Samza/ws/src/sdks/go/test/integration/io/xlang/kafka/kafka_test.go> as /tmp/worker-2-1650131752345377335
2022/04/16 17:55:54 Prepared job with id: go-testkafkaio_basicreadwrite_97dd7145-de83-407d-9250-f5b03497d459 and staging token: go-testkafkaio_basicreadwrite_97dd7145-de83-407d-9250-f5b03497d459
2022/04/16 17:55:54 Staged binary artifact with token:
2022/04/16 17:55:54 Submitted job: go0testkafkaio0basicreadwrite-jenkins-0416175554-3cff6b58_2ea5c12c-db43-48f6-8d7b-e3f3e8731b5e
2022/04/16 17:55:54 Job state: STOPPED
2022/04/16 17:55:54 Job state: STARTING
2022/04/16 17:55:54 Job state: RUNNING
2022/04/16 17:56:04 Job state: DONE
--- PASS: TestKafkaIO_BasicReadWrite (28.74s)
PASS
ok github.com/apache/beam/sdks/v2/go/test/integration/io/xlang/kafka 34.767s
FAIL
> Task :runners:samza:job-server:validatesCrossLanguageRunnerGoUsingJava FAILED
> Task :runners:samza:job-server:validatesCrossLanguageRunnerJavaUsingJava
> Task :runners:samza:job-server:validatesCrossLanguageRunnerJavaUsingPython
> Task :runners:samza:job-server:validatesCrossLanguageRunnerJavaUsingPythonOnly
> Task :runners:samza:job-server:validatesCrossLanguageRunnerPythonUsingJava
> Task :runners:samza:job-server:validatesCrossLanguageRunnerPythonUsingPython
> Task :runners:samza:job-server:validatesCrossLanguageRunnerPythonUsingSql
> Task :runners:samza:job-server:validatesCrossLanguageRunnerCleanup
> Task :runners:samza:job-server:samzaJobServerCleanup
FAILURE: Build failed with an exception.
* Where:
Build file '<https://ci-beam.apache.org/job/beam_PostCommit_XVR_Samza/ws/src/sdks/go/test/build.gradle'> line: 195
* What went wrong:
Execution failed for task ':runners:samza:job-server:validatesCrossLanguageRunnerGoUsingJava'.
> Process 'command 'sh'' finished with non-zero exit value 1
* Try:
> Run with --stacktrace option to get the stack trace.
> Run with --info or --debug option to get more log output.
> Run with --scan to get full insights.
* Get more help at https://help.gradle.org
Deprecated Gradle features were used in this build, making it incompatible with Gradle 8.0.
You can use '--warning-mode all' to show the individual deprecation warnings and determine if they come from your own scripts or plugins.
See https://docs.gradle.org/7.4/userguide/command_line_interface.html#sec:command_line_warnings
Execution optimizations have been disabled for 1 invalid unit(s) of work during this build to ensure correctness.
Please consult deprecation warnings for more details.
BUILD FAILED in 32m 4s
246 actionable tasks: 163 executed, 72 from cache, 11 up-to-date
Publishing build scan...
https://gradle.com/s/pbb3roxsehpww
Build step 'Invoke Gradle script' changed build result to FAILURE
Build step 'Invoke Gradle script' marked build as failure
---------------------------------------------------------------------
To unsubscribe, e-mail: builds-unsubscribe@beam.apache.org
For additional commands, e-mail: builds-help@beam.apache.org
Build failed in Jenkins: beam_PostCommit_XVR_Samza #1064
Posted by Apache Jenkins Server <je...@builds.apache.org>.
See <https://ci-beam.apache.org/job/beam_PostCommit_XVR_Samza/1064/display/redirect>
Changes:
------------------------------------------
[...truncated 1.30 MB...]
>
coders: <
key: "tiFcyIIiIyKvCoder3"
value: <
spec: <
urn: "beam:coder:kv:v1"
>
component_coder_ids: "tiFcyIIiIyVarIntCoder"
component_coder_ids: "tiFcyIIiIyTimestampedValueCoder"
>
>
coders: <
key: "tiFcyIIiIyKvCoder4"
value: <
spec: <
urn: "beam:coder:kv:v1"
>
component_coder_ids: "tiFcyIIiIyVarIntCoder"
component_coder_ids: "tiFcyIIiIyIterableCoder"
>
>
coders: <
key: "tiFcyIIiIyNullableCoder"
value: <
spec: <
urn: "beam:coder:nullable:v1"
>
component_coder_ids: "tiFcyIIiIyByteArrayCoder"
>
>
coders: <
key: "tiFcyIIiIySerializableCoder"
value: <
spec: <
urn: "beam:coders:javasdk:0.1"
payload: "\202SNAPPY\000\000\000\000\001\000\000\000\001\000\000\000\312\241\002\360^\254\355\000\005sr\000,org.apache.beam.sdk.coders.SerializableCoder\010\364 \216\305ynl\002\000\001L\000\004typet\000\021Ljava/lang/Class;xr\000&ofV\000\024Custom\005P8j\260\010\235\013;\035\013\002\000\000xr\000 j\213\000\005/\034C\335\325\211\256\274~\370\001/\020pvr\000$N1\000\\io.BoundedSource!`v\023\177\370QA\0015\010r\000\035Z3\000\t,0\020\213\372\020Y\214\347\323\002\000\000xp"
>
>
>
coders: <
key: "tiFcyIIiIySerializableCoder1"
value: <
spec: <
urn: "beam:coders:javasdk:0.1"
payload: "\202SNAPPY\000\000\000\000\001\000\000\000\001\000\000\000\312\214\002\360^\254\355\000\005sr\000,org.apache.beam.sdk.coders.SerializableCoder\010\364 \216\305ynl\002\000\001L\000\004typet\000\021Ljava/lang/Class;xr\000&ofV\000\024Custom\005P8j\260\010\235\013;\035\013\002\000\000xr\000 j\213\000\005/\034C\335\325\211\256\274~\370\001/\020pvr\000;N1\000Pio.BoundedReadFromUnb\t\021`Source$Shardd\236\240U\205\000j\363\002\000\000xp"
>
>
>
coders: <
key: "tiFcyIIiIyTimestampedValueCoder"
value: <
spec: <
urn: "beam:coders:javasdk:0.1"
payload: "\202SNAPPY\000\000\000\000\001\000\000\000\001\000\000\001?\315\003\270\254\355\000\005sr\000Aorg.apache.beam.sdk.values.TimestampedV\001\022\000$>\021\000LCoder\364\376\202p\274iX-\002\000\001L\000\nv\001)\005\030\034t\000\"Lorg/\t]\000/\001],/sdk/coders/\005$\020;xr\000*N\202\000\t%(.Structured\005/8s\277\022\016\325\3246\021\002\000\000xr\000 j9\000\005/\034C\335\325\211\256\274~\370\001/\020psr\000,j1\000(Serializabl\t\277\034\010\364 \216\305ynl\005\327\\\004typet\000\021Ljava/lang/Class\001\300\000&jV\000\024Custom\005\215Pj\260\010\235\013;\035\013\002\000\000xq\000~\000\003vr\000;N;\000Pio.BoundedReadFromUnb\t\021`Source$Shardd\236\240U\205\000j\363\002\000\000xp"
>
>
>
coders: <
key: "tiFcyIIiIyValueWithRecordIdCoder"
value: <
spec: <
urn: "beam:coders:javasdk:0.1"
payload: "\202SNAPPY\000\000\000\000\001\000\000\000\001\000\000\001\213\311\005\320\254\355\000\005sr\000Corg.apache.beam.sdk.values.ValueWithRecordId$B\022\000LCoder{\343\376bQ\014\204>\002\000\002L\000\007i\t\025\034t\000+Lorg/\t\\\000/\001\\\024/sdk/c\0012(s/ByteArray\005B\014;L\000\n\005u\005\016\010t\000\"n;\000\005$\020;xr\000*N\274\000\t`(.Structured\005/8s\277\022\016\325\3246\021\002\000\000xr\000 j9\000\005/\034C\335\325\211\256\274~\370\001/\020psr\000)j1\0006\312\000\034\351\277\005|\263\3746\333\001:\010r\000&j8\000\024Atomic\005o\034\307\354\265\314\205tPF\0015 q\000~\000\003sr\000-N;\000$io.kafka.K\001\006\000R%\227\005B<I\320\251Y\032\341{#\002\000\001L\000\007kv\005\025\010t\000$nH\001\000K\t&\000;\025s\000\"Ns\000-P\r- j\000\275\271\035\243\3126\002!\353\010\010ke)\277\001\264\000\0022\303\001\005\022\025Y\000(jY\000\030Nullabl)\372\034E\333\0336>\220\247\007\005\307]\022.O\000\001\014,\006sq\000~\000\016q\000~\000\020"
>
>
>
coders: <
key: "tiFcyIIiIyVarIntCoder"
value: <
spec: <
urn: "beam:coders:javasdk:0.1"
payload: "\202SNAPPY\000\000\000\000\001\000\000\000\001\000\000\000\210\330\001\350\254\355\000\005sr\000&org.apache.beam.sdk.coders.VarIntCoder\300K2\332\251KVh\002\000\000xrr5\000\024Atomic\0055 \307\354\265\314\205tPF\002\0055\000*jj\000$Structured\0059\034s\277\022\016\325\3246\021\t9\000 j9\000\005/0C\335\325\211\256\274~\370\002\000\000xp"
>
>
>
coders: <
key: "tiFcyIIiIyVoidCoder"
value: <
spec: <
urn: "beam:coders:javasdk:0.1"
payload: "\202SNAPPY\000\000\000\000\001\000\000\000\001\000\000\000\210\326\001\350\254\355\000\005sr\000$org.apache.beam.sdk.coders.VoidCoder\271\277U\233\350\r\257U\002\000\000xr\000&j3\000\024Atomic\0055 \307\354\265\314\205tPF\002\0055\000*j5\000$Structured\0059\034s\277\022\016\325\3246\021\t9\000 j9\000\005/0C\335\325\211\256\274~\370\002\000\000xp"
>
>
>
environments: <
key: "go"
value: <
urn: "beam:env:docker:v1"
payload: "\n\026apache/beam_go_sdk:dev"
capabilities: "beam:protocol:progress_reporting:v0"
capabilities: "beam:protocol:multi_core_bundle_processing:v1"
capabilities: "beam:version:sdk_base:go"
capabilities: "beam:coder:bytes:v1"
capabilities: "beam:coder:bool:v1"
capabilities: "beam:coder:varint:v1"
capabilities: "beam:coder:double:v1"
capabilities: "beam:coder:string_utf8:v1"
capabilities: "beam:coder:length_prefix:v1"
capabilities: "beam:coder:kv:v1"
capabilities: "beam:coder:iterable:v1"
capabilities: "beam:coder:state_backed_iterable:v1"
capabilities: "beam:coder:windowed_value:v1"
capabilities: "beam:coder:global_window:v1"
capabilities: "beam:coder:interval_window:v1"
capabilities: "beam:coder:row:v1"
capabilities: "beam:coder:nullable:v1"
dependencies: <
type_urn: "beam:artifact:type:file:v1"
role_urn: "beam:artifact:role:go_worker_binary:v1"
>
>
>
environments: <
key: "tiFcyIIiIybeam:env:docker:v1"
value: <
urn: "beam:env:docker:v1"
payload: "\n apache/beam_java8_sdk:2.39.0.dev"
capabilities: "beam:coder:bytes:v1"
capabilities: "beam:coder:bool:v1"
capabilities: "beam:coder:varint:v1"
capabilities: "beam:coder:string_utf8:v1"
capabilities: "beam:coder:iterable:v1"
capabilities: "beam:coder:timer:v1"
capabilities: "beam:coder:kv:v1"
capabilities: "beam:coder:length_prefix:v1"
capabilities: "beam:coder:global_window:v1"
capabilities: "beam:coder:interval_window:v1"
capabilities: "beam:coder:custom_window:v1"
capabilities: "beam:coder:windowed_value:v1"
capabilities: "beam:coder:double:v1"
capabilities: "beam:coder:row:v1"
capabilities: "beam:coder:param_windowed_value:v1"
capabilities: "beam:coder:state_backed_iterable:v1"
capabilities: "beam:coder:sharded_key:v1"
capabilities: "beam:coder:nullable:v1"
capabilities: "beam:protocol:multi_core_bundle_processing:v1"
capabilities: "beam:protocol:progress_reporting:v1"
capabilities: "beam:protocol:harness_monitoring_infos:v1"
capabilities: "beam:protocol:control_request_elements_embedding:v1"
capabilities: "beam:protocol:state_caching:v1"
capabilities: "beam:version:sdk_base:apache/beam_java8_sdk:2.39.0.dev"
capabilities: "beam:transform:sdf_truncate_sized_restrictions:v1"
capabilities: "beam:transform:to_string:v1"
dependencies: <
type_urn: "beam:artifact:type:file:v1"
type_payload: "\nL/tmp/artifacts/icedtea-sound-ebvtNFkfFXg4aaYFuDnwKpwDSjzsaZqlqv5iKxPTr-U.jar\022@79bbed34591f15783869a605b839f02a9c034a3cec699aa5aafe622b13d3afe5"
role_urn: "beam:artifact:role:staging_to:v1"
role_payload: "\n=icedtea-sound-ebvtNFkfFXg4aaYFuDnwKpwDSjzsaZqlqv5iKxPTr-U.jar"
>
dependencies: <
type_urn: "beam:artifact:type:file:v1"
type_payload: "\nF/tmp/artifacts/jaccess-ULFTCPsb6cLYZ0f1BG1FQfczmHNaZCx8plXuRDKpBqE.jar\022@50b15308fb1be9c2d86747f5046d4541f73398735a642c7ca655ee4432a906a1"
role_urn: "beam:artifact:role:staging_to:v1"
role_payload: "\n7jaccess-ULFTCPsb6cLYZ0f1BG1FQfczmHNaZCx8plXuRDKpBqE.jar"
>
dependencies: <
type_urn: "beam:artifact:type:file:v1"
type_payload: "\nI/tmp/artifacts/localedata-dUHqyGxaTVCjfTI8MckPYarZ3_mwf62udkxaHi1aKns.jar\022@7541eac86c5a4d50a37d323c31c90f61aad9dff9b07fadae764c5a1e2d5a2a7b"
role_urn: "beam:artifact:role:staging_to:v1"
role_payload: "\n:localedata-dUHqyGxaTVCjfTI8MckPYarZ3_mwf62udkxaHi1aKns.jar"
>
dependencies: <
type_urn: "beam:artifact:type:file:v1"
type_payload: "\nF/tmp/artifacts/nashorn-XdUndQGroXOP9NCsfITpBERYcbbGXVHLjbvNWXCh-3A.jar\022@5dd5277501aba1738ff4d0ac7c84e904445871b6c65d51cb8dbbcd5970a1fb70"
role_urn: "beam:artifact:role:staging_to:v1"
role_payload: "\n7nashorn-XdUndQGroXOP9NCsfITpBERYcbbGXVHLjbvNWXCh-3A.jar"
>
dependencies: <
type_urn: "beam:artifact:type:file:v1"
type_payload: "\nG/tmp/artifacts/cldrdata-YqzuKX1QnLCOo0cwjKRdBhGrip_ltIJZg-APT60tUPA.jar\022@62acee297d509cb08ea347308ca45d0611ab8a9fe5b4825983e00f4fad2d50f0"
role_urn: "beam:artifact:role:staging_to:v1"
role_payload: "\n8cldrdata-YqzuKX1QnLCOo0cwjKRdBhGrip_ltIJZg-APT60tUPA.jar"
>
dependencies: <
type_urn: "beam:artifact:type:file:v1"
type_payload: "\nD/tmp/artifacts/dnsns-dhEp186udEF6X6chZus-RJzWRmzlccxx1_btlXWayVI.jar\022@761129d7ceae74417a5fa72166eb3e449cd6466ce571cc71d7f6ed95759ac952"
role_urn: "beam:artifact:role:staging_to:v1"
role_payload: "\n5dnsns-dhEp186udEF6X6chZus-RJzWRmzlccxx1_btlXWayVI.jar"
>
dependencies: <
type_urn: "beam:artifact:type:file:v1"
type_payload: "\nr/tmp/artifacts/beam-sdks-java-io-expansion-service-2.39.0-SNAPSHOT-WdCejIimKOpNkzCxX-1mqrIXkGjLM_FeeKFLyitKDgw.jar\022@59d09e8c88a628ea4d9330b15fed66aab2179068cb33f15e78a14bca2b4a0e0c"
role_urn: "beam:artifact:role:staging_to:v1"
role_payload: "\ncbeam-sdks-java-io-expansion-service-2.39.0-SNAPSHOT-WdCejIimKOpNkzCxX-1mqrIXkGjLM_FeeKFLyitKDgw.jar"
>
>
>
>
root_transform_ids: "e4"
root_transform_ids: "s1"
root_transform_ids: "e5"
root_transform_ids: "s3"
requirements: "beam:requirement:pardo:splittable_dofn:v1"
2022/04/16 11:56:52 Cross-compiling <https://ci-beam.apache.org/job/beam_PostCommit_XVR_Samza/ws/src/sdks/go/test/integration/io/xlang/kafka/kafka_test.go> as /tmp/worker-2-1650110212475332625
2022/04/16 11:56:54 Prepared job with id: go-testkafkaio_basicreadwrite_64ee162e-e6e4-44f7-ba21-d1bd821184d4 and staging token: go-testkafkaio_basicreadwrite_64ee162e-e6e4-44f7-ba21-d1bd821184d4
2022/04/16 11:56:54 Staged binary artifact with token:
2022/04/16 11:56:54 Submitted job: go0testkafkaio0basicreadwrite-jenkins-0416115654-590e8b25_5674bb8c-396a-4366-a511-769c29b7cf9a
2022/04/16 11:56:54 Job state: STOPPED
2022/04/16 11:56:54 Job state: STARTING
2022/04/16 11:56:54 Job state: RUNNING
2022/04/16 11:57:04 Job state: DONE
--- PASS: TestKafkaIO_BasicReadWrite (27.60s)
PASS
ok github.com/apache/beam/sdks/v2/go/test/integration/io/xlang/kafka 33.633s
FAIL
> Task :runners:samza:job-server:validatesCrossLanguageRunnerGoUsingJava FAILED
> Task :runners:samza:job-server:validatesCrossLanguageRunnerJavaUsingJava
> Task :runners:samza:job-server:validatesCrossLanguageRunnerJavaUsingPython
> Task :runners:samza:job-server:validatesCrossLanguageRunnerJavaUsingPythonOnly
> Task :runners:samza:job-server:validatesCrossLanguageRunnerPythonUsingJava
> Task :runners:samza:job-server:validatesCrossLanguageRunnerPythonUsingPython
> Task :runners:samza:job-server:validatesCrossLanguageRunnerPythonUsingSql
> Task :runners:samza:job-server:validatesCrossLanguageRunnerCleanup
> Task :runners:samza:job-server:samzaJobServerCleanup
FAILURE: Build failed with an exception.
* Where:
Build file '<https://ci-beam.apache.org/job/beam_PostCommit_XVR_Samza/ws/src/sdks/go/test/build.gradle'> line: 195
* What went wrong:
Execution failed for task ':runners:samza:job-server:validatesCrossLanguageRunnerGoUsingJava'.
> Process 'command 'sh'' finished with non-zero exit value 1
* Try:
> Run with --stacktrace option to get the stack trace.
> Run with --info or --debug option to get more log output.
> Run with --scan to get full insights.
* Get more help at https://help.gradle.org
Deprecated Gradle features were used in this build, making it incompatible with Gradle 8.0.
You can use '--warning-mode all' to show the individual deprecation warnings and determine if they come from your own scripts or plugins.
See https://docs.gradle.org/7.4/userguide/command_line_interface.html#sec:command_line_warnings
Execution optimizations have been disabled for 1 invalid unit(s) of work during this build to ensure correctness.
Please consult deprecation warnings for more details.
BUILD FAILED in 32m 44s
246 actionable tasks: 163 executed, 72 from cache, 11 up-to-date
Publishing build scan...
https://gradle.com/s/gv4gp6p2s2vfc
Build step 'Invoke Gradle script' changed build result to FAILURE
Build step 'Invoke Gradle script' marked build as failure
---------------------------------------------------------------------
To unsubscribe, e-mail: builds-unsubscribe@beam.apache.org
For additional commands, e-mail: builds-help@beam.apache.org
Build failed in Jenkins: beam_PostCommit_XVR_Samza #1063
Posted by Apache Jenkins Server <je...@builds.apache.org>.
See <https://ci-beam.apache.org/job/beam_PostCommit_XVR_Samza/1063/display/redirect>
Changes:
------------------------------------------
[...truncated 959.02 KB...]
payload: "\202SNAPPY\000\000\000\000\001\000\000\000\001\000\000\000\312\214\002\360^\254\355\000\005sr\000,org.apache.beam.sdk.coders.SerializableCoder\010\364 \216\305ynl\002\000\001L\000\004typet\000\021Ljava/lang/Class;xr\000&ofV\000\024Custom\005P8j\260\010\235\013;\035\013\002\000\000xr\000 j\213\000\005/\034C\335\325\211\256\274~\370\001/\020pvr\000;N1\000Pio.BoundedReadFromUnb\t\021`Source$Shardd\236\240U\205\000j\363\002\000\000xp"
>
>
>
coders: <
key: "aoYJXQlDUdTimestampedValueCoder"
value: <
spec: <
urn: "beam:coders:javasdk:0.1"
payload: "\202SNAPPY\000\000\000\000\001\000\000\000\001\000\000\001?\315\003\270\254\355\000\005sr\000Aorg.apache.beam.sdk.values.TimestampedV\001\022\000$>\021\000LCoder\364\376\202p\274iX-\002\000\001L\000\nv\001)\005\030\034t\000\"Lorg/\t]\000/\001],/sdk/coders/\005$\020;xr\000*N\202\000\t%(.Structured\005/8s\277\022\016\325\3246\021\002\000\000xr\000 j9\000\005/\034C\335\325\211\256\274~\370\001/\020psr\000,j1\000(Serializabl\t\277\034\010\364 \216\305ynl\005\327\\\004typet\000\021Ljava/lang/Class\001\300\000&jV\000\024Custom\005\215Pj\260\010\235\013;\035\013\002\000\000xq\000~\000\003vr\000;N;\000Pio.BoundedReadFromUnb\t\021`Source$Shardd\236\240U\205\000j\363\002\000\000xp"
>
>
>
coders: <
key: "aoYJXQlDUdValueWithRecordIdCoder"
value: <
spec: <
urn: "beam:coders:javasdk:0.1"
payload: "\202SNAPPY\000\000\000\000\001\000\000\000\001\000\000\001\213\311\005\320\254\355\000\005sr\000Corg.apache.beam.sdk.values.ValueWithRecordId$B\022\000LCoder{\343\376bQ\014\204>\002\000\002L\000\007i\t\025\034t\000+Lorg/\t\\\000/\001\\\024/sdk/c\0012(s/ByteArray\005B\014;L\000\n\005u\005\016\010t\000\"n;\000\005$\020;xr\000*N\274\000\t`(.Structured\005/8s\277\022\016\325\3246\021\002\000\000xr\000 j9\000\005/\034C\335\325\211\256\274~\370\001/\020psr\000)j1\0006\312\000\034\351\277\005|\263\3746\333\001:\010r\000&j8\000\024Atomic\005o\034\307\354\265\314\205tPF\0015 q\000~\000\003sr\000-N;\000$io.kafka.K\001\006\000R%\227\005B<I\320\251Y\032\341{#\002\000\001L\000\007kv\005\025\010t\000$nH\001\000K\t&\000;\025s\000\"Ns\000-P\r- j\000\275\271\035\243\3126\002!\353\010\010ke)\277\001\264\000\0022\303\001\005\022\025Y\000(jY\000\030Nullabl)\372\034E\333\0336>\220\247\007\005\307]\022.O\000\001\014,\006sq\000~\000\016q\000~\000\020"
>
>
>
coders: <
key: "aoYJXQlDUdVarIntCoder"
value: <
spec: <
urn: "beam:coders:javasdk:0.1"
payload: "\202SNAPPY\000\000\000\000\001\000\000\000\001\000\000\000\210\330\001\350\254\355\000\005sr\000&org.apache.beam.sdk.coders.VarIntCoder\300K2\332\251KVh\002\000\000xrr5\000\024Atomic\0055 \307\354\265\314\205tPF\002\0055\000*jj\000$Structured\0059\034s\277\022\016\325\3246\021\t9\000 j9\000\005/0C\335\325\211\256\274~\370\002\000\000xp"
>
>
>
coders: <
key: "aoYJXQlDUdVoidCoder"
value: <
spec: <
urn: "beam:coders:javasdk:0.1"
payload: "\202SNAPPY\000\000\000\000\001\000\000\000\001\000\000\000\210\326\001\350\254\355\000\005sr\000$org.apache.beam.sdk.coders.VoidCoder\271\277U\233\350\r\257U\002\000\000xr\000&j3\000\024Atomic\0055 \307\354\265\314\205tPF\002\0055\000*j5\000$Structured\0059\034s\277\022\016\325\3246\021\t9\000 j9\000\005/0C\335\325\211\256\274~\370\002\000\000xp"
>
>
>
coders: <
key: "c0"
value: <
spec: <
urn: "beam:coder:bytes:v1"
>
>
>
coders: <
key: "c1"
value: <
spec: <
urn: "beam:coder:global_window:v1"
>
>
>
coders: <
key: "c2"
value: <
spec: <
urn: "beam:go:coder:custom:v1"
payload: "Cgd2YXJpbnR6EgIIAhpdCklnaXRodWIuY29tL2FwYWNoZS9iZWFtL3Nka3MvdjIvZ28vcGtnL2JlYW0vY29yZS9ydW50aW1lL2NvZGVyeC5lbmNWYXJJbnRaEhAIFiIECBlADyoGCBQSAggIImkKSWdpdGh1Yi5jb20vYXBhY2hlL2JlYW0vc2Rrcy92Mi9nby9wa2cvYmVhbS9jb3JlL3J1bnRpbWUvY29kZXJ4LmRlY1ZhckludFoSHAgWIgQIGUADIgYIFBICCAgqBAgZQA8qBAgZQAE="
>
>
>
coders: <
key: "c3"
value: <
spec: <
urn: "beam:coder:length_prefix:v1"
>
component_coder_ids: "c2"
>
>
coders: <
key: "c4"
value: <
spec: <
urn: "beam:coder:kv:v1"
>
component_coder_ids: "c0"
component_coder_ids: "c0"
>
>
environments: <
key: "aoYJXQlDUdbeam:env:docker:v1"
value: <
urn: "beam:env:docker:v1"
payload: "\n apache/beam_java8_sdk:2.39.0.dev"
capabilities: "beam:coder:bytes:v1"
capabilities: "beam:coder:bool:v1"
capabilities: "beam:coder:varint:v1"
capabilities: "beam:coder:string_utf8:v1"
capabilities: "beam:coder:iterable:v1"
capabilities: "beam:coder:timer:v1"
capabilities: "beam:coder:kv:v1"
capabilities: "beam:coder:length_prefix:v1"
capabilities: "beam:coder:global_window:v1"
capabilities: "beam:coder:interval_window:v1"
capabilities: "beam:coder:custom_window:v1"
capabilities: "beam:coder:windowed_value:v1"
capabilities: "beam:coder:double:v1"
capabilities: "beam:coder:row:v1"
capabilities: "beam:coder:param_windowed_value:v1"
capabilities: "beam:coder:state_backed_iterable:v1"
capabilities: "beam:coder:sharded_key:v1"
capabilities: "beam:coder:nullable:v1"
capabilities: "beam:protocol:multi_core_bundle_processing:v1"
capabilities: "beam:protocol:progress_reporting:v1"
capabilities: "beam:protocol:harness_monitoring_infos:v1"
capabilities: "beam:protocol:control_request_elements_embedding:v1"
capabilities: "beam:protocol:state_caching:v1"
capabilities: "beam:version:sdk_base:apache/beam_java8_sdk:2.39.0.dev"
capabilities: "beam:transform:sdf_truncate_sized_restrictions:v1"
capabilities: "beam:transform:to_string:v1"
dependencies: <
type_urn: "beam:artifact:type:file:v1"
type_payload: "\nL/tmp/artifacts/icedtea-sound-ebvtNFkfFXg4aaYFuDnwKpwDSjzsaZqlqv5iKxPTr-U.jar\022@79bbed34591f15783869a605b839f02a9c034a3cec699aa5aafe622b13d3afe5"
role_urn: "beam:artifact:role:staging_to:v1"
role_payload: "\n=icedtea-sound-ebvtNFkfFXg4aaYFuDnwKpwDSjzsaZqlqv5iKxPTr-U.jar"
>
dependencies: <
type_urn: "beam:artifact:type:file:v1"
type_payload: "\nF/tmp/artifacts/jaccess-ULFTCPsb6cLYZ0f1BG1FQfczmHNaZCx8plXuRDKpBqE.jar\022@50b15308fb1be9c2d86747f5046d4541f73398735a642c7ca655ee4432a906a1"
role_urn: "beam:artifact:role:staging_to:v1"
role_payload: "\n7jaccess-ULFTCPsb6cLYZ0f1BG1FQfczmHNaZCx8plXuRDKpBqE.jar"
>
dependencies: <
type_urn: "beam:artifact:type:file:v1"
type_payload: "\nI/tmp/artifacts/localedata-dUHqyGxaTVCjfTI8MckPYarZ3_mwf62udkxaHi1aKns.jar\022@7541eac86c5a4d50a37d323c31c90f61aad9dff9b07fadae764c5a1e2d5a2a7b"
role_urn: "beam:artifact:role:staging_to:v1"
role_payload: "\n:localedata-dUHqyGxaTVCjfTI8MckPYarZ3_mwf62udkxaHi1aKns.jar"
>
dependencies: <
type_urn: "beam:artifact:type:file:v1"
type_payload: "\nF/tmp/artifacts/nashorn-XdUndQGroXOP9NCsfITpBERYcbbGXVHLjbvNWXCh-3A.jar\022@5dd5277501aba1738ff4d0ac7c84e904445871b6c65d51cb8dbbcd5970a1fb70"
role_urn: "beam:artifact:role:staging_to:v1"
role_payload: "\n7nashorn-XdUndQGroXOP9NCsfITpBERYcbbGXVHLjbvNWXCh-3A.jar"
>
dependencies: <
type_urn: "beam:artifact:type:file:v1"
type_payload: "\nG/tmp/artifacts/cldrdata-YqzuKX1QnLCOo0cwjKRdBhGrip_ltIJZg-APT60tUPA.jar\022@62acee297d509cb08ea347308ca45d0611ab8a9fe5b4825983e00f4fad2d50f0"
role_urn: "beam:artifact:role:staging_to:v1"
role_payload: "\n8cldrdata-YqzuKX1QnLCOo0cwjKRdBhGrip_ltIJZg-APT60tUPA.jar"
>
dependencies: <
type_urn: "beam:artifact:type:file:v1"
type_payload: "\nD/tmp/artifacts/dnsns-dhEp186udEF6X6chZus-RJzWRmzlccxx1_btlXWayVI.jar\022@761129d7ceae74417a5fa72166eb3e449cd6466ce571cc71d7f6ed95759ac952"
role_urn: "beam:artifact:role:staging_to:v1"
role_payload: "\n5dnsns-dhEp186udEF6X6chZus-RJzWRmzlccxx1_btlXWayVI.jar"
>
dependencies: <
type_urn: "beam:artifact:type:file:v1"
type_payload: "\nr/tmp/artifacts/beam-sdks-java-io-expansion-service-2.39.0-SNAPSHOT-WdCejIimKOpNkzCxX-1mqrIXkGjLM_FeeKFLyitKDgw.jar\022@59d09e8c88a628ea4d9330b15fed66aab2179068cb33f15e78a14bca2b4a0e0c"
role_urn: "beam:artifact:role:staging_to:v1"
role_payload: "\ncbeam-sdks-java-io-expansion-service-2.39.0-SNAPSHOT-WdCejIimKOpNkzCxX-1mqrIXkGjLM_FeeKFLyitKDgw.jar"
>
>
>
environments: <
key: "go"
value: <
urn: "beam:env:docker:v1"
payload: "\n\026apache/beam_go_sdk:dev"
capabilities: "beam:protocol:progress_reporting:v0"
capabilities: "beam:protocol:multi_core_bundle_processing:v1"
capabilities: "beam:version:sdk_base:go"
capabilities: "beam:coder:bytes:v1"
capabilities: "beam:coder:bool:v1"
capabilities: "beam:coder:varint:v1"
capabilities: "beam:coder:double:v1"
capabilities: "beam:coder:string_utf8:v1"
capabilities: "beam:coder:length_prefix:v1"
capabilities: "beam:coder:kv:v1"
capabilities: "beam:coder:iterable:v1"
capabilities: "beam:coder:state_backed_iterable:v1"
capabilities: "beam:coder:windowed_value:v1"
capabilities: "beam:coder:global_window:v1"
capabilities: "beam:coder:interval_window:v1"
capabilities: "beam:coder:row:v1"
capabilities: "beam:coder:nullable:v1"
dependencies: <
type_urn: "beam:artifact:type:file:v1"
role_urn: "beam:artifact:role:go_worker_binary:v1"
>
>
>
>
root_transform_ids: "e4"
root_transform_ids: "e5"
root_transform_ids: "s1"
root_transform_ids: "s3"
requirements: "beam:requirement:pardo:splittable_dofn:v1"
2022/04/16 05:57:23 Cross-compiling <https://ci-beam.apache.org/job/beam_PostCommit_XVR_Samza/ws/src/sdks/go/test/integration/io/xlang/kafka/kafka_test.go> as /tmp/worker-2-1650088643754377173
2022/04/16 05:57:25 Prepared job with id: go-testkafkaio_basicreadwrite_b8670b15-5675-4c57-8ff8-a5e299d2aa96 and staging token: go-testkafkaio_basicreadwrite_b8670b15-5675-4c57-8ff8-a5e299d2aa96
2022/04/16 05:57:25 Staged binary artifact with token:
2022/04/16 05:57:25 Submitted job: go0testkafkaio0basicreadwrite-jenkins-0416055725-d2701df4_ea990cc5-9990-4115-a973-b68c709df141
2022/04/16 05:57:25 Job state: STOPPED
2022/04/16 05:57:25 Job state: STARTING
2022/04/16 05:57:25 Job state: RUNNING
2022/04/16 05:57:35 Job state: DONE
--- PASS: TestKafkaIO_BasicReadWrite (28.59s)
PASS
ok github.com/apache/beam/sdks/v2/go/test/integration/io/xlang/kafka 34.617s
FAIL
> Task :runners:samza:job-server:validatesCrossLanguageRunnerGoUsingJava FAILED
> Task :runners:samza:job-server:validatesCrossLanguageRunnerJavaUsingJava
> Task :runners:samza:job-server:validatesCrossLanguageRunnerJavaUsingPython
> Task :runners:samza:job-server:validatesCrossLanguageRunnerJavaUsingPythonOnly
> Task :runners:samza:job-server:validatesCrossLanguageRunnerPythonUsingJava
> Task :runners:samza:job-server:validatesCrossLanguageRunnerPythonUsingPython
> Task :runners:samza:job-server:validatesCrossLanguageRunnerPythonUsingSql
> Task :runners:samza:job-server:validatesCrossLanguageRunnerCleanup
> Task :runners:samza:job-server:samzaJobServerCleanup
FAILURE: Build failed with an exception.
* Where:
Build file '<https://ci-beam.apache.org/job/beam_PostCommit_XVR_Samza/ws/src/sdks/go/test/build.gradle'> line: 195
* What went wrong:
Execution failed for task ':runners:samza:job-server:validatesCrossLanguageRunnerGoUsingJava'.
> Process 'command 'sh'' finished with non-zero exit value 1
* Try:
> Run with --stacktrace option to get the stack trace.
> Run with --info or --debug option to get more log output.
> Run with --scan to get full insights.
* Get more help at https://help.gradle.org
Deprecated Gradle features were used in this build, making it incompatible with Gradle 8.0.
You can use '--warning-mode all' to show the individual deprecation warnings and determine if they come from your own scripts or plugins.
See https://docs.gradle.org/7.4/userguide/command_line_interface.html#sec:command_line_warnings
Execution optimizations have been disabled for 1 invalid unit(s) of work during this build to ensure correctness.
Please consult deprecation warnings for more details.
BUILD FAILED in 33m 54s
246 actionable tasks: 163 executed, 72 from cache, 11 up-to-date
Publishing build scan...
https://gradle.com/s/bdly4u7p6k3ag
Build step 'Invoke Gradle script' changed build result to FAILURE
Build step 'Invoke Gradle script' marked build as failure
---------------------------------------------------------------------
To unsubscribe, e-mail: builds-unsubscribe@beam.apache.org
For additional commands, e-mail: builds-help@beam.apache.org
Build failed in Jenkins: beam_PostCommit_XVR_Samza #1062
Posted by Apache Jenkins Server <je...@builds.apache.org>.
See <https://ci-beam.apache.org/job/beam_PostCommit_XVR_Samza/1062/display/redirect?page=changes>
Changes:
[pandiana] BigQueryServicesImpl: reduce number of threads spawned by
[noreply] [BEAM-13204] Fix website bug where code tabs do not appear if the
------------------------------------------
[...truncated 959.35 KB...]
>
>
coders: <
key: "c4"
value: <
spec: <
urn: "beam:coder:kv:v1"
>
component_coder_ids: "c0"
component_coder_ids: "c0"
>
>
environments: <
key: "BycUATFEkkbeam:env:docker:v1"
value: <
urn: "beam:env:docker:v1"
payload: "\n apache/beam_java8_sdk:2.39.0.dev"
capabilities: "beam:coder:bytes:v1"
capabilities: "beam:coder:bool:v1"
capabilities: "beam:coder:varint:v1"
capabilities: "beam:coder:string_utf8:v1"
capabilities: "beam:coder:iterable:v1"
capabilities: "beam:coder:timer:v1"
capabilities: "beam:coder:kv:v1"
capabilities: "beam:coder:length_prefix:v1"
capabilities: "beam:coder:global_window:v1"
capabilities: "beam:coder:interval_window:v1"
capabilities: "beam:coder:custom_window:v1"
capabilities: "beam:coder:windowed_value:v1"
capabilities: "beam:coder:double:v1"
capabilities: "beam:coder:row:v1"
capabilities: "beam:coder:param_windowed_value:v1"
capabilities: "beam:coder:state_backed_iterable:v1"
capabilities: "beam:coder:sharded_key:v1"
capabilities: "beam:coder:nullable:v1"
capabilities: "beam:protocol:multi_core_bundle_processing:v1"
capabilities: "beam:protocol:progress_reporting:v1"
capabilities: "beam:protocol:harness_monitoring_infos:v1"
capabilities: "beam:protocol:control_request_elements_embedding:v1"
capabilities: "beam:protocol:state_caching:v1"
capabilities: "beam:version:sdk_base:apache/beam_java8_sdk:2.39.0.dev"
capabilities: "beam:transform:sdf_truncate_sized_restrictions:v1"
capabilities: "beam:transform:to_string:v1"
dependencies: <
type_urn: "beam:artifact:type:file:v1"
type_payload: "\nL/tmp/artifacts/icedtea-sound-ebvtNFkfFXg4aaYFuDnwKpwDSjzsaZqlqv5iKxPTr-U.jar\022@79bbed34591f15783869a605b839f02a9c034a3cec699aa5aafe622b13d3afe5"
role_urn: "beam:artifact:role:staging_to:v1"
role_payload: "\n=icedtea-sound-ebvtNFkfFXg4aaYFuDnwKpwDSjzsaZqlqv5iKxPTr-U.jar"
>
dependencies: <
type_urn: "beam:artifact:type:file:v1"
type_payload: "\nF/tmp/artifacts/jaccess-ULFTCPsb6cLYZ0f1BG1FQfczmHNaZCx8plXuRDKpBqE.jar\022@50b15308fb1be9c2d86747f5046d4541f73398735a642c7ca655ee4432a906a1"
role_urn: "beam:artifact:role:staging_to:v1"
role_payload: "\n7jaccess-ULFTCPsb6cLYZ0f1BG1FQfczmHNaZCx8plXuRDKpBqE.jar"
>
dependencies: <
type_urn: "beam:artifact:type:file:v1"
type_payload: "\nI/tmp/artifacts/localedata-dUHqyGxaTVCjfTI8MckPYarZ3_mwf62udkxaHi1aKns.jar\022@7541eac86c5a4d50a37d323c31c90f61aad9dff9b07fadae764c5a1e2d5a2a7b"
role_urn: "beam:artifact:role:staging_to:v1"
role_payload: "\n:localedata-dUHqyGxaTVCjfTI8MckPYarZ3_mwf62udkxaHi1aKns.jar"
>
dependencies: <
type_urn: "beam:artifact:type:file:v1"
type_payload: "\nF/tmp/artifacts/nashorn-XdUndQGroXOP9NCsfITpBERYcbbGXVHLjbvNWXCh-3A.jar\022@5dd5277501aba1738ff4d0ac7c84e904445871b6c65d51cb8dbbcd5970a1fb70"
role_urn: "beam:artifact:role:staging_to:v1"
role_payload: "\n7nashorn-XdUndQGroXOP9NCsfITpBERYcbbGXVHLjbvNWXCh-3A.jar"
>
dependencies: <
type_urn: "beam:artifact:type:file:v1"
type_payload: "\nG/tmp/artifacts/cldrdata-YqzuKX1QnLCOo0cwjKRdBhGrip_ltIJZg-APT60tUPA.jar\022@62acee297d509cb08ea347308ca45d0611ab8a9fe5b4825983e00f4fad2d50f0"
role_urn: "beam:artifact:role:staging_to:v1"
role_payload: "\n8cldrdata-YqzuKX1QnLCOo0cwjKRdBhGrip_ltIJZg-APT60tUPA.jar"
>
dependencies: <
type_urn: "beam:artifact:type:file:v1"
type_payload: "\nD/tmp/artifacts/dnsns-dhEp186udEF6X6chZus-RJzWRmzlccxx1_btlXWayVI.jar\022@761129d7ceae74417a5fa72166eb3e449cd6466ce571cc71d7f6ed95759ac952"
role_urn: "beam:artifact:role:staging_to:v1"
role_payload: "\n5dnsns-dhEp186udEF6X6chZus-RJzWRmzlccxx1_btlXWayVI.jar"
>
dependencies: <
type_urn: "beam:artifact:type:file:v1"
type_payload: "\nr/tmp/artifacts/beam-sdks-java-io-expansion-service-2.39.0-SNAPSHOT-WdCejIimKOpNkzCxX-1mqrIXkGjLM_FeeKFLyitKDgw.jar\022@59d09e8c88a628ea4d9330b15fed66aab2179068cb33f15e78a14bca2b4a0e0c"
role_urn: "beam:artifact:role:staging_to:v1"
role_payload: "\ncbeam-sdks-java-io-expansion-service-2.39.0-SNAPSHOT-WdCejIimKOpNkzCxX-1mqrIXkGjLM_FeeKFLyitKDgw.jar"
>
>
>
environments: <
key: "go"
value: <
urn: "beam:env:docker:v1"
payload: "\n\026apache/beam_go_sdk:dev"
capabilities: "beam:protocol:progress_reporting:v0"
capabilities: "beam:protocol:multi_core_bundle_processing:v1"
capabilities: "beam:version:sdk_base:go"
capabilities: "beam:coder:bytes:v1"
capabilities: "beam:coder:bool:v1"
capabilities: "beam:coder:varint:v1"
capabilities: "beam:coder:double:v1"
capabilities: "beam:coder:string_utf8:v1"
capabilities: "beam:coder:length_prefix:v1"
capabilities: "beam:coder:kv:v1"
capabilities: "beam:coder:iterable:v1"
capabilities: "beam:coder:state_backed_iterable:v1"
capabilities: "beam:coder:windowed_value:v1"
capabilities: "beam:coder:global_window:v1"
capabilities: "beam:coder:interval_window:v1"
capabilities: "beam:coder:row:v1"
capabilities: "beam:coder:nullable:v1"
dependencies: <
type_urn: "beam:artifact:type:file:v1"
role_urn: "beam:artifact:role:go_worker_binary:v1"
>
>
>
>
root_transform_ids: "s1"
root_transform_ids: "e4"
root_transform_ids: "e5"
root_transform_ids: "s3"
requirements: "beam:requirement:pardo:splittable_dofn:v1"
2022/04/15 23:56:26 Cross-compiling <https://ci-beam.apache.org/job/beam_PostCommit_XVR_Samza/ws/src/sdks/go/test/integration/io/xlang/kafka/kafka_test.go> as /tmp/worker-2-1650066986648451881
2022/04/15 23:56:28 Prepared job with id: go-testkafkaio_basicreadwrite_67b2804a-bb69-4f70-a3f5-d05779c1f52e and staging token: go-testkafkaio_basicreadwrite_67b2804a-bb69-4f70-a3f5-d05779c1f52e
2022/04/15 23:56:28 Staged binary artifact with token:
2022/04/15 23:56:28 Submitted job: go0testkafkaio0basicreadwrite-jenkins-0415235628-f271b834_69a6c657-ba73-4b94-8582-c4cea22c8c11
2022/04/15 23:56:28 Job state: STOPPED
2022/04/15 23:56:28 Job state: STARTING
2022/04/15 23:56:28 Job state: RUNNING
2022/04/15 23:56:39 Job state: DONE
--- PASS: TestKafkaIO_BasicReadWrite (29.25s)
PASS
ok github.com/apache/beam/sdks/v2/go/test/integration/io/xlang/kafka 35.284s
FAIL
$ TEST_EXIT_CODE=0
$ cd ../..
$ exit 1
$ exit 1
> Task :runners:samza:job-server:validatesCrossLanguageRunnerGoUsingJava FAILED
> Task :runners:samza:job-server:validatesCrossLanguageRunnerJavaUsingJava
> Task :runners:samza:job-server:validatesCrossLanguageRunnerJavaUsingPython
> Task :runners:samza:job-server:validatesCrossLanguageRunnerJavaUsingPythonOnly
> Task :runners:samza:job-server:validatesCrossLanguageRunnerPythonUsingJava
>>> RUNNING integration tests with pipeline options: --runner=PortableRunner --job_endpoint=localhost:34049 --environment_cache_millis=10000 --experiments=beam_fn_api
>>> pytest options:
>>> collect markers: -m=xlang_transforms
============================= test session starts ==============================
platform linux -- Python 3.6.15, pytest-4.6.11, py-1.11.0, pluggy-0.13.1
rootdir: <https://ci-beam.apache.org/job/beam_PostCommit_XVR_Samza/ws/src/sdks/python,> inifile: pytest.ini
plugins: xdist-1.34.0, timeout-1.4.2, forked-1.4.0, requests-mock-1.9.3
timeout: 600.0s
timeout method: signal
timeout func_only: False
collected 5316 items / 5306 deselected / 10 selected
apache_beam/io/external/generate_sequence_test.py ... [ 30%]
apache_beam/transforms/validate_runner_xlang_test.py ....... [100%]
=============================== warnings summary ===============================
apache_beam/io/filesystems_test.py:54
<https://ci-beam.apache.org/job/beam_PostCommit_XVR_Samza/ws/src/sdks/python/apache_beam/io/filesystems_test.py>:54: DeprecationWarning: invalid escape sequence \c
self.assertIsNone(FileSystems.get_scheme('c:\\abc\cdf')) # pylint: disable=anomalous-backslash-in-string
apache_beam/io/filesystems_test.py:62
<https://ci-beam.apache.org/job/beam_PostCommit_XVR_Samza/ws/src/sdks/python/apache_beam/io/filesystems_test.py>:62: DeprecationWarning: invalid escape sequence \d
self.assertTrue(isinstance(FileSystems.get_filesystem('c:\\abc\def'), # pylint: disable=anomalous-backslash-in-string
-- Docs: https://docs.pytest.org/en/latest/warnings.html
- generated xml file: <https://ci-beam.apache.org/job/beam_PostCommit_XVR_Samza/ws/src/sdks/python/pytest_xlangValidateRunner.xml> -
=========== 10 passed, 5306 deselected, 2 warnings in 124.38 seconds ===========
> Task :runners:samza:job-server:validatesCrossLanguageRunnerPythonUsingPython
>>> RUNNING integration tests with pipeline options: --runner=PortableRunner --job_endpoint=localhost:34049 --environment_cache_millis=10000 --experiments=beam_fn_api
>>> pytest options:
>>> collect markers: -m=xlang_transforms
============================= test session starts ==============================
platform linux -- Python 3.6.15, pytest-4.6.11, py-1.11.0, pluggy-0.13.1
rootdir: <https://ci-beam.apache.org/job/beam_PostCommit_XVR_Samza/ws/src/sdks/python,> inifile: pytest.ini
plugins: xdist-1.34.0, timeout-1.4.2, forked-1.4.0, requests-mock-1.9.3
timeout: 600.0s
timeout method: signal
timeout func_only: False
collected 5316 items / 5306 deselected / 10 selected
apache_beam/io/external/generate_sequence_test.py .ss [ 30%]
apache_beam/transforms/validate_runner_xlang_test.py ....... [100%]
- generated xml file: <https://ci-beam.apache.org/job/beam_PostCommit_XVR_Samza/ws/src/sdks/python/pytest_xlangValidateRunner.xml> -
============ 8 passed, 2 skipped, 5306 deselected in 67.48 seconds =============
> Task :runners:samza:job-server:validatesCrossLanguageRunnerPythonUsingSql
>>> RUNNING integration tests with pipeline options: --runner=PortableRunner --job_endpoint=localhost:34049 --environment_cache_millis=10000 --experiments=beam_fn_api
>>> pytest options:
>>> collect markers: -m=xlang_sql_expansion_service
============================= test session starts ==============================
platform linux -- Python 3.6.15, pytest-4.6.11, py-1.11.0, pluggy-0.13.1
rootdir: <https://ci-beam.apache.org/job/beam_PostCommit_XVR_Samza/ws/src/sdks/python,> inifile: pytest.ini
plugins: xdist-1.34.0, timeout-1.4.2, forked-1.4.0, requests-mock-1.9.3
timeout: 600.0s
timeout method: signal
timeout func_only: False
collected 5316 items / 5307 deselected / 9 selected
apache_beam/transforms/sql_test.py ......... [100%]
- generated xml file: <https://ci-beam.apache.org/job/beam_PostCommit_XVR_Samza/ws/src/sdks/python/pytest_xlangSqlValidateRunner.xml> -
================= 9 passed, 5307 deselected in 234.23 seconds ==================
> Task :runners:samza:job-server:validatesCrossLanguageRunnerCleanup
Stopping expansion service pid: 4190677.
Stopping expansion service pid: 4190678.
> Task :runners:samza:job-server:samzaJobServerCleanup
Stopping job server pid: 4166300.
FAILURE: Build failed with an exception.
* Where:
Build file '<https://ci-beam.apache.org/job/beam_PostCommit_XVR_Samza/ws/src/sdks/go/test/build.gradle'> line: 195
* What went wrong:
Execution failed for task ':runners:samza:job-server:validatesCrossLanguageRunnerGoUsingJava'.
> Process 'command 'sh'' finished with non-zero exit value 1
* Try:
> Run with --stacktrace option to get the stack trace.
> Run with --info or --debug option to get more log output.
> Run with --scan to get full insights.
* Get more help at https://help.gradle.org
Deprecated Gradle features were used in this build, making it incompatible with Gradle 8.0.
You can use '--warning-mode all' to show the individual deprecation warnings and determine if they come from your own scripts or plugins.
See https://docs.gradle.org/7.4/userguide/command_line_interface.html#sec:command_line_warnings
Execution optimizations have been disabled for 1 invalid unit(s) of work during this build to ensure correctness.
Please consult deprecation warnings for more details.
BUILD FAILED in 33m 29s
246 actionable tasks: 163 executed, 72 from cache, 11 up-to-date
Publishing build scan...
https://gradle.com/s/7ob4o7xdbareq
Build step 'Invoke Gradle script' changed build result to FAILURE
Build step 'Invoke Gradle script' marked build as failure
---------------------------------------------------------------------
To unsubscribe, e-mail: builds-unsubscribe@beam.apache.org
For additional commands, e-mail: builds-help@beam.apache.org
Build failed in Jenkins: beam_PostCommit_XVR_Samza #1061
Posted by Apache Jenkins Server <je...@builds.apache.org>.
See <https://ci-beam.apache.org/job/beam_PostCommit_XVR_Samza/1061/display/redirect>
Changes:
------------------------------------------
[...truncated 970.65 KB...]
>
>
>
coders: <
key: "esIMxwojxwVoidCoder"
value: <
spec: <
urn: "beam:coders:javasdk:0.1"
payload: "\202SNAPPY\000\000\000\000\001\000\000\000\001\000\000\000\210\326\001\350\254\355\000\005sr\000$org.apache.beam.sdk.coders.VoidCoder\271\277U\233\350\r\257U\002\000\000xr\000&j3\000\024Atomic\0055 \307\354\265\314\205tPF\002\0055\000*j5\000$Structured\0059\034s\277\022\016\325\3246\021\t9\000 j9\000\005/0C\335\325\211\256\274~\370\002\000\000xp"
>
>
>
environments: <
key: "esIMxwojxwbeam:env:docker:v1"
value: <
urn: "beam:env:docker:v1"
payload: "\n apache/beam_java8_sdk:2.39.0.dev"
capabilities: "beam:coder:bytes:v1"
capabilities: "beam:coder:bool:v1"
capabilities: "beam:coder:varint:v1"
capabilities: "beam:coder:string_utf8:v1"
capabilities: "beam:coder:iterable:v1"
capabilities: "beam:coder:timer:v1"
capabilities: "beam:coder:kv:v1"
capabilities: "beam:coder:length_prefix:v1"
capabilities: "beam:coder:global_window:v1"
capabilities: "beam:coder:interval_window:v1"
capabilities: "beam:coder:custom_window:v1"
capabilities: "beam:coder:windowed_value:v1"
capabilities: "beam:coder:double:v1"
capabilities: "beam:coder:row:v1"
capabilities: "beam:coder:param_windowed_value:v1"
capabilities: "beam:coder:state_backed_iterable:v1"
capabilities: "beam:coder:sharded_key:v1"
capabilities: "beam:coder:nullable:v1"
capabilities: "beam:protocol:multi_core_bundle_processing:v1"
capabilities: "beam:protocol:progress_reporting:v1"
capabilities: "beam:protocol:harness_monitoring_infos:v1"
capabilities: "beam:protocol:control_request_elements_embedding:v1"
capabilities: "beam:protocol:state_caching:v1"
capabilities: "beam:version:sdk_base:apache/beam_java8_sdk:2.39.0.dev"
capabilities: "beam:transform:sdf_truncate_sized_restrictions:v1"
capabilities: "beam:transform:to_string:v1"
dependencies: <
type_urn: "beam:artifact:type:file:v1"
type_payload: "\nL/tmp/artifacts/icedtea-sound-ebvtNFkfFXg4aaYFuDnwKpwDSjzsaZqlqv5iKxPTr-U.jar\022@79bbed34591f15783869a605b839f02a9c034a3cec699aa5aafe622b13d3afe5"
role_urn: "beam:artifact:role:staging_to:v1"
role_payload: "\n=icedtea-sound-ebvtNFkfFXg4aaYFuDnwKpwDSjzsaZqlqv5iKxPTr-U.jar"
>
dependencies: <
type_urn: "beam:artifact:type:file:v1"
type_payload: "\nF/tmp/artifacts/jaccess-ULFTCPsb6cLYZ0f1BG1FQfczmHNaZCx8plXuRDKpBqE.jar\022@50b15308fb1be9c2d86747f5046d4541f73398735a642c7ca655ee4432a906a1"
role_urn: "beam:artifact:role:staging_to:v1"
role_payload: "\n7jaccess-ULFTCPsb6cLYZ0f1BG1FQfczmHNaZCx8plXuRDKpBqE.jar"
>
dependencies: <
type_urn: "beam:artifact:type:file:v1"
type_payload: "\nI/tmp/artifacts/localedata-dUHqyGxaTVCjfTI8MckPYarZ3_mwf62udkxaHi1aKns.jar\022@7541eac86c5a4d50a37d323c31c90f61aad9dff9b07fadae764c5a1e2d5a2a7b"
role_urn: "beam:artifact:role:staging_to:v1"
role_payload: "\n:localedata-dUHqyGxaTVCjfTI8MckPYarZ3_mwf62udkxaHi1aKns.jar"
>
dependencies: <
type_urn: "beam:artifact:type:file:v1"
type_payload: "\nF/tmp/artifacts/nashorn-XdUndQGroXOP9NCsfITpBERYcbbGXVHLjbvNWXCh-3A.jar\022@5dd5277501aba1738ff4d0ac7c84e904445871b6c65d51cb8dbbcd5970a1fb70"
role_urn: "beam:artifact:role:staging_to:v1"
role_payload: "\n7nashorn-XdUndQGroXOP9NCsfITpBERYcbbGXVHLjbvNWXCh-3A.jar"
>
dependencies: <
type_urn: "beam:artifact:type:file:v1"
type_payload: "\nG/tmp/artifacts/cldrdata-YqzuKX1QnLCOo0cwjKRdBhGrip_ltIJZg-APT60tUPA.jar\022@62acee297d509cb08ea347308ca45d0611ab8a9fe5b4825983e00f4fad2d50f0"
role_urn: "beam:artifact:role:staging_to:v1"
role_payload: "\n8cldrdata-YqzuKX1QnLCOo0cwjKRdBhGrip_ltIJZg-APT60tUPA.jar"
>
dependencies: <
type_urn: "beam:artifact:type:file:v1"
type_payload: "\nD/tmp/artifacts/dnsns-dhEp186udEF6X6chZus-RJzWRmzlccxx1_btlXWayVI.jar\022@761129d7ceae74417a5fa72166eb3e449cd6466ce571cc71d7f6ed95759ac952"
role_urn: "beam:artifact:role:staging_to:v1"
role_payload: "\n5dnsns-dhEp186udEF6X6chZus-RJzWRmzlccxx1_btlXWayVI.jar"
>
dependencies: <
type_urn: "beam:artifact:type:file:v1"
type_payload: "\nr/tmp/artifacts/beam-sdks-java-io-expansion-service-2.39.0-SNAPSHOT-WdCejIimKOpNkzCxX-1mqrIXkGjLM_FeeKFLyitKDgw.jar\022@59d09e8c88a628ea4d9330b15fed66aab2179068cb33f15e78a14bca2b4a0e0c"
role_urn: "beam:artifact:role:staging_to:v1"
role_payload: "\ncbeam-sdks-java-io-expansion-service-2.39.0-SNAPSHOT-WdCejIimKOpNkzCxX-1mqrIXkGjLM_FeeKFLyitKDgw.jar"
>
>
>
environments: <
key: "go"
value: <
urn: "beam:env:docker:v1"
payload: "\n\026apache/beam_go_sdk:dev"
capabilities: "beam:protocol:progress_reporting:v0"
capabilities: "beam:protocol:multi_core_bundle_processing:v1"
capabilities: "beam:version:sdk_base:go"
capabilities: "beam:coder:bytes:v1"
capabilities: "beam:coder:bool:v1"
capabilities: "beam:coder:varint:v1"
capabilities: "beam:coder:double:v1"
capabilities: "beam:coder:string_utf8:v1"
capabilities: "beam:coder:length_prefix:v1"
capabilities: "beam:coder:kv:v1"
capabilities: "beam:coder:iterable:v1"
capabilities: "beam:coder:state_backed_iterable:v1"
capabilities: "beam:coder:windowed_value:v1"
capabilities: "beam:coder:global_window:v1"
capabilities: "beam:coder:interval_window:v1"
capabilities: "beam:coder:row:v1"
capabilities: "beam:coder:nullable:v1"
dependencies: <
type_urn: "beam:artifact:type:file:v1"
role_urn: "beam:artifact:role:go_worker_binary:v1"
>
>
>
>
root_transform_ids: "e4"
root_transform_ids: "e5"
root_transform_ids: "s1"
root_transform_ids: "s3"
requirements: "beam:requirement:pardo:splittable_dofn:v1"
2022/04/15 17:57:25 Cross-compiling <https://ci-beam.apache.org/job/beam_PostCommit_XVR_Samza/ws/src/sdks/go/test/integration/io/xlang/kafka/kafka_test.go> as /tmp/worker-2-1650045445312047744
2022/04/15 17:57:26 Prepared job with id: go-testkafkaio_basicreadwrite_95a63cdd-8f5c-4606-b543-997e89254f5e and staging token: go-testkafkaio_basicreadwrite_95a63cdd-8f5c-4606-b543-997e89254f5e
2022/04/15 17:57:27 Staged binary artifact with token:
2022/04/15 17:57:27 Submitted job: go0testkafkaio0basicreadwrite-jenkins-0415175727-f9f22653_c23f942f-cfac-4f54-a292-86fa4ecb872c
2022/04/15 17:57:27 Job state: STOPPED
2022/04/15 17:57:27 Job state: STARTING
2022/04/15 17:57:27 Job state: RUNNING
2022/04/15 17:57:37 Job state: DONE
--- PASS: TestKafkaIO_BasicReadWrite (28.53s)
PASS
ok github.com/apache/beam/sdks/v2/go/test/integration/io/xlang/kafka 34.579s
FAIL
$ TEST_EXIT_CODE=0
$ cd ../..
$ exit 1
$ exit 1
> Task :runners:samza:job-server:validatesCrossLanguageRunnerGoUsingJava FAILED
> Task :runners:samza:job-server:validatesCrossLanguageRunnerJavaUsingJava
> Task :runners:samza:job-server:validatesCrossLanguageRunnerJavaUsingPython
> Task :runners:samza:job-server:validatesCrossLanguageRunnerJavaUsingPythonOnly
> Task :runners:samza:job-server:validatesCrossLanguageRunnerPythonUsingJava
>>> RUNNING integration tests with pipeline options: --runner=PortableRunner --job_endpoint=localhost:33065 --environment_cache_millis=10000 --experiments=beam_fn_api
>>> pytest options:
>>> collect markers: -m=xlang_transforms
============================= test session starts ==============================
platform linux -- Python 3.6.15, pytest-4.6.11, py-1.11.0, pluggy-0.13.1
rootdir: <https://ci-beam.apache.org/job/beam_PostCommit_XVR_Samza/ws/src/sdks/python,> inifile: pytest.ini
plugins: xdist-1.34.0, timeout-1.4.2, forked-1.4.0, requests-mock-1.9.3
timeout: 600.0s
timeout method: signal
timeout func_only: False
collected 5316 items / 5306 deselected / 10 selected
apache_beam/io/external/generate_sequence_test.py ... [ 30%]
apache_beam/transforms/validate_runner_xlang_test.py ....... [100%]
=============================== warnings summary ===============================
apache_beam/io/filesystems_test.py:54
<https://ci-beam.apache.org/job/beam_PostCommit_XVR_Samza/ws/src/sdks/python/apache_beam/io/filesystems_test.py>:54: DeprecationWarning: invalid escape sequence \c
self.assertIsNone(FileSystems.get_scheme('c:\\abc\cdf')) # pylint: disable=anomalous-backslash-in-string
apache_beam/io/filesystems_test.py:62
<https://ci-beam.apache.org/job/beam_PostCommit_XVR_Samza/ws/src/sdks/python/apache_beam/io/filesystems_test.py>:62: DeprecationWarning: invalid escape sequence \d
self.assertTrue(isinstance(FileSystems.get_filesystem('c:\\abc\def'), # pylint: disable=anomalous-backslash-in-string
-- Docs: https://docs.pytest.org/en/latest/warnings.html
- generated xml file: <https://ci-beam.apache.org/job/beam_PostCommit_XVR_Samza/ws/src/sdks/python/pytest_xlangValidateRunner.xml> -
=========== 10 passed, 5306 deselected, 2 warnings in 110.35 seconds ===========
> Task :runners:samza:job-server:validatesCrossLanguageRunnerPythonUsingPython
>>> RUNNING integration tests with pipeline options: --runner=PortableRunner --job_endpoint=localhost:33065 --environment_cache_millis=10000 --experiments=beam_fn_api
>>> pytest options:
>>> collect markers: -m=xlang_transforms
============================= test session starts ==============================
platform linux -- Python 3.6.15, pytest-4.6.11, py-1.11.0, pluggy-0.13.1
rootdir: <https://ci-beam.apache.org/job/beam_PostCommit_XVR_Samza/ws/src/sdks/python,> inifile: pytest.ini
plugins: xdist-1.34.0, timeout-1.4.2, forked-1.4.0, requests-mock-1.9.3
timeout: 600.0s
timeout method: signal
timeout func_only: False
collected 5316 items / 5306 deselected / 10 selected
apache_beam/io/external/generate_sequence_test.py .ss [ 30%]
apache_beam/transforms/validate_runner_xlang_test.py ....... [100%]
- generated xml file: <https://ci-beam.apache.org/job/beam_PostCommit_XVR_Samza/ws/src/sdks/python/pytest_xlangValidateRunner.xml> -
============ 8 passed, 2 skipped, 5306 deselected in 58.18 seconds =============
> Task :runners:samza:job-server:validatesCrossLanguageRunnerPythonUsingSql
>>> RUNNING integration tests with pipeline options: --runner=PortableRunner --job_endpoint=localhost:33065 --environment_cache_millis=10000 --experiments=beam_fn_api
>>> pytest options:
>>> collect markers: -m=xlang_sql_expansion_service
============================= test session starts ==============================
platform linux -- Python 3.6.15, pytest-4.6.11, py-1.11.0, pluggy-0.13.1
rootdir: <https://ci-beam.apache.org/job/beam_PostCommit_XVR_Samza/ws/src/sdks/python,> inifile: pytest.ini
plugins: xdist-1.34.0, timeout-1.4.2, forked-1.4.0, requests-mock-1.9.3
timeout: 600.0s
timeout method: signal
timeout func_only: False
collected 5316 items / 5307 deselected / 9 selected
apache_beam/transforms/sql_test.py ......... [100%]
- generated xml file: <https://ci-beam.apache.org/job/beam_PostCommit_XVR_Samza/ws/src/sdks/python/pytest_xlangSqlValidateRunner.xml> -
================= 9 passed, 5307 deselected in 220.35 seconds ==================
> Task :runners:samza:job-server:validatesCrossLanguageRunnerCleanup
Stopping expansion service pid: 1884812.
Stopping expansion service pid: 1884813.
> Task :runners:samza:job-server:samzaJobServerCleanup
Stopping job server pid: 1877557.
FAILURE: Build failed with an exception.
* Where:
Build file '<https://ci-beam.apache.org/job/beam_PostCommit_XVR_Samza/ws/src/sdks/go/test/build.gradle'> line: 195
* What went wrong:
Execution failed for task ':runners:samza:job-server:validatesCrossLanguageRunnerGoUsingJava'.
> Process 'command 'sh'' finished with non-zero exit value 1
* Try:
> Run with --stacktrace option to get the stack trace.
> Run with --info or --debug option to get more log output.
> Run with --scan to get full insights.
* Get more help at https://help.gradle.org
Deprecated Gradle features were used in this build, making it incompatible with Gradle 8.0.
You can use '--warning-mode all' to show the individual deprecation warnings and determine if they come from your own scripts or plugins.
See https://docs.gradle.org/7.4/userguide/command_line_interface.html#sec:command_line_warnings
Execution optimizations have been disabled for 1 invalid unit(s) of work during this build to ensure correctness.
Please consult deprecation warnings for more details.
BUILD FAILED in 33m 13s
246 actionable tasks: 187 executed, 50 from cache, 9 up-to-date
Publishing build scan...
https://gradle.com/s/ednpgispfipnu
Build step 'Invoke Gradle script' changed build result to FAILURE
Build step 'Invoke Gradle script' marked build as failure
---------------------------------------------------------------------
To unsubscribe, e-mail: builds-unsubscribe@beam.apache.org
For additional commands, e-mail: builds-help@beam.apache.org
Build failed in Jenkins: beam_PostCommit_XVR_Samza #1060
Posted by Apache Jenkins Server <je...@builds.apache.org>.
See <https://ci-beam.apache.org/job/beam_PostCommit_XVR_Samza/1060/display/redirect>
Changes:
------------------------------------------
[...truncated 1.33 MB...]
>
coders: <
key: "mDeToJoVlrKvCoder3"
value: <
spec: <
urn: "beam:coder:kv:v1"
>
component_coder_ids: "mDeToJoVlrVarIntCoder"
component_coder_ids: "mDeToJoVlrTimestampedValueCoder"
>
>
coders: <
key: "mDeToJoVlrKvCoder4"
value: <
spec: <
urn: "beam:coder:kv:v1"
>
component_coder_ids: "mDeToJoVlrVarIntCoder"
component_coder_ids: "mDeToJoVlrIterableCoder"
>
>
coders: <
key: "mDeToJoVlrNullableCoder"
value: <
spec: <
urn: "beam:coder:nullable:v1"
>
component_coder_ids: "mDeToJoVlrByteArrayCoder"
>
>
coders: <
key: "mDeToJoVlrSerializableCoder"
value: <
spec: <
urn: "beam:coders:javasdk:0.1"
payload: "\202SNAPPY\000\000\000\000\001\000\000\000\001\000\000\000\312\241\002\360^\254\355\000\005sr\000,org.apache.beam.sdk.coders.SerializableCoder\010\364 \216\305ynl\002\000\001L\000\004typet\000\021Ljava/lang/Class;xr\000&ofV\000\024Custom\005P8j\260\010\235\013;\035\013\002\000\000xr\000 j\213\000\005/\034C\335\325\211\256\274~\370\001/\020pvr\000$N1\000\\io.BoundedSource!`v\023\177\370QA\0015\010r\000\035Z3\000\t,0\020\213\372\020Y\214\347\323\002\000\000xp"
>
>
>
coders: <
key: "mDeToJoVlrSerializableCoder1"
value: <
spec: <
urn: "beam:coders:javasdk:0.1"
payload: "\202SNAPPY\000\000\000\000\001\000\000\000\001\000\000\000\312\214\002\360^\254\355\000\005sr\000,org.apache.beam.sdk.coders.SerializableCoder\010\364 \216\305ynl\002\000\001L\000\004typet\000\021Ljava/lang/Class;xr\000&ofV\000\024Custom\005P8j\260\010\235\013;\035\013\002\000\000xr\000 j\213\000\005/\034C\335\325\211\256\274~\370\001/\020pvr\000;N1\000Pio.BoundedReadFromUnb\t\021`Source$Shardd\236\240U\205\000j\363\002\000\000xp"
>
>
>
coders: <
key: "mDeToJoVlrTimestampedValueCoder"
value: <
spec: <
urn: "beam:coders:javasdk:0.1"
payload: "\202SNAPPY\000\000\000\000\001\000\000\000\001\000\000\001?\315\003\270\254\355\000\005sr\000Aorg.apache.beam.sdk.values.TimestampedV\001\022\000$>\021\000LCoder\364\376\202p\274iX-\002\000\001L\000\nv\001)\005\030\034t\000\"Lorg/\t]\000/\001],/sdk/coders/\005$\020;xr\000*N\202\000\t%(.Structured\005/8s\277\022\016\325\3246\021\002\000\000xr\000 j9\000\005/\034C\335\325\211\256\274~\370\001/\020psr\000,j1\000(Serializabl\t\277\034\010\364 \216\305ynl\005\327\\\004typet\000\021Ljava/lang/Class\001\300\000&jV\000\024Custom\005\215Pj\260\010\235\013;\035\013\002\000\000xq\000~\000\003vr\000;N;\000Pio.BoundedReadFromUnb\t\021`Source$Shardd\236\240U\205\000j\363\002\000\000xp"
>
>
>
coders: <
key: "mDeToJoVlrValueWithRecordIdCoder"
value: <
spec: <
urn: "beam:coders:javasdk:0.1"
payload: "\202SNAPPY\000\000\000\000\001\000\000\000\001\000\000\001\213\311\005\320\254\355\000\005sr\000Corg.apache.beam.sdk.values.ValueWithRecordId$B\022\000LCoder{\343\376bQ\014\204>\002\000\002L\000\007i\t\025\034t\000+Lorg/\t\\\000/\001\\\024/sdk/c\0012(s/ByteArray\005B\014;L\000\n\005u\005\016\010t\000\"n;\000\005$\020;xr\000*N\274\000\t`(.Structured\005/8s\277\022\016\325\3246\021\002\000\000xr\000 j9\000\005/\034C\335\325\211\256\274~\370\001/\020psr\000)j1\0006\312\000\034\351\277\005|\263\3746\333\001:\010r\000&j8\000\024Atomic\005o\034\307\354\265\314\205tPF\0015 q\000~\000\003sr\000-N;\000$io.kafka.K\001\006\000R%\227\005B<I\320\251Y\032\341{#\002\000\001L\000\007kv\005\025\010t\000$nH\001\000K\t&\000;\025s\000\"Ns\000-P\r- j\000\275\271\035\243\3126\002!\353\010\010ke)\277\001\264\000\0022\303\001\005\022\025Y\000(jY\000\030Nullabl)\372\034E\333\0336>\220\247\007\005\307]\022.O\000\001\014,\006sq\000~\000\016q\000~\000\020"
>
>
>
coders: <
key: "mDeToJoVlrVarIntCoder"
value: <
spec: <
urn: "beam:coders:javasdk:0.1"
payload: "\202SNAPPY\000\000\000\000\001\000\000\000\001\000\000\000\210\330\001\350\254\355\000\005sr\000&org.apache.beam.sdk.coders.VarIntCoder\300K2\332\251KVh\002\000\000xrr5\000\024Atomic\0055 \307\354\265\314\205tPF\002\0055\000*jj\000$Structured\0059\034s\277\022\016\325\3246\021\t9\000 j9\000\005/0C\335\325\211\256\274~\370\002\000\000xp"
>
>
>
coders: <
key: "mDeToJoVlrVoidCoder"
value: <
spec: <
urn: "beam:coders:javasdk:0.1"
payload: "\202SNAPPY\000\000\000\000\001\000\000\000\001\000\000\000\210\326\001\350\254\355\000\005sr\000$org.apache.beam.sdk.coders.VoidCoder\271\277U\233\350\r\257U\002\000\000xr\000&j3\000\024Atomic\0055 \307\354\265\314\205tPF\002\0055\000*j5\000$Structured\0059\034s\277\022\016\325\3246\021\t9\000 j9\000\005/0C\335\325\211\256\274~\370\002\000\000xp"
>
>
>
environments: <
key: "go"
value: <
urn: "beam:env:docker:v1"
payload: "\n\026apache/beam_go_sdk:dev"
capabilities: "beam:protocol:progress_reporting:v0"
capabilities: "beam:protocol:multi_core_bundle_processing:v1"
capabilities: "beam:version:sdk_base:go"
capabilities: "beam:coder:bytes:v1"
capabilities: "beam:coder:bool:v1"
capabilities: "beam:coder:varint:v1"
capabilities: "beam:coder:double:v1"
capabilities: "beam:coder:string_utf8:v1"
capabilities: "beam:coder:length_prefix:v1"
capabilities: "beam:coder:kv:v1"
capabilities: "beam:coder:iterable:v1"
capabilities: "beam:coder:state_backed_iterable:v1"
capabilities: "beam:coder:windowed_value:v1"
capabilities: "beam:coder:global_window:v1"
capabilities: "beam:coder:interval_window:v1"
capabilities: "beam:coder:row:v1"
capabilities: "beam:coder:nullable:v1"
dependencies: <
type_urn: "beam:artifact:type:file:v1"
role_urn: "beam:artifact:role:go_worker_binary:v1"
>
>
>
environments: <
key: "mDeToJoVlrbeam:env:docker:v1"
value: <
urn: "beam:env:docker:v1"
payload: "\n apache/beam_java8_sdk:2.39.0.dev"
capabilities: "beam:coder:bytes:v1"
capabilities: "beam:coder:bool:v1"
capabilities: "beam:coder:varint:v1"
capabilities: "beam:coder:string_utf8:v1"
capabilities: "beam:coder:iterable:v1"
capabilities: "beam:coder:timer:v1"
capabilities: "beam:coder:kv:v1"
capabilities: "beam:coder:length_prefix:v1"
capabilities: "beam:coder:global_window:v1"
capabilities: "beam:coder:interval_window:v1"
capabilities: "beam:coder:custom_window:v1"
capabilities: "beam:coder:windowed_value:v1"
capabilities: "beam:coder:double:v1"
capabilities: "beam:coder:row:v1"
capabilities: "beam:coder:param_windowed_value:v1"
capabilities: "beam:coder:state_backed_iterable:v1"
capabilities: "beam:coder:sharded_key:v1"
capabilities: "beam:coder:nullable:v1"
capabilities: "beam:protocol:multi_core_bundle_processing:v1"
capabilities: "beam:protocol:progress_reporting:v1"
capabilities: "beam:protocol:harness_monitoring_infos:v1"
capabilities: "beam:protocol:control_request_elements_embedding:v1"
capabilities: "beam:protocol:state_caching:v1"
capabilities: "beam:version:sdk_base:apache/beam_java8_sdk:2.39.0.dev"
capabilities: "beam:transform:sdf_truncate_sized_restrictions:v1"
capabilities: "beam:transform:to_string:v1"
dependencies: <
type_urn: "beam:artifact:type:file:v1"
type_payload: "\nL/tmp/artifacts/icedtea-sound-ebvtNFkfFXg4aaYFuDnwKpwDSjzsaZqlqv5iKxPTr-U.jar\022@79bbed34591f15783869a605b839f02a9c034a3cec699aa5aafe622b13d3afe5"
role_urn: "beam:artifact:role:staging_to:v1"
role_payload: "\n=icedtea-sound-ebvtNFkfFXg4aaYFuDnwKpwDSjzsaZqlqv5iKxPTr-U.jar"
>
dependencies: <
type_urn: "beam:artifact:type:file:v1"
type_payload: "\nF/tmp/artifacts/jaccess-ULFTCPsb6cLYZ0f1BG1FQfczmHNaZCx8plXuRDKpBqE.jar\022@50b15308fb1be9c2d86747f5046d4541f73398735a642c7ca655ee4432a906a1"
role_urn: "beam:artifact:role:staging_to:v1"
role_payload: "\n7jaccess-ULFTCPsb6cLYZ0f1BG1FQfczmHNaZCx8plXuRDKpBqE.jar"
>
dependencies: <
type_urn: "beam:artifact:type:file:v1"
type_payload: "\nI/tmp/artifacts/localedata-dUHqyGxaTVCjfTI8MckPYarZ3_mwf62udkxaHi1aKns.jar\022@7541eac86c5a4d50a37d323c31c90f61aad9dff9b07fadae764c5a1e2d5a2a7b"
role_urn: "beam:artifact:role:staging_to:v1"
role_payload: "\n:localedata-dUHqyGxaTVCjfTI8MckPYarZ3_mwf62udkxaHi1aKns.jar"
>
dependencies: <
type_urn: "beam:artifact:type:file:v1"
type_payload: "\nF/tmp/artifacts/nashorn-XdUndQGroXOP9NCsfITpBERYcbbGXVHLjbvNWXCh-3A.jar\022@5dd5277501aba1738ff4d0ac7c84e904445871b6c65d51cb8dbbcd5970a1fb70"
role_urn: "beam:artifact:role:staging_to:v1"
role_payload: "\n7nashorn-XdUndQGroXOP9NCsfITpBERYcbbGXVHLjbvNWXCh-3A.jar"
>
dependencies: <
type_urn: "beam:artifact:type:file:v1"
type_payload: "\nG/tmp/artifacts/cldrdata-YqzuKX1QnLCOo0cwjKRdBhGrip_ltIJZg-APT60tUPA.jar\022@62acee297d509cb08ea347308ca45d0611ab8a9fe5b4825983e00f4fad2d50f0"
role_urn: "beam:artifact:role:staging_to:v1"
role_payload: "\n8cldrdata-YqzuKX1QnLCOo0cwjKRdBhGrip_ltIJZg-APT60tUPA.jar"
>
dependencies: <
type_urn: "beam:artifact:type:file:v1"
type_payload: "\nD/tmp/artifacts/dnsns-dhEp186udEF6X6chZus-RJzWRmzlccxx1_btlXWayVI.jar\022@761129d7ceae74417a5fa72166eb3e449cd6466ce571cc71d7f6ed95759ac952"
role_urn: "beam:artifact:role:staging_to:v1"
role_payload: "\n5dnsns-dhEp186udEF6X6chZus-RJzWRmzlccxx1_btlXWayVI.jar"
>
dependencies: <
type_urn: "beam:artifact:type:file:v1"
type_payload: "\nr/tmp/artifacts/beam-sdks-java-io-expansion-service-2.39.0-SNAPSHOT-WdCejIimKOpNkzCxX-1mqrIXkGjLM_FeeKFLyitKDgw.jar\022@59d09e8c88a628ea4d9330b15fed66aab2179068cb33f15e78a14bca2b4a0e0c"
role_urn: "beam:artifact:role:staging_to:v1"
role_payload: "\ncbeam-sdks-java-io-expansion-service-2.39.0-SNAPSHOT-WdCejIimKOpNkzCxX-1mqrIXkGjLM_FeeKFLyitKDgw.jar"
>
>
>
>
root_transform_ids: "s1"
root_transform_ids: "e4"
root_transform_ids: "e5"
root_transform_ids: "s3"
requirements: "beam:requirement:pardo:splittable_dofn:v1"
2022/04/15 11:57:05 Cross-compiling <https://ci-beam.apache.org/job/beam_PostCommit_XVR_Samza/ws/src/sdks/go/test/integration/io/xlang/kafka/kafka_test.go> as /tmp/worker-2-1650023825222686696
2022/04/15 11:57:06 Prepared job with id: go-testkafkaio_basicreadwrite_2088f624-7c0c-4e8a-94f0-964c21666e5c and staging token: go-testkafkaio_basicreadwrite_2088f624-7c0c-4e8a-94f0-964c21666e5c
2022/04/15 11:57:07 Staged binary artifact with token:
2022/04/15 11:57:07 Submitted job: go0testkafkaio0basicreadwrite-jenkins-0415115707-8282ebe_ef34f416-716c-471d-8548-d6c0407767c7
2022/04/15 11:57:07 Job state: STOPPED
2022/04/15 11:57:07 Job state: STARTING
2022/04/15 11:57:07 Job state: RUNNING
2022/04/15 11:57:16 Job state: DONE
--- PASS: TestKafkaIO_BasicReadWrite (26.85s)
PASS
ok github.com/apache/beam/sdks/v2/go/test/integration/io/xlang/kafka 32.875s
FAIL
> Task :runners:samza:job-server:validatesCrossLanguageRunnerGoUsingJava FAILED
> Task :runners:samza:job-server:validatesCrossLanguageRunnerJavaUsingJava
> Task :runners:samza:job-server:validatesCrossLanguageRunnerJavaUsingPython
> Task :runners:samza:job-server:validatesCrossLanguageRunnerJavaUsingPythonOnly
> Task :runners:samza:job-server:validatesCrossLanguageRunnerPythonUsingJava
> Task :runners:samza:job-server:validatesCrossLanguageRunnerPythonUsingPython
> Task :runners:samza:job-server:validatesCrossLanguageRunnerPythonUsingSql
> Task :runners:samza:job-server:validatesCrossLanguageRunnerCleanup
> Task :runners:samza:job-server:samzaJobServerCleanup
FAILURE: Build failed with an exception.
* Where:
Build file '<https://ci-beam.apache.org/job/beam_PostCommit_XVR_Samza/ws/src/sdks/go/test/build.gradle'> line: 195
* What went wrong:
Execution failed for task ':runners:samza:job-server:validatesCrossLanguageRunnerGoUsingJava'.
> Process 'command 'sh'' finished with non-zero exit value 1
* Try:
> Run with --stacktrace option to get the stack trace.
> Run with --info or --debug option to get more log output.
> Run with --scan to get full insights.
* Get more help at https://help.gradle.org
Deprecated Gradle features were used in this build, making it incompatible with Gradle 8.0.
You can use '--warning-mode all' to show the individual deprecation warnings and determine if they come from your own scripts or plugins.
See https://docs.gradle.org/7.4/userguide/command_line_interface.html#sec:command_line_warnings
Execution optimizations have been disabled for 1 invalid unit(s) of work during this build to ensure correctness.
Please consult deprecation warnings for more details.
BUILD FAILED in 33m 1s
246 actionable tasks: 163 executed, 72 from cache, 11 up-to-date
Publishing build scan...
https://gradle.com/s/qr22qifrzkvmk
Build step 'Invoke Gradle script' changed build result to FAILURE
Build step 'Invoke Gradle script' marked build as failure
---------------------------------------------------------------------
To unsubscribe, e-mail: builds-unsubscribe@beam.apache.org
For additional commands, e-mail: builds-help@beam.apache.org
Build failed in Jenkins: beam_PostCommit_XVR_Samza #1059
Posted by Apache Jenkins Server <je...@builds.apache.org>.
See <https://ci-beam.apache.org/job/beam_PostCommit_XVR_Samza/1059/display/redirect?page=changes>
Changes:
[noreply] Merge pull request #17375: [BEAM-8691] Declare newer
------------------------------------------
[...truncated 948.89 KB...]
>
coders: <
key: "psBolFjrHqKvCoder3"
value: <
spec: <
urn: "beam:coder:kv:v1"
>
component_coder_ids: "psBolFjrHqVarIntCoder"
component_coder_ids: "psBolFjrHqTimestampedValueCoder"
>
>
coders: <
key: "psBolFjrHqKvCoder4"
value: <
spec: <
urn: "beam:coder:kv:v1"
>
component_coder_ids: "psBolFjrHqVarIntCoder"
component_coder_ids: "psBolFjrHqIterableCoder"
>
>
coders: <
key: "psBolFjrHqNullableCoder"
value: <
spec: <
urn: "beam:coder:nullable:v1"
>
component_coder_ids: "psBolFjrHqByteArrayCoder"
>
>
coders: <
key: "psBolFjrHqSerializableCoder"
value: <
spec: <
urn: "beam:coders:javasdk:0.1"
payload: "\202SNAPPY\000\000\000\000\001\000\000\000\001\000\000\000\312\241\002\360^\254\355\000\005sr\000,org.apache.beam.sdk.coders.SerializableCoder\010\364 \216\305ynl\002\000\001L\000\004typet\000\021Ljava/lang/Class;xr\000&ofV\000\024Custom\005P8j\260\010\235\013;\035\013\002\000\000xr\000 j\213\000\005/\034C\335\325\211\256\274~\370\001/\020pvr\000$N1\000\\io.BoundedSource!`v\023\177\370QA\0015\010r\000\035Z3\000\t,0\020\213\372\020Y\214\347\323\002\000\000xp"
>
>
>
coders: <
key: "psBolFjrHqSerializableCoder1"
value: <
spec: <
urn: "beam:coders:javasdk:0.1"
payload: "\202SNAPPY\000\000\000\000\001\000\000\000\001\000\000\000\312\214\002\360^\254\355\000\005sr\000,org.apache.beam.sdk.coders.SerializableCoder\010\364 \216\305ynl\002\000\001L\000\004typet\000\021Ljava/lang/Class;xr\000&ofV\000\024Custom\005P8j\260\010\235\013;\035\013\002\000\000xr\000 j\213\000\005/\034C\335\325\211\256\274~\370\001/\020pvr\000;N1\000Pio.BoundedReadFromUnb\t\021`Source$Shardd\236\240U\205\000j\363\002\000\000xp"
>
>
>
coders: <
key: "psBolFjrHqTimestampedValueCoder"
value: <
spec: <
urn: "beam:coders:javasdk:0.1"
payload: "\202SNAPPY\000\000\000\000\001\000\000\000\001\000\000\001?\315\003\270\254\355\000\005sr\000Aorg.apache.beam.sdk.values.TimestampedV\001\022\000$>\021\000LCoder\364\376\202p\274iX-\002\000\001L\000\nv\001)\005\030\034t\000\"Lorg/\t]\000/\001],/sdk/coders/\005$\020;xr\000*N\202\000\t%(.Structured\005/8s\277\022\016\325\3246\021\002\000\000xr\000 j9\000\005/\034C\335\325\211\256\274~\370\001/\020psr\000,j1\000(Serializabl\t\277\034\010\364 \216\305ynl\005\327\\\004typet\000\021Ljava/lang/Class\001\300\000&jV\000\024Custom\005\215Pj\260\010\235\013;\035\013\002\000\000xq\000~\000\003vr\000;N;\000Pio.BoundedReadFromUnb\t\021`Source$Shardd\236\240U\205\000j\363\002\000\000xp"
>
>
>
coders: <
key: "psBolFjrHqValueWithRecordIdCoder"
value: <
spec: <
urn: "beam:coders:javasdk:0.1"
payload: "\202SNAPPY\000\000\000\000\001\000\000\000\001\000\000\001\213\311\005\320\254\355\000\005sr\000Corg.apache.beam.sdk.values.ValueWithRecordId$B\022\000LCoder{\343\376bQ\014\204>\002\000\002L\000\007i\t\025\034t\000+Lorg/\t\\\000/\001\\\024/sdk/c\0012(s/ByteArray\005B\014;L\000\n\005u\005\016\010t\000\"n;\000\005$\020;xr\000*N\274\000\t`(.Structured\005/8s\277\022\016\325\3246\021\002\000\000xr\000 j9\000\005/\034C\335\325\211\256\274~\370\001/\020psr\000)j1\0006\312\000\034\351\277\005|\263\3746\333\001:\010r\000&j8\000\024Atomic\005o\034\307\354\265\314\205tPF\0015 q\000~\000\003sr\000-N;\000$io.kafka.K\001\006\000R%\227\005B<I\320\251Y\032\341{#\002\000\001L\000\007kv\005\025\010t\000$nH\001\000K\t&\000;\025s\000\"Ns\000-P\r- j\000\275\271\035\243\3126\002!\353\010\010ke)\277\001\264\000\0022\303\001\005\022\025Y\000(jY\000\030Nullabl)\372\034E\333\0336>\220\247\007\005\307]\022.O\000\001\014,\006sq\000~\000\016q\000~\000\020"
>
>
>
coders: <
key: "psBolFjrHqVarIntCoder"
value: <
spec: <
urn: "beam:coders:javasdk:0.1"
payload: "\202SNAPPY\000\000\000\000\001\000\000\000\001\000\000\000\210\330\001\350\254\355\000\005sr\000&org.apache.beam.sdk.coders.VarIntCoder\300K2\332\251KVh\002\000\000xrr5\000\024Atomic\0055 \307\354\265\314\205tPF\002\0055\000*jj\000$Structured\0059\034s\277\022\016\325\3246\021\t9\000 j9\000\005/0C\335\325\211\256\274~\370\002\000\000xp"
>
>
>
coders: <
key: "psBolFjrHqVoidCoder"
value: <
spec: <
urn: "beam:coders:javasdk:0.1"
payload: "\202SNAPPY\000\000\000\000\001\000\000\000\001\000\000\000\210\326\001\350\254\355\000\005sr\000$org.apache.beam.sdk.coders.VoidCoder\271\277U\233\350\r\257U\002\000\000xr\000&j3\000\024Atomic\0055 \307\354\265\314\205tPF\002\0055\000*j5\000$Structured\0059\034s\277\022\016\325\3246\021\t9\000 j9\000\005/0C\335\325\211\256\274~\370\002\000\000xp"
>
>
>
environments: <
key: "go"
value: <
urn: "beam:env:docker:v1"
payload: "\n\026apache/beam_go_sdk:dev"
capabilities: "beam:protocol:progress_reporting:v0"
capabilities: "beam:protocol:multi_core_bundle_processing:v1"
capabilities: "beam:version:sdk_base:go"
capabilities: "beam:coder:bytes:v1"
capabilities: "beam:coder:bool:v1"
capabilities: "beam:coder:varint:v1"
capabilities: "beam:coder:double:v1"
capabilities: "beam:coder:string_utf8:v1"
capabilities: "beam:coder:length_prefix:v1"
capabilities: "beam:coder:kv:v1"
capabilities: "beam:coder:iterable:v1"
capabilities: "beam:coder:state_backed_iterable:v1"
capabilities: "beam:coder:windowed_value:v1"
capabilities: "beam:coder:global_window:v1"
capabilities: "beam:coder:interval_window:v1"
capabilities: "beam:coder:row:v1"
capabilities: "beam:coder:nullable:v1"
dependencies: <
type_urn: "beam:artifact:type:file:v1"
role_urn: "beam:artifact:role:go_worker_binary:v1"
>
>
>
environments: <
key: "psBolFjrHqbeam:env:docker:v1"
value: <
urn: "beam:env:docker:v1"
payload: "\n apache/beam_java8_sdk:2.39.0.dev"
capabilities: "beam:coder:bytes:v1"
capabilities: "beam:coder:bool:v1"
capabilities: "beam:coder:varint:v1"
capabilities: "beam:coder:string_utf8:v1"
capabilities: "beam:coder:iterable:v1"
capabilities: "beam:coder:timer:v1"
capabilities: "beam:coder:kv:v1"
capabilities: "beam:coder:length_prefix:v1"
capabilities: "beam:coder:global_window:v1"
capabilities: "beam:coder:interval_window:v1"
capabilities: "beam:coder:custom_window:v1"
capabilities: "beam:coder:windowed_value:v1"
capabilities: "beam:coder:double:v1"
capabilities: "beam:coder:row:v1"
capabilities: "beam:coder:param_windowed_value:v1"
capabilities: "beam:coder:state_backed_iterable:v1"
capabilities: "beam:coder:sharded_key:v1"
capabilities: "beam:coder:nullable:v1"
capabilities: "beam:protocol:multi_core_bundle_processing:v1"
capabilities: "beam:protocol:progress_reporting:v1"
capabilities: "beam:protocol:harness_monitoring_infos:v1"
capabilities: "beam:protocol:control_request_elements_embedding:v1"
capabilities: "beam:protocol:state_caching:v1"
capabilities: "beam:version:sdk_base:apache/beam_java8_sdk:2.39.0.dev"
capabilities: "beam:transform:sdf_truncate_sized_restrictions:v1"
capabilities: "beam:transform:to_string:v1"
dependencies: <
type_urn: "beam:artifact:type:file:v1"
type_payload: "\nL/tmp/artifacts/icedtea-sound-ebvtNFkfFXg4aaYFuDnwKpwDSjzsaZqlqv5iKxPTr-U.jar\022@79bbed34591f15783869a605b839f02a9c034a3cec699aa5aafe622b13d3afe5"
role_urn: "beam:artifact:role:staging_to:v1"
role_payload: "\n=icedtea-sound-ebvtNFkfFXg4aaYFuDnwKpwDSjzsaZqlqv5iKxPTr-U.jar"
>
dependencies: <
type_urn: "beam:artifact:type:file:v1"
type_payload: "\nF/tmp/artifacts/jaccess-ULFTCPsb6cLYZ0f1BG1FQfczmHNaZCx8plXuRDKpBqE.jar\022@50b15308fb1be9c2d86747f5046d4541f73398735a642c7ca655ee4432a906a1"
role_urn: "beam:artifact:role:staging_to:v1"
role_payload: "\n7jaccess-ULFTCPsb6cLYZ0f1BG1FQfczmHNaZCx8plXuRDKpBqE.jar"
>
dependencies: <
type_urn: "beam:artifact:type:file:v1"
type_payload: "\nI/tmp/artifacts/localedata-dUHqyGxaTVCjfTI8MckPYarZ3_mwf62udkxaHi1aKns.jar\022@7541eac86c5a4d50a37d323c31c90f61aad9dff9b07fadae764c5a1e2d5a2a7b"
role_urn: "beam:artifact:role:staging_to:v1"
role_payload: "\n:localedata-dUHqyGxaTVCjfTI8MckPYarZ3_mwf62udkxaHi1aKns.jar"
>
dependencies: <
type_urn: "beam:artifact:type:file:v1"
type_payload: "\nF/tmp/artifacts/nashorn-XdUndQGroXOP9NCsfITpBERYcbbGXVHLjbvNWXCh-3A.jar\022@5dd5277501aba1738ff4d0ac7c84e904445871b6c65d51cb8dbbcd5970a1fb70"
role_urn: "beam:artifact:role:staging_to:v1"
role_payload: "\n7nashorn-XdUndQGroXOP9NCsfITpBERYcbbGXVHLjbvNWXCh-3A.jar"
>
dependencies: <
type_urn: "beam:artifact:type:file:v1"
type_payload: "\nG/tmp/artifacts/cldrdata-YqzuKX1QnLCOo0cwjKRdBhGrip_ltIJZg-APT60tUPA.jar\022@62acee297d509cb08ea347308ca45d0611ab8a9fe5b4825983e00f4fad2d50f0"
role_urn: "beam:artifact:role:staging_to:v1"
role_payload: "\n8cldrdata-YqzuKX1QnLCOo0cwjKRdBhGrip_ltIJZg-APT60tUPA.jar"
>
dependencies: <
type_urn: "beam:artifact:type:file:v1"
type_payload: "\nD/tmp/artifacts/dnsns-dhEp186udEF6X6chZus-RJzWRmzlccxx1_btlXWayVI.jar\022@761129d7ceae74417a5fa72166eb3e449cd6466ce571cc71d7f6ed95759ac952"
role_urn: "beam:artifact:role:staging_to:v1"
role_payload: "\n5dnsns-dhEp186udEF6X6chZus-RJzWRmzlccxx1_btlXWayVI.jar"
>
dependencies: <
type_urn: "beam:artifact:type:file:v1"
type_payload: "\nr/tmp/artifacts/beam-sdks-java-io-expansion-service-2.39.0-SNAPSHOT-WdCejIimKOpNkzCxX-1mqrIXkGjLM_FeeKFLyitKDgw.jar\022@59d09e8c88a628ea4d9330b15fed66aab2179068cb33f15e78a14bca2b4a0e0c"
role_urn: "beam:artifact:role:staging_to:v1"
role_payload: "\ncbeam-sdks-java-io-expansion-service-2.39.0-SNAPSHOT-WdCejIimKOpNkzCxX-1mqrIXkGjLM_FeeKFLyitKDgw.jar"
>
>
>
>
root_transform_ids: "e4"
root_transform_ids: "s1"
root_transform_ids: "e5"
root_transform_ids: "s3"
requirements: "beam:requirement:pardo:splittable_dofn:v1"
2022/04/15 05:57:05 Cross-compiling <https://ci-beam.apache.org/job/beam_PostCommit_XVR_Samza/ws/src/sdks/go/test/integration/io/xlang/kafka/kafka_test.go> as /tmp/worker-2-1650002225858210825
2022/04/15 05:57:07 Prepared job with id: go-testkafkaio_basicreadwrite_8f535f81-8214-4386-a437-80d785a9bbc2 and staging token: go-testkafkaio_basicreadwrite_8f535f81-8214-4386-a437-80d785a9bbc2
2022/04/15 05:57:07 Staged binary artifact with token:
2022/04/15 05:57:07 Submitted job: go0testkafkaio0basicreadwrite-jenkins-0415055707-57f43645_c8fd2146-f2fd-400e-aa97-d5a3abc504e2
2022/04/15 05:57:07 Job state: STOPPED
2022/04/15 05:57:07 Job state: STARTING
2022/04/15 05:57:07 Job state: RUNNING
2022/04/15 05:57:17 Job state: DONE
--- PASS: TestKafkaIO_BasicReadWrite (27.04s)
PASS
ok github.com/apache/beam/sdks/v2/go/test/integration/io/xlang/kafka 33.065s
FAIL
> Task :runners:samza:job-server:validatesCrossLanguageRunnerGoUsingJava FAILED
> Task :runners:samza:job-server:validatesCrossLanguageRunnerJavaUsingJava
> Task :runners:samza:job-server:validatesCrossLanguageRunnerJavaUsingPython
> Task :runners:samza:job-server:validatesCrossLanguageRunnerJavaUsingPythonOnly
> Task :runners:samza:job-server:validatesCrossLanguageRunnerPythonUsingJava
> Task :runners:samza:job-server:validatesCrossLanguageRunnerPythonUsingPython
> Task :runners:samza:job-server:validatesCrossLanguageRunnerPythonUsingSql
> Task :runners:samza:job-server:validatesCrossLanguageRunnerCleanup
> Task :runners:samza:job-server:samzaJobServerCleanup
FAILURE: Build failed with an exception.
* Where:
Build file '<https://ci-beam.apache.org/job/beam_PostCommit_XVR_Samza/ws/src/sdks/go/test/build.gradle'> line: 195
* What went wrong:
Execution failed for task ':runners:samza:job-server:validatesCrossLanguageRunnerGoUsingJava'.
> Process 'command 'sh'' finished with non-zero exit value 1
* Try:
> Run with --stacktrace option to get the stack trace.
> Run with --info or --debug option to get more log output.
> Run with --scan to get full insights.
* Get more help at https://help.gradle.org
Deprecated Gradle features were used in this build, making it incompatible with Gradle 8.0.
You can use '--warning-mode all' to show the individual deprecation warnings and determine if they come from your own scripts or plugins.
See https://docs.gradle.org/7.4/userguide/command_line_interface.html#sec:command_line_warnings
Execution optimizations have been disabled for 1 invalid unit(s) of work during this build to ensure correctness.
Please consult deprecation warnings for more details.
BUILD FAILED in 33m 12s
246 actionable tasks: 169 executed, 66 from cache, 11 up-to-date
Publishing build scan...
https://gradle.com/s/kwhh25zmzorbi
Build step 'Invoke Gradle script' changed build result to FAILURE
Build step 'Invoke Gradle script' marked build as failure
---------------------------------------------------------------------
To unsubscribe, e-mail: builds-unsubscribe@beam.apache.org
For additional commands, e-mail: builds-help@beam.apache.org
Build failed in Jenkins: beam_PostCommit_XVR_Samza #1058
Posted by Apache Jenkins Server <je...@builds.apache.org>.
See <https://ci-beam.apache.org/job/beam_PostCommit_XVR_Samza/1058/display/redirect?page=changes>
Changes:
[Kenneth Knowles] Upgrade to Gradle 7.4
[Kenneth Knowles] Remove Python module dependency on Dataflow worker
[noreply] Respect output coder for TextIO. (#17367)
[noreply] Merge pull request #17200 from [BEAM-12164]: fix the autoscaling backlog
[noreply] [BEAM-17035] Call python3 directly when it is available. (#17366)
------------------------------------------
[...truncated 960.54 KB...]
payload: "\202SNAPPY\000\000\000\000\001\000\000\000\001\000\000\000\312\214\002\360^\254\355\000\005sr\000,org.apache.beam.sdk.coders.SerializableCoder\010\364 \216\305ynl\002\000\001L\000\004typet\000\021Ljava/lang/Class;xr\000&ofV\000\024Custom\005P8j\260\010\235\013;\035\013\002\000\000xr\000 j\213\000\005/\034C\335\325\211\256\274~\370\001/\020pvr\000;N1\000Pio.BoundedReadFromUnb\t\021`Source$Shardd\236\240U\205\000j\363\002\000\000xp"
>
>
>
coders: <
key: "ORfjLnxWXSTimestampedValueCoder"
value: <
spec: <
urn: "beam:coders:javasdk:0.1"
payload: "\202SNAPPY\000\000\000\000\001\000\000\000\001\000\000\001?\315\003\270\254\355\000\005sr\000Aorg.apache.beam.sdk.values.TimestampedV\001\022\000$>\021\000LCoder\364\376\202p\274iX-\002\000\001L\000\nv\001)\005\030\034t\000\"Lorg/\t]\000/\001],/sdk/coders/\005$\020;xr\000*N\202\000\t%(.Structured\005/8s\277\022\016\325\3246\021\002\000\000xr\000 j9\000\005/\034C\335\325\211\256\274~\370\001/\020psr\000,j1\000(Serializabl\t\277\034\010\364 \216\305ynl\005\327\\\004typet\000\021Ljava/lang/Class\001\300\000&jV\000\024Custom\005\215Pj\260\010\235\013;\035\013\002\000\000xq\000~\000\003vr\000;N;\000Pio.BoundedReadFromUnb\t\021`Source$Shardd\236\240U\205\000j\363\002\000\000xp"
>
>
>
coders: <
key: "ORfjLnxWXSValueWithRecordIdCoder"
value: <
spec: <
urn: "beam:coders:javasdk:0.1"
payload: "\202SNAPPY\000\000\000\000\001\000\000\000\001\000\000\001\213\311\005\320\254\355\000\005sr\000Corg.apache.beam.sdk.values.ValueWithRecordId$B\022\000LCoder{\343\376bQ\014\204>\002\000\002L\000\007i\t\025\034t\000+Lorg/\t\\\000/\001\\\024/sdk/c\0012(s/ByteArray\005B\014;L\000\n\005u\005\016\010t\000\"n;\000\005$\020;xr\000*N\274\000\t`(.Structured\005/8s\277\022\016\325\3246\021\002\000\000xr\000 j9\000\005/\034C\335\325\211\256\274~\370\001/\020psr\000)j1\0006\312\000\034\351\277\005|\263\3746\333\001:\010r\000&j8\000\024Atomic\005o\034\307\354\265\314\205tPF\0015 q\000~\000\003sr\000-N;\000$io.kafka.K\001\006\000R%\227\005B<I\320\251Y\032\341{#\002\000\001L\000\007kv\005\025\010t\000$nH\001\000K\t&\000;\025s\000\"Ns\000-P\r- j\000\275\271\035\243\3126\002!\353\010\010ke)\277\001\264\000\0022\303\001\005\022\025Y\000(jY\000\030Nullabl)\372\034E\333\0336>\220\247\007\005\307]\022.O\000\001\014,\006sq\000~\000\016q\000~\000\020"
>
>
>
coders: <
key: "ORfjLnxWXSVarIntCoder"
value: <
spec: <
urn: "beam:coders:javasdk:0.1"
payload: "\202SNAPPY\000\000\000\000\001\000\000\000\001\000\000\000\210\330\001\350\254\355\000\005sr\000&org.apache.beam.sdk.coders.VarIntCoder\300K2\332\251KVh\002\000\000xrr5\000\024Atomic\0055 \307\354\265\314\205tPF\002\0055\000*jj\000$Structured\0059\034s\277\022\016\325\3246\021\t9\000 j9\000\005/0C\335\325\211\256\274~\370\002\000\000xp"
>
>
>
coders: <
key: "ORfjLnxWXSVoidCoder"
value: <
spec: <
urn: "beam:coders:javasdk:0.1"
payload: "\202SNAPPY\000\000\000\000\001\000\000\000\001\000\000\000\210\326\001\350\254\355\000\005sr\000$org.apache.beam.sdk.coders.VoidCoder\271\277U\233\350\r\257U\002\000\000xr\000&j3\000\024Atomic\0055 \307\354\265\314\205tPF\002\0055\000*j5\000$Structured\0059\034s\277\022\016\325\3246\021\t9\000 j9\000\005/0C\335\325\211\256\274~\370\002\000\000xp"
>
>
>
coders: <
key: "c0"
value: <
spec: <
urn: "beam:coder:bytes:v1"
>
>
>
coders: <
key: "c1"
value: <
spec: <
urn: "beam:coder:global_window:v1"
>
>
>
coders: <
key: "c2"
value: <
spec: <
urn: "beam:go:coder:custom:v1"
payload: "Cgd2YXJpbnR6EgIIAhpdCklnaXRodWIuY29tL2FwYWNoZS9iZWFtL3Nka3MvdjIvZ28vcGtnL2JlYW0vY29yZS9ydW50aW1lL2NvZGVyeC5lbmNWYXJJbnRaEhAIFiIECBlADyoGCBQSAggIImkKSWdpdGh1Yi5jb20vYXBhY2hlL2JlYW0vc2Rrcy92Mi9nby9wa2cvYmVhbS9jb3JlL3J1bnRpbWUvY29kZXJ4LmRlY1ZhckludFoSHAgWIgQIGUADIgYIFBICCAgqBAgZQA8qBAgZQAE="
>
>
>
coders: <
key: "c3"
value: <
spec: <
urn: "beam:coder:length_prefix:v1"
>
component_coder_ids: "c2"
>
>
coders: <
key: "c4"
value: <
spec: <
urn: "beam:coder:kv:v1"
>
component_coder_ids: "c0"
component_coder_ids: "c0"
>
>
environments: <
key: "ORfjLnxWXSbeam:env:docker:v1"
value: <
urn: "beam:env:docker:v1"
payload: "\n apache/beam_java8_sdk:2.39.0.dev"
capabilities: "beam:coder:bytes:v1"
capabilities: "beam:coder:bool:v1"
capabilities: "beam:coder:varint:v1"
capabilities: "beam:coder:string_utf8:v1"
capabilities: "beam:coder:iterable:v1"
capabilities: "beam:coder:timer:v1"
capabilities: "beam:coder:kv:v1"
capabilities: "beam:coder:length_prefix:v1"
capabilities: "beam:coder:global_window:v1"
capabilities: "beam:coder:interval_window:v1"
capabilities: "beam:coder:custom_window:v1"
capabilities: "beam:coder:windowed_value:v1"
capabilities: "beam:coder:double:v1"
capabilities: "beam:coder:row:v1"
capabilities: "beam:coder:param_windowed_value:v1"
capabilities: "beam:coder:state_backed_iterable:v1"
capabilities: "beam:coder:sharded_key:v1"
capabilities: "beam:coder:nullable:v1"
capabilities: "beam:protocol:multi_core_bundle_processing:v1"
capabilities: "beam:protocol:progress_reporting:v1"
capabilities: "beam:protocol:harness_monitoring_infos:v1"
capabilities: "beam:protocol:control_request_elements_embedding:v1"
capabilities: "beam:protocol:state_caching:v1"
capabilities: "beam:version:sdk_base:apache/beam_java8_sdk:2.39.0.dev"
capabilities: "beam:transform:sdf_truncate_sized_restrictions:v1"
capabilities: "beam:transform:to_string:v1"
dependencies: <
type_urn: "beam:artifact:type:file:v1"
type_payload: "\nL/tmp/artifacts/icedtea-sound-ebvtNFkfFXg4aaYFuDnwKpwDSjzsaZqlqv5iKxPTr-U.jar\022@79bbed34591f15783869a605b839f02a9c034a3cec699aa5aafe622b13d3afe5"
role_urn: "beam:artifact:role:staging_to:v1"
role_payload: "\n=icedtea-sound-ebvtNFkfFXg4aaYFuDnwKpwDSjzsaZqlqv5iKxPTr-U.jar"
>
dependencies: <
type_urn: "beam:artifact:type:file:v1"
type_payload: "\nF/tmp/artifacts/jaccess-ULFTCPsb6cLYZ0f1BG1FQfczmHNaZCx8plXuRDKpBqE.jar\022@50b15308fb1be9c2d86747f5046d4541f73398735a642c7ca655ee4432a906a1"
role_urn: "beam:artifact:role:staging_to:v1"
role_payload: "\n7jaccess-ULFTCPsb6cLYZ0f1BG1FQfczmHNaZCx8plXuRDKpBqE.jar"
>
dependencies: <
type_urn: "beam:artifact:type:file:v1"
type_payload: "\nI/tmp/artifacts/localedata-dUHqyGxaTVCjfTI8MckPYarZ3_mwf62udkxaHi1aKns.jar\022@7541eac86c5a4d50a37d323c31c90f61aad9dff9b07fadae764c5a1e2d5a2a7b"
role_urn: "beam:artifact:role:staging_to:v1"
role_payload: "\n:localedata-dUHqyGxaTVCjfTI8MckPYarZ3_mwf62udkxaHi1aKns.jar"
>
dependencies: <
type_urn: "beam:artifact:type:file:v1"
type_payload: "\nF/tmp/artifacts/nashorn-XdUndQGroXOP9NCsfITpBERYcbbGXVHLjbvNWXCh-3A.jar\022@5dd5277501aba1738ff4d0ac7c84e904445871b6c65d51cb8dbbcd5970a1fb70"
role_urn: "beam:artifact:role:staging_to:v1"
role_payload: "\n7nashorn-XdUndQGroXOP9NCsfITpBERYcbbGXVHLjbvNWXCh-3A.jar"
>
dependencies: <
type_urn: "beam:artifact:type:file:v1"
type_payload: "\nG/tmp/artifacts/cldrdata-YqzuKX1QnLCOo0cwjKRdBhGrip_ltIJZg-APT60tUPA.jar\022@62acee297d509cb08ea347308ca45d0611ab8a9fe5b4825983e00f4fad2d50f0"
role_urn: "beam:artifact:role:staging_to:v1"
role_payload: "\n8cldrdata-YqzuKX1QnLCOo0cwjKRdBhGrip_ltIJZg-APT60tUPA.jar"
>
dependencies: <
type_urn: "beam:artifact:type:file:v1"
type_payload: "\nD/tmp/artifacts/dnsns-dhEp186udEF6X6chZus-RJzWRmzlccxx1_btlXWayVI.jar\022@761129d7ceae74417a5fa72166eb3e449cd6466ce571cc71d7f6ed95759ac952"
role_urn: "beam:artifact:role:staging_to:v1"
role_payload: "\n5dnsns-dhEp186udEF6X6chZus-RJzWRmzlccxx1_btlXWayVI.jar"
>
dependencies: <
type_urn: "beam:artifact:type:file:v1"
type_payload: "\nr/tmp/artifacts/beam-sdks-java-io-expansion-service-2.39.0-SNAPSHOT-WdCejIimKOpNkzCxX-1mqrIXkGjLM_FeeKFLyitKDgw.jar\022@59d09e8c88a628ea4d9330b15fed66aab2179068cb33f15e78a14bca2b4a0e0c"
role_urn: "beam:artifact:role:staging_to:v1"
role_payload: "\ncbeam-sdks-java-io-expansion-service-2.39.0-SNAPSHOT-WdCejIimKOpNkzCxX-1mqrIXkGjLM_FeeKFLyitKDgw.jar"
>
>
>
environments: <
key: "go"
value: <
urn: "beam:env:docker:v1"
payload: "\n\026apache/beam_go_sdk:dev"
capabilities: "beam:protocol:progress_reporting:v0"
capabilities: "beam:protocol:multi_core_bundle_processing:v1"
capabilities: "beam:version:sdk_base:go"
capabilities: "beam:coder:bytes:v1"
capabilities: "beam:coder:bool:v1"
capabilities: "beam:coder:varint:v1"
capabilities: "beam:coder:double:v1"
capabilities: "beam:coder:string_utf8:v1"
capabilities: "beam:coder:length_prefix:v1"
capabilities: "beam:coder:kv:v1"
capabilities: "beam:coder:iterable:v1"
capabilities: "beam:coder:state_backed_iterable:v1"
capabilities: "beam:coder:windowed_value:v1"
capabilities: "beam:coder:global_window:v1"
capabilities: "beam:coder:interval_window:v1"
capabilities: "beam:coder:row:v1"
capabilities: "beam:coder:nullable:v1"
dependencies: <
type_urn: "beam:artifact:type:file:v1"
role_urn: "beam:artifact:role:go_worker_binary:v1"
>
>
>
>
root_transform_ids: "s1"
root_transform_ids: "e4"
root_transform_ids: "e5"
root_transform_ids: "s3"
requirements: "beam:requirement:pardo:splittable_dofn:v1"
2022/04/14 23:56:47 Cross-compiling <https://ci-beam.apache.org/job/beam_PostCommit_XVR_Samza/ws/src/sdks/go/test/integration/io/xlang/kafka/kafka_test.go> as /tmp/worker-2-1649980607580987504
2022/04/14 23:56:49 Prepared job with id: go-testkafkaio_basicreadwrite_50d67e95-8f4e-46a3-8604-7b859c8b9dfc and staging token: go-testkafkaio_basicreadwrite_50d67e95-8f4e-46a3-8604-7b859c8b9dfc
2022/04/14 23:56:49 Staged binary artifact with token:
2022/04/14 23:56:49 Submitted job: go0testkafkaio0basicreadwrite-jenkins-0414235649-31c272f9_52f61d05-5db2-4c50-9720-a47124ff3068
2022/04/14 23:56:49 Job state: STOPPED
2022/04/14 23:56:49 Job state: STARTING
2022/04/14 23:56:49 Job state: RUNNING
2022/04/14 23:56:59 Job state: DONE
--- PASS: TestKafkaIO_BasicReadWrite (27.09s)
PASS
ok github.com/apache/beam/sdks/v2/go/test/integration/io/xlang/kafka 33.123s
FAIL
> Task :runners:samza:job-server:validatesCrossLanguageRunnerGoUsingJava FAILED
> Task :runners:samza:job-server:validatesCrossLanguageRunnerJavaUsingJava
> Task :runners:samza:job-server:validatesCrossLanguageRunnerJavaUsingPython
> Task :runners:samza:job-server:validatesCrossLanguageRunnerJavaUsingPythonOnly
> Task :runners:samza:job-server:validatesCrossLanguageRunnerPythonUsingJava
> Task :runners:samza:job-server:validatesCrossLanguageRunnerPythonUsingPython
> Task :runners:samza:job-server:validatesCrossLanguageRunnerPythonUsingSql
> Task :runners:samza:job-server:validatesCrossLanguageRunnerCleanup
> Task :runners:samza:job-server:samzaJobServerCleanup
FAILURE: Build failed with an exception.
* Where:
Build file '<https://ci-beam.apache.org/job/beam_PostCommit_XVR_Samza/ws/src/sdks/go/test/build.gradle'> line: 195
* What went wrong:
Execution failed for task ':runners:samza:job-server:validatesCrossLanguageRunnerGoUsingJava'.
> Process 'command 'sh'' finished with non-zero exit value 1
* Try:
> Run with --stacktrace option to get the stack trace.
> Run with --info or --debug option to get more log output.
> Run with --scan to get full insights.
* Get more help at https://help.gradle.org
Deprecated Gradle features were used in this build, making it incompatible with Gradle 8.0.
You can use '--warning-mode all' to show the individual deprecation warnings and determine if they come from your own scripts or plugins.
See https://docs.gradle.org/7.4/userguide/command_line_interface.html#sec:command_line_warnings
Execution optimizations have been disabled for 1 invalid unit(s) of work during this build to ensure correctness.
Please consult deprecation warnings for more details.
BUILD FAILED in 33m 22s
246 actionable tasks: 171 executed, 64 from cache, 11 up-to-date
Publishing build scan...
https://gradle.com/s/ax4gwanq6voje
Build step 'Invoke Gradle script' changed build result to FAILURE
Build step 'Invoke Gradle script' marked build as failure
---------------------------------------------------------------------
To unsubscribe, e-mail: builds-unsubscribe@beam.apache.org
For additional commands, e-mail: builds-help@beam.apache.org
Build failed in Jenkins: beam_PostCommit_XVR_Samza #1057
Posted by Apache Jenkins Server <je...@builds.apache.org>.
See <https://ci-beam.apache.org/job/beam_PostCommit_XVR_Samza/1057/display/redirect?page=changes>
Changes:
[noreply] [BEAM-13925] Dont double assign committers if author or other reviewer
[noreply] [BEAM-13739] Remove deprecated shallow clone funcs (#17362)
[noreply] [BEAM-11104] Pipe Continuation to DataSource level (#17334)
[noreply] [BEAM-11105] Basic Watermark Estimation (Wall Clock Observing) (#17267)
------------------------------------------
[...truncated 2.26 MB...]
capabilities: "beam:coder:nullable:v1"
capabilities: "beam:protocol:multi_core_bundle_processing:v1"
capabilities: "beam:protocol:progress_reporting:v1"
capabilities: "beam:protocol:harness_monitoring_infos:v1"
capabilities: "beam:protocol:control_request_elements_embedding:v1"
capabilities: "beam:protocol:state_caching:v1"
capabilities: "beam:version:sdk_base:apache/beam_java8_sdk:2.39.0.dev"
capabilities: "beam:transform:sdf_truncate_sized_restrictions:v1"
capabilities: "beam:transform:to_string:v1"
dependencies: <
type_urn: "beam:artifact:type:file:v1"
type_payload: "\nL/tmp/artifacts/icedtea-sound-ebvtNFkfFXg4aaYFuDnwKpwDSjzsaZqlqv5iKxPTr-U.jar\022@79bbed34591f15783869a605b839f02a9c034a3cec699aa5aafe622b13d3afe5"
role_urn: "beam:artifact:role:staging_to:v1"
role_payload: "\n=icedtea-sound-ebvtNFkfFXg4aaYFuDnwKpwDSjzsaZqlqv5iKxPTr-U.jar"
>
dependencies: <
type_urn: "beam:artifact:type:file:v1"
type_payload: "\nF/tmp/artifacts/jaccess-ULFTCPsb6cLYZ0f1BG1FQfczmHNaZCx8plXuRDKpBqE.jar\022@50b15308fb1be9c2d86747f5046d4541f73398735a642c7ca655ee4432a906a1"
role_urn: "beam:artifact:role:staging_to:v1"
role_payload: "\n7jaccess-ULFTCPsb6cLYZ0f1BG1FQfczmHNaZCx8plXuRDKpBqE.jar"
>
dependencies: <
type_urn: "beam:artifact:type:file:v1"
type_payload: "\nI/tmp/artifacts/localedata-dUHqyGxaTVCjfTI8MckPYarZ3_mwf62udkxaHi1aKns.jar\022@7541eac86c5a4d50a37d323c31c90f61aad9dff9b07fadae764c5a1e2d5a2a7b"
role_urn: "beam:artifact:role:staging_to:v1"
role_payload: "\n:localedata-dUHqyGxaTVCjfTI8MckPYarZ3_mwf62udkxaHi1aKns.jar"
>
dependencies: <
type_urn: "beam:artifact:type:file:v1"
type_payload: "\nF/tmp/artifacts/nashorn-XdUndQGroXOP9NCsfITpBERYcbbGXVHLjbvNWXCh-3A.jar\022@5dd5277501aba1738ff4d0ac7c84e904445871b6c65d51cb8dbbcd5970a1fb70"
role_urn: "beam:artifact:role:staging_to:v1"
role_payload: "\n7nashorn-XdUndQGroXOP9NCsfITpBERYcbbGXVHLjbvNWXCh-3A.jar"
>
dependencies: <
type_urn: "beam:artifact:type:file:v1"
type_payload: "\nG/tmp/artifacts/cldrdata-YqzuKX1QnLCOo0cwjKRdBhGrip_ltIJZg-APT60tUPA.jar\022@62acee297d509cb08ea347308ca45d0611ab8a9fe5b4825983e00f4fad2d50f0"
role_urn: "beam:artifact:role:staging_to:v1"
role_payload: "\n8cldrdata-YqzuKX1QnLCOo0cwjKRdBhGrip_ltIJZg-APT60tUPA.jar"
>
dependencies: <
type_urn: "beam:artifact:type:file:v1"
type_payload: "\nD/tmp/artifacts/dnsns-dhEp186udEF6X6chZus-RJzWRmzlccxx1_btlXWayVI.jar\022@761129d7ceae74417a5fa72166eb3e449cd6466ce571cc71d7f6ed95759ac952"
role_urn: "beam:artifact:role:staging_to:v1"
role_payload: "\n5dnsns-dhEp186udEF6X6chZus-RJzWRmzlccxx1_btlXWayVI.jar"
>
dependencies: <
type_urn: "beam:artifact:type:file:v1"
type_payload: "\nr/tmp/artifacts/beam-sdks-java-io-expansion-service-2.39.0-SNAPSHOT-WdCejIimKOpNkzCxX-1mqrIXkGjLM_FeeKFLyitKDgw.jar\022@59d09e8c88a628ea4d9330b15fed66aab2179068cb33f15e78a14bca2b4a0e0c"
role_urn: "beam:artifact:role:staging_to:v1"
role_payload: "\ncbeam-sdks-java-io-expansion-service-2.39.0-SNAPSHOT-WdCejIimKOpNkzCxX-1mqrIXkGjLM_FeeKFLyitKDgw.jar"
>
>
>
environments: <
key: "go"
value: <
urn: "beam:env:docker:v1"
payload: "\n\026apache/beam_go_sdk:dev"
capabilities: "beam:protocol:progress_reporting:v0"
capabilities: "beam:protocol:multi_core_bundle_processing:v1"
capabilities: "beam:version:sdk_base:go"
capabilities: "beam:coder:bytes:v1"
capabilities: "beam:coder:bool:v1"
capabilities: "beam:coder:varint:v1"
capabilities: "beam:coder:double:v1"
capabilities: "beam:coder:string_utf8:v1"
capabilities: "beam:coder:length_prefix:v1"
capabilities: "beam:coder:kv:v1"
capabilities: "beam:coder:iterable:v1"
capabilities: "beam:coder:state_backed_iterable:v1"
capabilities: "beam:coder:windowed_value:v1"
capabilities: "beam:coder:global_window:v1"
capabilities: "beam:coder:interval_window:v1"
capabilities: "beam:coder:row:v1"
capabilities: "beam:coder:nullable:v1"
dependencies: <
type_urn: "beam:artifact:type:file:v1"
role_urn: "beam:artifact:role:go_worker_binary:v1"
>
>
>
>
root_transform_ids: "s1"
root_transform_ids: "e4"
root_transform_ids: "e5"
root_transform_ids: "s3"
requirements: "beam:requirement:pardo:splittable_dofn:v1"
2022/04/14 18:27:11 Cross-compiling <https://ci-beam.apache.org/job/beam_PostCommit_XVR_Samza/ws/src/sdks/go/test/integration/io/xlang/kafka/kafka_test.go> as /tmp/worker-2-1649960831619906204
2022/04/14 18:27:13 Prepared job with id: go-testkafkaio_basicreadwrite_11341cc1-d9ee-42c4-8e5b-e93b7bc916af and staging token: go-testkafkaio_basicreadwrite_11341cc1-d9ee-42c4-8e5b-e93b7bc916af
2022/04/14 18:27:13 Staged binary artifact with token:
2022/04/14 18:27:13 Submitted job: go0testkafkaio0basicreadwrite-jenkins-0414182713-2396bc8d_0243e8c4-81db-4213-8044-1c0161607b89
2022/04/14 18:27:13 Job state: STOPPED
2022/04/14 18:27:13 Job state: STARTING
2022/04/14 18:27:13 Job state: RUNNING
2022/04/14 18:27:23 Job state: DONE
--- PASS: TestKafkaIO_BasicReadWrite (27.39s)
PASS
ok github.com/apache/beam/sdks/v2/go/test/integration/io/xlang/kafka 33.420s
FAIL
$ TEST_EXIT_CODE=0
$ cd ../..
$ exit 1
$ exit 1
> Task :runners:samza:job-server:validatesCrossLanguageRunnerGoUsingJava FAILED
> Task :runners:samza:job-server:validatesCrossLanguageRunnerJavaUsingJava
> Task :runners:samza:job-server:validatesCrossLanguageRunnerJavaUsingPython
> Task :runners:samza:job-server:validatesCrossLanguageRunnerJavaUsingPythonOnly
> Task :runners:samza:job-server:validatesCrossLanguageRunnerPythonUsingJava
>>> RUNNING integration tests with pipeline options: --runner=PortableRunner --job_endpoint=localhost:38809 --environment_cache_millis=10000 --experiments=beam_fn_api
>>> pytest options:
>>> collect markers: -m=xlang_transforms
============================= test session starts ==============================
platform linux -- Python 3.9.10, pytest-4.6.11, py-1.11.0, pluggy-0.13.1
rootdir: <https://ci-beam.apache.org/job/beam_PostCommit_XVR_Samza/ws/src/sdks/python,> inifile: pytest.ini
plugins: xdist-1.34.0, timeout-1.4.2, forked-1.4.0, requests-mock-1.9.3
timeout: 600.0s
timeout method: signal
timeout func_only: False
collected 5316 items / 5306 deselected / 10 selected
apache_beam/io/external/generate_sequence_test.py ... [ 30%]
apache_beam/transforms/validate_runner_xlang_test.py ....... [100%]
=============================== warnings summary ===============================
apache_beam/io/filesystems_test.py:54
<https://ci-beam.apache.org/job/beam_PostCommit_XVR_Samza/ws/src/sdks/python/apache_beam/io/filesystems_test.py>:54: DeprecationWarning: invalid escape sequence \c
self.assertIsNone(FileSystems.get_scheme('c:\\abc\cdf')) # pylint: disable=anomalous-backslash-in-string
apache_beam/io/filesystems_test.py:62
<https://ci-beam.apache.org/job/beam_PostCommit_XVR_Samza/ws/src/sdks/python/apache_beam/io/filesystems_test.py>:62: DeprecationWarning: invalid escape sequence \d
self.assertTrue(isinstance(FileSystems.get_filesystem('c:\\abc\def'), # pylint: disable=anomalous-backslash-in-string
<unknown>:54
<unknown>:54: DeprecationWarning: invalid escape sequence \c
<unknown>:62
<unknown>:62: DeprecationWarning: invalid escape sequence \d
<https://ci-beam.apache.org/job/beam_PostCommit_XVR_Samza/ws/src/build/gradleenv/1922375555/lib/python3.9/site-packages/tenacity/_asyncio.py>:42
<https://ci-beam.apache.org/job/beam_PostCommit_XVR_Samza/ws/src/build/gradleenv/1922375555/lib/python3.9/site-packages/tenacity/_asyncio.py>:42: DeprecationWarning: "@coroutine" decorator is deprecated since Python 3.8, use "async def" instead
def call(self, fn, *args, **kwargs):
-- Docs: https://docs.pytest.org/en/latest/warnings.html
- generated xml file: <https://ci-beam.apache.org/job/beam_PostCommit_XVR_Samza/ws/src/sdks/python/pytest_xlangValidateRunner.xml> -
=========== 10 passed, 5306 deselected, 5 warnings in 120.22 seconds ===========
> Task :runners:samza:job-server:validatesCrossLanguageRunnerPythonUsingPython
>>> RUNNING integration tests with pipeline options: --runner=PortableRunner --job_endpoint=localhost:38809 --environment_cache_millis=10000 --experiments=beam_fn_api
>>> pytest options:
>>> collect markers: -m=xlang_transforms
============================= test session starts ==============================
platform linux -- Python 3.9.10, pytest-4.6.11, py-1.11.0, pluggy-0.13.1
rootdir: <https://ci-beam.apache.org/job/beam_PostCommit_XVR_Samza/ws/src/sdks/python,> inifile: pytest.ini
plugins: xdist-1.34.0, timeout-1.4.2, forked-1.4.0, requests-mock-1.9.3
timeout: 600.0s
timeout method: signal
timeout func_only: False
collected 5316 items / 5306 deselected / 10 selected
apache_beam/io/external/generate_sequence_test.py .ss [ 30%]
apache_beam/transforms/validate_runner_xlang_test.py ....... [100%]
=============================== warnings summary ===============================
<unknown>:54
<unknown>:54: DeprecationWarning: invalid escape sequence \c
<unknown>:62
<unknown>:62: DeprecationWarning: invalid escape sequence \d
<https://ci-beam.apache.org/job/beam_PostCommit_XVR_Samza/ws/src/build/gradleenv/1922375555/lib/python3.9/site-packages/tenacity/_asyncio.py>:42
<https://ci-beam.apache.org/job/beam_PostCommit_XVR_Samza/ws/src/build/gradleenv/1922375555/lib/python3.9/site-packages/tenacity/_asyncio.py>:42: DeprecationWarning: "@coroutine" decorator is deprecated since Python 3.8, use "async def" instead
def call(self, fn, *args, **kwargs):
-- Docs: https://docs.pytest.org/en/latest/warnings.html
- generated xml file: <https://ci-beam.apache.org/job/beam_PostCommit_XVR_Samza/ws/src/sdks/python/pytest_xlangValidateRunner.xml> -
====== 8 passed, 2 skipped, 5306 deselected, 3 warnings in 70.46 seconds =======
> Task :runners:samza:job-server:validatesCrossLanguageRunnerPythonUsingSql
>>> RUNNING integration tests with pipeline options: --runner=PortableRunner --job_endpoint=localhost:38809 --environment_cache_millis=10000 --experiments=beam_fn_api
>>> pytest options:
>>> collect markers: -m=xlang_sql_expansion_service
============================= test session starts ==============================
platform linux -- Python 3.9.10, pytest-4.6.11, py-1.11.0, pluggy-0.13.1
rootdir: <https://ci-beam.apache.org/job/beam_PostCommit_XVR_Samza/ws/src/sdks/python,> inifile: pytest.ini
plugins: xdist-1.34.0, timeout-1.4.2, forked-1.4.0, requests-mock-1.9.3
timeout: 600.0s
timeout method: signal
timeout func_only: False
collected 5316 items / 5307 deselected / 9 selected
apache_beam/transforms/sql_test.py ......... [100%]
=============================== warnings summary ===============================
<unknown>:54
<unknown>:54: DeprecationWarning: invalid escape sequence \c
<unknown>:62
<unknown>:62: DeprecationWarning: invalid escape sequence \d
<https://ci-beam.apache.org/job/beam_PostCommit_XVR_Samza/ws/src/build/gradleenv/1922375555/lib/python3.9/site-packages/tenacity/_asyncio.py>:42
<https://ci-beam.apache.org/job/beam_PostCommit_XVR_Samza/ws/src/build/gradleenv/1922375555/lib/python3.9/site-packages/tenacity/_asyncio.py>:42: DeprecationWarning: "@coroutine" decorator is deprecated since Python 3.8, use "async def" instead
def call(self, fn, *args, **kwargs):
-- Docs: https://docs.pytest.org/en/latest/warnings.html
- generated xml file: <https://ci-beam.apache.org/job/beam_PostCommit_XVR_Samza/ws/src/sdks/python/pytest_xlangSqlValidateRunner.xml> -
=========== 9 passed, 5307 deselected, 3 warnings in 232.43 seconds ============
> Task :runners:samza:job-server:validatesCrossLanguageRunnerCleanup
Stopping expansion service pid: 2256877.
Stopping expansion service pid: 2256878.
> Task :runners:samza:job-server:samzaJobServerCleanup
Stopping job server pid: 2245832.
FAILURE: Build failed with an exception.
* Where:
Build file '<https://ci-beam.apache.org/job/beam_PostCommit_XVR_Samza/ws/src/sdks/go/test/build.gradle'> line: 195
* What went wrong:
Execution failed for task ':runners:samza:job-server:validatesCrossLanguageRunnerGoUsingJava'.
> Process 'command 'sh'' finished with non-zero exit value 1
* Try:
> Run with --stacktrace option to get the stack trace.
> Run with --info or --debug option to get more log output.
> Run with --scan to get full insights.
* Get more help at https://help.gradle.org
Deprecated Gradle features were used in this build, making it incompatible with Gradle 8.0.
You can use '--warning-mode all' to show the individual deprecation warnings and determine if they come from your own scripts or plugins.
See https://docs.gradle.org/7.3.2/userguide/command_line_interface.html#sec:command_line_warnings
Execution optimizations have been disabled for 1 invalid unit(s) of work during this build to ensure correctness.
Please consult deprecation warnings for more details.
BUILD FAILED in 31m 51s
231 actionable tasks: 35 executed, 196 up-to-date
Publishing build scan...
https://gradle.com/s/jxlffhfxfzune
Build step 'Invoke Gradle script' changed build result to FAILURE
Build step 'Invoke Gradle script' marked build as failure
---------------------------------------------------------------------
To unsubscribe, e-mail: builds-unsubscribe@beam.apache.org
For additional commands, e-mail: builds-help@beam.apache.org
Build failed in Jenkins: beam_PostCommit_XVR_Samza #1056
Posted by Apache Jenkins Server <je...@builds.apache.org>.
See <https://ci-beam.apache.org/job/beam_PostCommit_XVR_Samza/1056/display/redirect>
Changes:
------------------------------------------
[...truncated 957.23 KB...]
>
coders: <
key: "sBymtNVPYtKvCoder3"
value: <
spec: <
urn: "beam:coder:kv:v1"
>
component_coder_ids: "sBymtNVPYtVarIntCoder"
component_coder_ids: "sBymtNVPYtTimestampedValueCoder"
>
>
coders: <
key: "sBymtNVPYtKvCoder4"
value: <
spec: <
urn: "beam:coder:kv:v1"
>
component_coder_ids: "sBymtNVPYtVarIntCoder"
component_coder_ids: "sBymtNVPYtIterableCoder"
>
>
coders: <
key: "sBymtNVPYtNullableCoder"
value: <
spec: <
urn: "beam:coder:nullable:v1"
>
component_coder_ids: "sBymtNVPYtByteArrayCoder"
>
>
coders: <
key: "sBymtNVPYtSerializableCoder"
value: <
spec: <
urn: "beam:coders:javasdk:0.1"
payload: "\202SNAPPY\000\000\000\000\001\000\000\000\001\000\000\000\312\241\002\360^\254\355\000\005sr\000,org.apache.beam.sdk.coders.SerializableCoder\010\364 \216\305ynl\002\000\001L\000\004typet\000\021Ljava/lang/Class;xr\000&ofV\000\024Custom\005P8j\260\010\235\013;\035\013\002\000\000xr\000 j\213\000\005/\034C\335\325\211\256\274~\370\001/\020pvr\000$N1\000\\io.BoundedSource!`v\023\177\370QA\0015\010r\000\035Z3\000\t,0\020\213\372\020Y\214\347\323\002\000\000xp"
>
>
>
coders: <
key: "sBymtNVPYtSerializableCoder1"
value: <
spec: <
urn: "beam:coders:javasdk:0.1"
payload: "\202SNAPPY\000\000\000\000\001\000\000\000\001\000\000\000\312\214\002\360^\254\355\000\005sr\000,org.apache.beam.sdk.coders.SerializableCoder\010\364 \216\305ynl\002\000\001L\000\004typet\000\021Ljava/lang/Class;xr\000&ofV\000\024Custom\005P8j\260\010\235\013;\035\013\002\000\000xr\000 j\213\000\005/\034C\335\325\211\256\274~\370\001/\020pvr\000;N1\000Pio.BoundedReadFromUnb\t\021`Source$Shardd\236\240U\205\000j\363\002\000\000xp"
>
>
>
coders: <
key: "sBymtNVPYtTimestampedValueCoder"
value: <
spec: <
urn: "beam:coders:javasdk:0.1"
payload: "\202SNAPPY\000\000\000\000\001\000\000\000\001\000\000\001?\315\003\270\254\355\000\005sr\000Aorg.apache.beam.sdk.values.TimestampedV\001\022\000$>\021\000LCoder\364\376\202p\274iX-\002\000\001L\000\nv\001)\005\030\034t\000\"Lorg/\t]\000/\001],/sdk/coders/\005$\020;xr\000*N\202\000\t%(.Structured\005/8s\277\022\016\325\3246\021\002\000\000xr\000 j9\000\005/\034C\335\325\211\256\274~\370\001/\020psr\000,j1\000(Serializabl\t\277\034\010\364 \216\305ynl\005\327\\\004typet\000\021Ljava/lang/Class\001\300\000&jV\000\024Custom\005\215Pj\260\010\235\013;\035\013\002\000\000xq\000~\000\003vr\000;N;\000Pio.BoundedReadFromUnb\t\021`Source$Shardd\236\240U\205\000j\363\002\000\000xp"
>
>
>
coders: <
key: "sBymtNVPYtValueWithRecordIdCoder"
value: <
spec: <
urn: "beam:coders:javasdk:0.1"
payload: "\202SNAPPY\000\000\000\000\001\000\000\000\001\000\000\001\213\311\005\320\254\355\000\005sr\000Corg.apache.beam.sdk.values.ValueWithRecordId$B\022\000LCoder{\343\376bQ\014\204>\002\000\002L\000\007i\t\025\034t\000+Lorg/\t\\\000/\001\\\024/sdk/c\0012(s/ByteArray\005B\014;L\000\n\005u\005\016\010t\000\"n;\000\005$\020;xr\000*N\274\000\t`(.Structured\005/8s\277\022\016\325\3246\021\002\000\000xr\000 j9\000\005/\034C\335\325\211\256\274~\370\001/\020psr\000)j1\0006\312\000\034\351\277\005|\263\3746\333\001:\010r\000&j8\000\024Atomic\005o\034\307\354\265\314\205tPF\0015 q\000~\000\003sr\000-N;\000$io.kafka.K\001\006\000R%\227\005B<I\320\251Y\032\341{#\002\000\001L\000\007kv\005\025\010t\000$nH\001\000K\t&\000;\025s\000\"Ns\000-P\r- j\000\275\271\035\243\3126\002!\353\010\010ke)\277\001\264\000\0022\303\001\005\022\025Y\000(jY\000\030Nullabl)\372\034E\333\0336>\220\247\007\005\307]\022.O\000\001\014,\006sq\000~\000\016q\000~\000\020"
>
>
>
coders: <
key: "sBymtNVPYtVarIntCoder"
value: <
spec: <
urn: "beam:coders:javasdk:0.1"
payload: "\202SNAPPY\000\000\000\000\001\000\000\000\001\000\000\000\210\330\001\350\254\355\000\005sr\000&org.apache.beam.sdk.coders.VarIntCoder\300K2\332\251KVh\002\000\000xrr5\000\024Atomic\0055 \307\354\265\314\205tPF\002\0055\000*jj\000$Structured\0059\034s\277\022\016\325\3246\021\t9\000 j9\000\005/0C\335\325\211\256\274~\370\002\000\000xp"
>
>
>
coders: <
key: "sBymtNVPYtVoidCoder"
value: <
spec: <
urn: "beam:coders:javasdk:0.1"
payload: "\202SNAPPY\000\000\000\000\001\000\000\000\001\000\000\000\210\326\001\350\254\355\000\005sr\000$org.apache.beam.sdk.coders.VoidCoder\271\277U\233\350\r\257U\002\000\000xr\000&j3\000\024Atomic\0055 \307\354\265\314\205tPF\002\0055\000*j5\000$Structured\0059\034s\277\022\016\325\3246\021\t9\000 j9\000\005/0C\335\325\211\256\274~\370\002\000\000xp"
>
>
>
environments: <
key: "go"
value: <
urn: "beam:env:docker:v1"
payload: "\n\026apache/beam_go_sdk:dev"
capabilities: "beam:protocol:progress_reporting:v0"
capabilities: "beam:protocol:multi_core_bundle_processing:v1"
capabilities: "beam:version:sdk_base:go"
capabilities: "beam:coder:bytes:v1"
capabilities: "beam:coder:bool:v1"
capabilities: "beam:coder:varint:v1"
capabilities: "beam:coder:double:v1"
capabilities: "beam:coder:string_utf8:v1"
capabilities: "beam:coder:length_prefix:v1"
capabilities: "beam:coder:kv:v1"
capabilities: "beam:coder:iterable:v1"
capabilities: "beam:coder:state_backed_iterable:v1"
capabilities: "beam:coder:windowed_value:v1"
capabilities: "beam:coder:global_window:v1"
capabilities: "beam:coder:interval_window:v1"
capabilities: "beam:coder:row:v1"
capabilities: "beam:coder:nullable:v1"
dependencies: <
type_urn: "beam:artifact:type:file:v1"
role_urn: "beam:artifact:role:go_worker_binary:v1"
>
>
>
environments: <
key: "sBymtNVPYtbeam:env:docker:v1"
value: <
urn: "beam:env:docker:v1"
payload: "\n apache/beam_java8_sdk:2.39.0.dev"
capabilities: "beam:coder:bytes:v1"
capabilities: "beam:coder:bool:v1"
capabilities: "beam:coder:varint:v1"
capabilities: "beam:coder:string_utf8:v1"
capabilities: "beam:coder:iterable:v1"
capabilities: "beam:coder:timer:v1"
capabilities: "beam:coder:kv:v1"
capabilities: "beam:coder:length_prefix:v1"
capabilities: "beam:coder:global_window:v1"
capabilities: "beam:coder:interval_window:v1"
capabilities: "beam:coder:custom_window:v1"
capabilities: "beam:coder:windowed_value:v1"
capabilities: "beam:coder:double:v1"
capabilities: "beam:coder:row:v1"
capabilities: "beam:coder:param_windowed_value:v1"
capabilities: "beam:coder:state_backed_iterable:v1"
capabilities: "beam:coder:sharded_key:v1"
capabilities: "beam:coder:nullable:v1"
capabilities: "beam:protocol:multi_core_bundle_processing:v1"
capabilities: "beam:protocol:progress_reporting:v1"
capabilities: "beam:protocol:harness_monitoring_infos:v1"
capabilities: "beam:protocol:control_request_elements_embedding:v1"
capabilities: "beam:protocol:state_caching:v1"
capabilities: "beam:version:sdk_base:apache/beam_java8_sdk:2.39.0.dev"
capabilities: "beam:transform:sdf_truncate_sized_restrictions:v1"
capabilities: "beam:transform:to_string:v1"
dependencies: <
type_urn: "beam:artifact:type:file:v1"
type_payload: "\nL/tmp/artifacts/icedtea-sound-ebvtNFkfFXg4aaYFuDnwKpwDSjzsaZqlqv5iKxPTr-U.jar\022@79bbed34591f15783869a605b839f02a9c034a3cec699aa5aafe622b13d3afe5"
role_urn: "beam:artifact:role:staging_to:v1"
role_payload: "\n=icedtea-sound-ebvtNFkfFXg4aaYFuDnwKpwDSjzsaZqlqv5iKxPTr-U.jar"
>
dependencies: <
type_urn: "beam:artifact:type:file:v1"
type_payload: "\nF/tmp/artifacts/jaccess-ULFTCPsb6cLYZ0f1BG1FQfczmHNaZCx8plXuRDKpBqE.jar\022@50b15308fb1be9c2d86747f5046d4541f73398735a642c7ca655ee4432a906a1"
role_urn: "beam:artifact:role:staging_to:v1"
role_payload: "\n7jaccess-ULFTCPsb6cLYZ0f1BG1FQfczmHNaZCx8plXuRDKpBqE.jar"
>
dependencies: <
type_urn: "beam:artifact:type:file:v1"
type_payload: "\nI/tmp/artifacts/localedata-dUHqyGxaTVCjfTI8MckPYarZ3_mwf62udkxaHi1aKns.jar\022@7541eac86c5a4d50a37d323c31c90f61aad9dff9b07fadae764c5a1e2d5a2a7b"
role_urn: "beam:artifact:role:staging_to:v1"
role_payload: "\n:localedata-dUHqyGxaTVCjfTI8MckPYarZ3_mwf62udkxaHi1aKns.jar"
>
dependencies: <
type_urn: "beam:artifact:type:file:v1"
type_payload: "\nF/tmp/artifacts/nashorn-XdUndQGroXOP9NCsfITpBERYcbbGXVHLjbvNWXCh-3A.jar\022@5dd5277501aba1738ff4d0ac7c84e904445871b6c65d51cb8dbbcd5970a1fb70"
role_urn: "beam:artifact:role:staging_to:v1"
role_payload: "\n7nashorn-XdUndQGroXOP9NCsfITpBERYcbbGXVHLjbvNWXCh-3A.jar"
>
dependencies: <
type_urn: "beam:artifact:type:file:v1"
type_payload: "\nG/tmp/artifacts/cldrdata-YqzuKX1QnLCOo0cwjKRdBhGrip_ltIJZg-APT60tUPA.jar\022@62acee297d509cb08ea347308ca45d0611ab8a9fe5b4825983e00f4fad2d50f0"
role_urn: "beam:artifact:role:staging_to:v1"
role_payload: "\n8cldrdata-YqzuKX1QnLCOo0cwjKRdBhGrip_ltIJZg-APT60tUPA.jar"
>
dependencies: <
type_urn: "beam:artifact:type:file:v1"
type_payload: "\nD/tmp/artifacts/dnsns-dhEp186udEF6X6chZus-RJzWRmzlccxx1_btlXWayVI.jar\022@761129d7ceae74417a5fa72166eb3e449cd6466ce571cc71d7f6ed95759ac952"
role_urn: "beam:artifact:role:staging_to:v1"
role_payload: "\n5dnsns-dhEp186udEF6X6chZus-RJzWRmzlccxx1_btlXWayVI.jar"
>
dependencies: <
type_urn: "beam:artifact:type:file:v1"
type_payload: "\nr/tmp/artifacts/beam-sdks-java-io-expansion-service-2.39.0-SNAPSHOT-WdCejIimKOpNkzCxX-1mqrIXkGjLM_FeeKFLyitKDgw.jar\022@59d09e8c88a628ea4d9330b15fed66aab2179068cb33f15e78a14bca2b4a0e0c"
role_urn: "beam:artifact:role:staging_to:v1"
role_payload: "\ncbeam-sdks-java-io-expansion-service-2.39.0-SNAPSHOT-WdCejIimKOpNkzCxX-1mqrIXkGjLM_FeeKFLyitKDgw.jar"
>
>
>
>
root_transform_ids: "s1"
root_transform_ids: "e4"
root_transform_ids: "e5"
root_transform_ids: "s3"
requirements: "beam:requirement:pardo:splittable_dofn:v1"
2022/04/14 11:57:06 Cross-compiling <https://ci-beam.apache.org/job/beam_PostCommit_XVR_Samza/ws/src/sdks/go/test/integration/io/xlang/kafka/kafka_test.go> as /tmp/worker-2-1649937426929908463
2022/04/14 11:57:08 Prepared job with id: go-testkafkaio_basicreadwrite_e0acbfc5-a28a-4658-9f15-484ef7c38b95 and staging token: go-testkafkaio_basicreadwrite_e0acbfc5-a28a-4658-9f15-484ef7c38b95
2022/04/14 11:57:08 Staged binary artifact with token:
2022/04/14 11:57:08 Submitted job: go0testkafkaio0basicreadwrite-jenkins-0414115708-a7614b92_070dcb5e-579f-4e0d-bb3d-6eb6bbdeed24
2022/04/14 11:57:08 Job state: STOPPED
2022/04/14 11:57:08 Job state: STARTING
2022/04/14 11:57:08 Job state: RUNNING
2022/04/14 11:57:18 Job state: DONE
--- PASS: TestKafkaIO_BasicReadWrite (27.25s)
PASS
ok github.com/apache/beam/sdks/v2/go/test/integration/io/xlang/kafka 33.280s
FAIL
> Task :runners:samza:job-server:validatesCrossLanguageRunnerGoUsingJava FAILED
> Task :runners:samza:job-server:validatesCrossLanguageRunnerJavaUsingJava
> Task :runners:samza:job-server:validatesCrossLanguageRunnerJavaUsingPython
> Task :runners:samza:job-server:validatesCrossLanguageRunnerJavaUsingPythonOnly
> Task :runners:samza:job-server:validatesCrossLanguageRunnerPythonUsingJava
> Task :runners:samza:job-server:validatesCrossLanguageRunnerPythonUsingPython
> Task :runners:samza:job-server:validatesCrossLanguageRunnerPythonUsingSql
> Task :runners:samza:job-server:validatesCrossLanguageRunnerCleanup
> Task :runners:samza:job-server:samzaJobServerCleanup
FAILURE: Build failed with an exception.
* Where:
Build file '<https://ci-beam.apache.org/job/beam_PostCommit_XVR_Samza/ws/src/sdks/go/test/build.gradle'> line: 195
* What went wrong:
Execution failed for task ':runners:samza:job-server:validatesCrossLanguageRunnerGoUsingJava'.
> Process 'command 'sh'' finished with non-zero exit value 1
* Try:
> Run with --stacktrace option to get the stack trace.
> Run with --info or --debug option to get more log output.
> Run with --scan to get full insights.
* Get more help at https://help.gradle.org
Deprecated Gradle features were used in this build, making it incompatible with Gradle 8.0.
You can use '--warning-mode all' to show the individual deprecation warnings and determine if they come from your own scripts or plugins.
See https://docs.gradle.org/7.3.2/userguide/command_line_interface.html#sec:command_line_warnings
Execution optimizations have been disabled for 1 invalid unit(s) of work during this build to ensure correctness.
Please consult deprecation warnings for more details.
BUILD FAILED in 33m 23s
246 actionable tasks: 163 executed, 72 from cache, 11 up-to-date
Publishing build scan...
https://gradle.com/s/krbkzjrygling
Build step 'Invoke Gradle script' changed build result to FAILURE
Build step 'Invoke Gradle script' marked build as failure
---------------------------------------------------------------------
To unsubscribe, e-mail: builds-unsubscribe@beam.apache.org
For additional commands, e-mail: builds-help@beam.apache.org