You are viewing a plain text version of this content. The canonical link for it is here.
Posted to notifications@maven.apache.org by Apache Jenkins Server <je...@builds.apache.org> on 2013/02/17 15:12:47 UTC
Build failed in Jenkins: maven-plugins #1432
See <https://builds.apache.org/job/maven-plugins/1432/changes>
Changes:
[dennisl] [maven-release-plugin] prepare for next development iteration
[dennisl] [maven-release-plugin] prepare release maven-checkstyle-plugin-2.10
[Robert Scholte] Remove Release Notes link from overview
------------------------------------------
[...truncated 724 lines...]
Tests run: 3, Failures: 0, Errors: 0, Skipped: 0, Time elapsed: 0.018 sec
Running org.apache.maven.plugin.changelog.ChangeLogReportTest
[JENKINS] Recording test results
[INFO] Generating changed sets xml to: <https://builds.apache.org/job/maven-plugins/ws/maven-changelog-plugin/target/test-harness/4/changelog.xml>
Tests run: 14, Failures: 0, Errors: 0, Skipped: 0, Time elapsed: 3.166 sec
Running org.apache.maven.plugin.assembly.format.FileSetFormatterTest
[INFO]
[INFO] --- maven-jar-plugin:2.4:jar (default-jar) @ maven-eclipse-plugin ---
[INFO] Generating changed sets xml to: <https://builds.apache.org/job/maven-plugins/ws/maven-changelog-plugin/target/test-harness/5/changelog.xml>
[ERROR] Provider message:
[ERROR] Provider Stub Error Message
[ERROR] Command output:
[ERROR] Provider Stub Commandline
[INFO] Building jar: <https://builds.apache.org/job/maven-plugins/ws/maven-eclipse-plugin/target/maven-eclipse-plugin-2.10-SNAPSHOT.jar>
[INFO] Using existing changelog.xml...
[INFO]
[INFO] --- maven-plugin-plugin:2.4.3:addPluginArtifactMetadata (default-addPluginArtifactMetadata) @ maven-eclipse-plugin ---
[INFO] Generating changed sets xml to: <https://builds.apache.org/job/maven-plugins/ws/maven-changelog-plugin/target/test-harness/8/changelog.xml>
[INFO] Installing <https://builds.apache.org/job/maven-plugins/ws/maven-eclipse-plugin/target/maven-eclipse-plugin-2.10-SNAPSHOT.jar> to /home/jenkins/jenkins-slave/maven-repositories/0/org/apache/maven/plugins/maven-eclipse-plugin/2.10-SNAPSHOT/maven-eclipse-plugin-2.10-SNAPSHOT.jar
[INFO] [INFO] Installing <https://builds.apache.org/job/maven-plugins/ws/maven-eclipse-plugin/pom.xml> to /home/jenkins/jenkins-slave/maven-repositories/0/org/apache/maven/plugins/maven-eclipse-plugin/2.10-SNAPSHOT/maven-eclipse-plugin-2.10-SNAPSHOT.pom
[INFO] --- maven-install-plugin:2.3.1:install (default-install) @ maven-eclipse-plugin ---
[INFO] Generating changed sets xml to: <https://builds.apache.org/job/maven-plugins/ws/maven-changelog-plugin/target/test-harness/9/changelog.xml>
Tests run: 8, Failures: 0, Errors: 0, Skipped: 0, Time elapsed: 1.674 sec
Results :
Tests run: 255, Failures: 0, Errors: 0, Skipped: 0
[INFO] Generating changed sets xml to: <https://builds.apache.org/job/maven-plugins/ws/maven-changelog-plugin/target/test-harness/10/changelog.xml>
[INFO] Generating changed sets xml to: <https://builds.apache.org/job/maven-plugins/ws/maven-changelog-plugin/target/test-harness/11/changelog.xml>
[WARNING] *****************************************************************
[WARNING] * Your build is requesting parallel execution, but project *
[WARNING] * contains the following plugin(s) that are not marked as *
[WARNING] * @threadSafe to support parallel building. *
[WARNING] * While this /may/ work fine, please look for plugin updates *
[WARNING] * and/or request plugins be made thread-safe. *
[WARNING] * If reporting an issue, report it against the plugin in *
[WARNING] * question, not against maven-core *
[WARNING] *****************************************************************
[WARNING] The following plugins are not marked @threadSafe in Maven Changes Report Plugin:
[WARNING] org.codehaus.plexus:plexus-component-metadata:1.5.5
[WARNING] org.codehaus.modello:modello-maven-plugin:1.0.1
[WARNING] *****************************************************************
[INFO]
[INFO] ------------------------------------------------------------------------
[INFO] Building Maven Changes Report Plugin 2.9-SNAPSHOT
[INFO] ------------------------------------------------------------------------
[INFO] Generating changed sets xml to: <https://builds.apache.org/job/maven-plugins/ws/maven-changelog-plugin/target/test-harness/12/changelog.xml>
[INFO] Generating changed sets xml to: <https://builds.apache.org/job/maven-plugins/ws/maven-changelog-plugin/target/test-harness/13/changelog.xml>
[JENKINS] Recording test results
[INFO] Generating changed sets xml to: <https://builds.apache.org/job/maven-plugins/ws/maven-changelog-plugin/target/test-harness/14/changelog.xml>
[INFO] Generating changed sets xml to: <https://builds.apache.org/job/maven-plugins/ws/maven-changelog-plugin/target/test-harness/15/changelog.xml>
Tests run: 13, Failures: 0, Errors: 0, Skipped: 0, Time elapsed: 3.813 sec
Running org.apache.maven.plugin.changelog.DeveloperActivityReportTest
[INFO] Using existing changelog.xml...
[INFO] Tests run: 2, Failures: 0, Errors: 0, Skipped: 0, Time elapsed: 0.42 sec
[INFO] --- maven-jar-plugin:2.4:jar (default-jar) @ maven-assembly-plugin ---
Results :
Tests run: 21, Failures: 0, Errors: 0, Skipped: 0
[INFO] Building jar: <https://builds.apache.org/job/maven-plugins/ws/maven-assembly-plugin/target/maven-assembly-plugin-2.5-SNAPSHOT.jar>
[JENKINS] Recording test results
[INFO]
[INFO] --- maven-plugin-plugin:3.2:addPluginArtifactMetadata (default-addPluginArtifactMetadata) @ maven-assembly-plugin ---
[INFO] Installing <https://builds.apache.org/job/maven-plugins/ws/maven-assembly-plugin/target/maven-assembly-plugin-2.5-SNAPSHOT.jar> to /home/jenkins/jenkins-slave/maven-repositories/0/org/apache/maven/plugins/maven-assembly-plugin/2.5-SNAPSHOT/maven-assembly-plugin-2.5-SNAPSHOT.jar
[INFO]
[INFO] --- maven-install-plugin:2.3.1:install (default-install) @ maven-assembly-plugin ---
[INFO] Installing <https://builds.apache.org/job/maven-plugins/ws/maven-assembly-plugin/pom.xml> to /home/jenkins/jenkins-slave/maven-repositories/0/org/apache/maven/plugins/maven-assembly-plugin/2.5-SNAPSHOT/maven-assembly-plugin-2.5-SNAPSHOT.pom
[INFO]
[INFO] --- maven-jar-plugin:2.4:jar (default-jar) @ maven-changelog-plugin ---
[INFO] Building jar: <https://builds.apache.org/job/maven-plugins/ws/maven-changelog-plugin/target/maven-changelog-plugin-2.3-SNAPSHOT.jar>
[INFO]
[INFO] --- maven-plugin-plugin:3.2:addPluginArtifactMetadata (default-addPluginArtifactMetadata) @ maven-changelog-plugin ---
[INFO] Installing <https://builds.apache.org/job/maven-plugins/ws/maven-changelog-plugin/target/maven-changelog-plugin-2.3-SNAPSHOT.jar> to /home/jenkins/jenkins-slave/maven-repositories/0/org/apache/maven/plugins/maven-changelog-plugin/2.3-SNAPSHOT/maven-changelog-plugin-2.3-SNAPSHOT.jar
[INFO] Installing <https://builds.apache.org/job/maven-plugins/ws/maven-changelog-plugin/pom.xml> to /home/jenkins/jenkins-slave/maven-repositories/0/org/apache/maven/plugins/maven-changelog-plugin/2.3-SNAPSHOT/maven-changelog-plugin-2.3-SNAPSHOT.pom
[INFO]
[INFO] --- maven-install-plugin:2.3.1:install (default-install) @ maven-changelog-plugin ---
[INFO] [WARNING] *****************************************************************
[WARNING] * Your build is requesting parallel execution, but project *
[WARNING] * contains the following plugin(s) that are not marked as *
[WARNING] * @threadSafe to support parallel building. *
[WARNING] * While this /may/ work fine, please look for plugin updates *
[WARNING] * and/or request plugins be made thread-safe. *
[WARNING] * If reporting an issue, report it against the plugin in *
[WARNING] * question, not against maven-core *
[WARNING] *****************************************************************
[WARNING] The following plugins are not marked @threadSafe in Maven Checkstyle Plugin:
[WARNING] org.codehaus.plexus:plexus-component-metadata:1.5.5
[WARNING] *****************************************************************
[INFO] ------------------------------------------------------------------------
[INFO] Building Maven Checkstyle Plugin 2.11-SNAPSHOT
[INFO] ------------------------------------------------------------------------
[INFO] Deleting <https://builds.apache.org/job/maven-plugins/ws/maven-checkstyle-plugin/target>
[INFO]
[INFO] --- maven-clean-plugin:2.5:clean (default-clean) @ maven-checkstyle-plugin ---
[INFO]
[INFO] ------------------------------------------------------------------------
[INFO] Building Maven Clean Plugin 2.6-SNAPSHOT
[INFO] ------------------------------------------------------------------------
[INFO] Deleting <https://builds.apache.org/job/maven-plugins/ws/maven-clean-plugin/target>
[INFO]
[INFO] --- maven-clean-plugin:2.5:clean (default-clean) @ maven-clean-plugin ---
[INFO] [INFO] Deleting <https://builds.apache.org/job/maven-plugins/ws/maven-changes-plugin/target>
[INFO] --- maven-clean-plugin:2.5:clean (default-clean) @ maven-changes-plugin ---
[INFO]
[INFO] --- maven-enforcer-plugin:1.0.1:enforce (ensure-no-container-api) @ maven-clean-plugin ---
[INFO]
[INFO] --- maven-enforcer-plugin:1.0.1:enforce (ensure-no-container-api) @ maven-checkstyle-plugin ---
[INFO] Using 'UTF-8' encoding to read mojo metadata.
[INFO] Applying mojo extractor for language: java
[INFO]
[INFO] --- maven-plugin-plugin:3.2:helpmojo (generated-helpmojo) @ maven-clean-plugin ---
[INFO] Mojo extractor for language: java found 0 mojo descriptors.
[INFO] Applying mojo extractor for language: bsh
[INFO] Mojo extractor for language: bsh found 0 mojo descriptors.
[INFO] Applying mojo extractor for language: java-annotations
[INFO] Mojo extractor for language: java-annotations found 0 mojo descriptors.
[INFO]
[INFO] --- maven-enforcer-plugin:1.0.1:enforce (ensure-no-container-api) @ maven-changes-plugin ---
[INFO] [INFO] Using 'UTF-8' encoding to read mojo metadata.
[INFO] Applying mojo extractor for language: java
[INFO] Using 'UTF-8' encoding to read mojo metadata.
[INFO] --- maven-plugin-plugin:3.2:descriptor (default-descriptor) @ maven-clean-plugin ---
[INFO] Applying mojo extractor for language: java
[INFO] Mojo extractor for language: java found 0 mojo descriptors.
[INFO] Applying mojo extractor for language: bsh
[INFO] Mojo extractor for language: bsh found 0 mojo descriptors.
[INFO] Applying mojo extractor for language: java-annotations
[INFO]
[INFO] --- maven-plugin-plugin:3.2:helpmojo (generated-helpmojo) @ maven-checkstyle-plugin ---
[INFO] Mojo extractor for language: java-annotations found 0 mojo descriptors.
[INFO]
[INFO] --- maven-remote-resources-plugin:1.3:process (default) @ maven-clean-plugin ---
[INFO] Mojo extractor for language: java found 0 mojo descriptors.
[INFO] Applying mojo extractor for language: bsh
[INFO] Mojo extractor for language: bsh found 0 mojo descriptors.
[INFO] Applying mojo extractor for language: java-annotations
[INFO] [debug] execute contextualize
[INFO] Using 'UTF-8' encoding to copy filtered resources.
[INFO] skip non existing resourceDirectory <https://builds.apache.org/job/maven-plugins/ws/maven-clean-plugin/src/main/resources>
[INFO] Copying 3 resources
[INFO] --- maven-resources-plugin:2.5:resources (default-resources) @ maven-clean-plugin ---
[INFO] [INFO] Compiling 6 source files to <https://builds.apache.org/job/maven-plugins/ws/maven-clean-plugin/target/classes>
[INFO] --- maven-compiler-plugin:2.5.1:compile (default-compile) @ maven-clean-plugin ---
[INFO] Using 'UTF-8' encoding to read mojo metadata.
[INFO] Applying mojo extractor for language: java
[INFO] [INFO] Mojo extractor for language: java found 0 mojo descriptors.
[INFO] Applying mojo extractor for language: bsh
[INFO] Mojo extractor for language: bsh found 0 mojo descriptors.
[INFO] Applying mojo extractor for language: java-annotations
[INFO] --- maven-plugin-plugin:3.2:descriptor (mojo-descriptor) @ maven-clean-plugin ---
[INFO] Mojo extractor for language: java-annotations found 2 mojo descriptors.
[INFO] [debug] execute contextualize
[INFO] Using 'UTF-8' encoding to copy filtered resources.
[INFO] --- maven-resources-plugin:2.5:testResources (default-testResources) @ maven-clean-plugin ---
[INFO] [INFO] Using 'UTF-8' encoding to read mojo metadata.
[INFO] Applying mojo extractor for language: java
[INFO] --- maven-plugin-plugin:3.2:helpmojo (generated-helpmojo) @ maven-changes-plugin ---
[INFO] Copying 23 resources
[INFO] Copying 3 resources
[INFO] [INFO] Compiling 2 source files to <https://builds.apache.org/job/maven-plugins/ws/maven-clean-plugin/target/test-classes>
[INFO] Mojo extractor for language: java-annotations found 0 mojo descriptors.
[INFO] --- maven-compiler-plugin:2.5.1:testCompile (default-testCompile) @ maven-clean-plugin ---
[INFO] Mojo extractor for language: java found 0 mojo descriptors.
[INFO] Applying mojo extractor for language: bsh
[INFO] Mojo extractor for language: bsh found 0 mojo descriptors.
[INFO] Applying mojo extractor for language: java-annotations
[INFO] Using 'UTF-8' encoding to read mojo metadata.
[INFO] Applying mojo extractor for language: java
[INFO]
[INFO] --- maven-plugin-plugin:3.2:descriptor (default-descriptor) @ maven-checkstyle-plugin ---
[INFO] Surefire report directory: <https://builds.apache.org/job/maven-plugins/ws/maven-clean-plugin/target/surefire-reports>
-------------------------------------------------------
T E S T S
-------------------------------------------------------
[INFO]
[INFO] --- maven-surefire-plugin:2.12:test (default-test) @ maven-clean-plugin ---
[INFO] Mojo extractor for language: java found 0 mojo descriptors.
[INFO] Applying mojo extractor for language: bsh
[INFO] Mojo extractor for language: bsh found 0 mojo descriptors.
[INFO] Applying mojo extractor for language: java-annotations
Running org.apache.maven.plugin.clean.CleanMojoTest
[INFO] Mojo extractor for language: java-annotations found 0 mojo descriptors.
[INFO] [INFO] Deleting <https://builds.apache.org/job/maven-plugins/ws/maven-clean-plugin/target/test-classes/unit/basic-clean-test/buildDirectory>
[INFO] Deleting file <https://builds.apache.org/job/maven-plugins/ws/maven-clean-plugin/target/test-classes/unit/basic-clean-test/buildDirectory/file.txt>
[INFO] Deleting directory <https://builds.apache.org/job/maven-plugins/ws/maven-clean-plugin/target/test-classes/unit/basic-clean-test/buildDirectory>
[INFO] Deleting <https://builds.apache.org/job/maven-plugins/ws/maven-clean-plugin/target/test-classes/unit/basic-clean-test/buildOutputDirectory>
[INFO] Deleting file <https://builds.apache.org/job/maven-plugins/ws/maven-clean-plugin/target/test-classes/unit/basic-clean-test/buildOutputDirectory/file.txt>
[INFO] Deleting directory <https://builds.apache.org/job/maven-plugins/ws/maven-clean-plugin/target/test-classes/unit/basic-clean-test/buildOutputDirectory>
[INFO] Deleting <https://builds.apache.org/job/maven-plugins/ws/maven-clean-plugin/target/test-classes/unit/basic-clean-test/buildTestDirectory>
[INFO] Deleting file <https://builds.apache.org/job/maven-plugins/ws/maven-clean-plugin/target/test-classes/unit/basic-clean-test/buildTestDirectory/file.txt>
[INFO] Deleting directory <https://builds.apache.org/job/maven-plugins/ws/maven-clean-plugin/target/test-classes/unit/basic-clean-test/buildTestDirectory>
[INFO] --- maven-remote-resources-plugin:1.4:process (default) @ maven-checkstyle-plugin ---
[INFO] Deleting <https://builds.apache.org/job/maven-plugins/ws/maven-clean-plugin/target/test-classes/unit/nested-clean-test/target>
[INFO] Deleting file <https://builds.apache.org/job/maven-plugins/ws/maven-clean-plugin/target/test-classes/unit/nested-clean-test/target/subdir/file.txt>
[INFO] Deleting directory <https://builds.apache.org/job/maven-plugins/ws/maven-clean-plugin/target/test-classes/unit/nested-clean-test/target/subdir>
[INFO] Deleting file <https://builds.apache.org/job/maven-plugins/ws/maven-clean-plugin/target/test-classes/unit/nested-clean-test/target/test-classes/file.txt>
[INFO] Deleting directory <https://builds.apache.org/job/maven-plugins/ws/maven-clean-plugin/target/test-classes/unit/nested-clean-test/target/test-classes>
[INFO] Deleting file <https://builds.apache.org/job/maven-plugins/ws/maven-clean-plugin/target/test-classes/unit/nested-clean-test/target/classes/file.txt>
[INFO] Deleting directory <https://builds.apache.org/job/maven-plugins/ws/maven-clean-plugin/target/test-classes/unit/nested-clean-test/target/classes>
[INFO] Deleting file <https://builds.apache.org/job/maven-plugins/ws/maven-clean-plugin/target/test-classes/unit/nested-clean-test/target/file.txt>
[INFO] Deleting directory <https://builds.apache.org/job/maven-plugins/ws/maven-clean-plugin/target/test-classes/unit/nested-clean-test/target>
[INFO] Deleting <https://builds.apache.org/job/maven-plugins/ws/maven-clean-plugin/target/test-classes/unit/fileset-clean-test/target> (includes = [**/file.txt, **/test-classes/**], excludes = [**/subdir/**])
[INFO] Deleting file <https://builds.apache.org/job/maven-plugins/ws/maven-clean-plugin/target/test-classes/unit/fileset-clean-test/target/test-classes/file.txt>
[INFO] Deleting directory <https://builds.apache.org/job/maven-plugins/ws/maven-clean-plugin/target/test-classes/unit/fileset-clean-test/target/test-classes>
[INFO] Deleting file <https://builds.apache.org/job/maven-plugins/ws/maven-clean-plugin/target/test-classes/unit/fileset-clean-test/target/classes/file.txt>
[INFO] Deleting file <https://builds.apache.org/job/maven-plugins/ws/maven-clean-plugin/target/test-classes/unit/fileset-clean-test/target/file.txt>
[INFO] Deleting <https://builds.apache.org/job/maven-plugins/ws/maven-clean-plugin/target/test-classes/unit/fileset-clean-test/buildOutputDirectory> (includes = [**], excludes = [null])
[INFO] Deleting file <https://builds.apache.org/job/maven-plugins/ws/maven-clean-plugin/target/test-classes/unit/fileset-clean-test/buildOutputDirectory/file.txt>
Tests run: 8, Failures: 0, Errors: 0, Skipped: 0, Time elapsed: 1.703 sec
Results :
Tests run: 8, Failures: 0, Errors: 0, Skipped: 0
[JENKINS] Recording test results
[INFO]
[INFO] --- maven-resources-plugin:2.6:resources (default-resources) @ maven-checkstyle-plugin ---
[INFO] Using 'UTF-8' encoding to copy filtered resources.
[INFO] [INFO] Copying 15 resources
[INFO] --- maven-jar-plugin:2.4:jar (default-jar) @ maven-clean-plugin ---
[INFO] Copying 3 resources
Feb 17, 2013 2:12:35 PM hudson.remoting.SynchronousCommandTransport$ReaderThread run
SEVERE: I/O error in channel channel
java.io.StreamCorruptedException
at java.io.ObjectInputStream.readObject0(ObjectInputStream.java:1332)
at java.io.ObjectInputStream.readObject(ObjectInputStream.java:348)
at hudson.remoting.Command.readFrom(Command.java:92)
at hudson.remoting.ClassicCommandTransport.read(ClassicCommandTransport.java:59)
at hudson.remoting.SynchronousCommandTransport$ReaderThread.run(SynchronousCommandTransport.java:48)
channel stopped
ERROR: Maven JVM terminated unexpectedly with exit code 0
[WARNINGS] Skipping publisher since build result is FAILURE
Jenkins build is back to normal : maven-plugins #1433
Posted by Apache Jenkins Server <je...@builds.apache.org>.
See <https://builds.apache.org/job/maven-plugins/1433/changes>