You are viewing a plain text version of this content. The canonical link for it is here.
Posted to dev@lucene.apache.org by Apache Jenkins Server <je...@builds.apache.org> on 2018/11/07 17:08:25 UTC
[JENKINS] Lucene-Solr-Tests-7.x - Build # 1013 - Still Unstable
Build: https://builds.apache.org/job/Lucene-Solr-Tests-7.x/1013/
3 tests failed.
FAILED: org.apache.solr.cloud.ShardRoutingTest.test
Error Message:
Error from server at https://127.0.0.1:37997: At least one of the node(s) specified [127.0.0.1:36315_] are not currently active in [], no action taken.
Stack Trace:
org.apache.solr.client.solrj.impl.HttpSolrClient$RemoteSolrException: Error from server at https://127.0.0.1:37997: At least one of the node(s) specified [127.0.0.1:36315_] are not currently active in [], no action taken.
at __randomizedtesting.SeedInfo.seed([3BAEA117C8AFA6D0:B3FA9ECD6653CB28]:0)
at org.apache.solr.client.solrj.impl.HttpSolrClient.executeMethod(HttpSolrClient.java:643)
at org.apache.solr.client.solrj.impl.HttpSolrClient.request(HttpSolrClient.java:255)
at org.apache.solr.client.solrj.impl.HttpSolrClient.request(HttpSolrClient.java:244)
at org.apache.solr.client.solrj.impl.LBHttpSolrClient.doRequest(LBHttpSolrClient.java:483)
at org.apache.solr.client.solrj.impl.LBHttpSolrClient.request(LBHttpSolrClient.java:413)
at org.apache.solr.client.solrj.impl.CloudSolrClient.sendRequest(CloudSolrClient.java:1107)
at org.apache.solr.client.solrj.impl.CloudSolrClient.requestWithRetryOnStaleState(CloudSolrClient.java:884)
at org.apache.solr.client.solrj.impl.CloudSolrClient.request(CloudSolrClient.java:817)
at org.apache.solr.client.solrj.SolrRequest.process(SolrRequest.java:194)
at org.apache.solr.client.solrj.SolrRequest.process(SolrRequest.java:211)
at org.apache.solr.cloud.AbstractFullDistribZkTestBase.createJettys(AbstractFullDistribZkTestBase.java:425)
at org.apache.solr.cloud.AbstractFullDistribZkTestBase.createServers(AbstractFullDistribZkTestBase.java:341)
at org.apache.solr.BaseDistributedSearchTestCase$ShardsRepeatRule$ShardsFixedStatement.callStatement(BaseDistributedSearchTestCase.java:1008)
at org.apache.solr.BaseDistributedSearchTestCase$ShardsRepeatRule$ShardsStatement.evaluate(BaseDistributedSearchTestCase.java:985)
at com.carrotsearch.randomizedtesting.rules.SystemPropertiesRestoreRule$1.evaluate(SystemPropertiesRestoreRule.java:57)
at org.apache.lucene.util.TestRuleSetupTeardownChained$1.evaluate(TestRuleSetupTeardownChained.java:49)
at org.apache.lucene.util.AbstractBeforeAfterRule$1.evaluate(AbstractBeforeAfterRule.java:45)
at org.apache.lucene.util.TestRuleThreadAndTestName$1.evaluate(TestRuleThreadAndTestName.java:48)
at org.apache.lucene.util.TestRuleIgnoreAfterMaxFailures$1.evaluate(TestRuleIgnoreAfterMaxFailures.java:64)
at org.apache.lucene.util.TestRuleMarkFailure$1.evaluate(TestRuleMarkFailure.java:47)
at com.carrotsearch.randomizedtesting.rules.StatementAdapter.evaluate(StatementAdapter.java:36)
at com.carrotsearch.randomizedtesting.ThreadLeakControl$StatementRunner.run(ThreadLeakControl.java:368)
at com.carrotsearch.randomizedtesting.ThreadLeakControl.forkTimeoutingTask(ThreadLeakControl.java:817)
at com.carrotsearch.randomizedtesting.ThreadLeakControl$3.evaluate(ThreadLeakControl.java:468)
at com.carrotsearch.randomizedtesting.RandomizedRunner.runSingleTest(RandomizedRunner.java:944)
at com.carrotsearch.randomizedtesting.RandomizedRunner$5.evaluate(RandomizedRunner.java:830)
at com.carrotsearch.randomizedtesting.RandomizedRunner$6.evaluate(RandomizedRunner.java:880)
at com.carrotsearch.randomizedtesting.RandomizedRunner$7.evaluate(RandomizedRunner.java:891)
at com.carrotsearch.randomizedtesting.rules.StatementAdapter.evaluate(StatementAdapter.java:36)
at com.carrotsearch.randomizedtesting.rules.SystemPropertiesRestoreRule$1.evaluate(SystemPropertiesRestoreRule.java:57)
at org.apache.lucene.util.AbstractBeforeAfterRule$1.evaluate(AbstractBeforeAfterRule.java:45)
at com.carrotsearch.randomizedtesting.rules.StatementAdapter.evaluate(StatementAdapter.java:36)
at org.apache.lucene.util.TestRuleStoreClassName$1.evaluate(TestRuleStoreClassName.java:41)
at com.carrotsearch.randomizedtesting.rules.NoShadowingOrOverridesOnMethodsRule$1.evaluate(NoShadowingOrOverridesOnMethodsRule.java:40)
at com.carrotsearch.randomizedtesting.rules.NoShadowingOrOverridesOnMethodsRule$1.evaluate(NoShadowingOrOverridesOnMethodsRule.java:40)
at com.carrotsearch.randomizedtesting.rules.StatementAdapter.evaluate(StatementAdapter.java:36)
at com.carrotsearch.randomizedtesting.rules.StatementAdapter.evaluate(StatementAdapter.java:36)
at com.carrotsearch.randomizedtesting.rules.StatementAdapter.evaluate(StatementAdapter.java:36)
at org.apache.lucene.util.TestRuleAssertionsRequired$1.evaluate(TestRuleAssertionsRequired.java:53)
at org.apache.lucene.util.TestRuleMarkFailure$1.evaluate(TestRuleMarkFailure.java:47)
at org.apache.lucene.util.TestRuleIgnoreAfterMaxFailures$1.evaluate(TestRuleIgnoreAfterMaxFailures.java:64)
at org.apache.lucene.util.TestRuleIgnoreTestSuites$1.evaluate(TestRuleIgnoreTestSuites.java:54)
at com.carrotsearch.randomizedtesting.rules.StatementAdapter.evaluate(StatementAdapter.java:36)
at com.carrotsearch.randomizedtesting.ThreadLeakControl$StatementRunner.run(ThreadLeakControl.java:368)
at java.lang.Thread.run(Thread.java:748)
FAILED: junit.framework.TestSuite.org.apache.solr.cloud.ShardRoutingTest
Error Message:
50 threads leaked from SUITE scope at org.apache.solr.cloud.ShardRoutingTest: 1) Thread[id=10844, name=qtp985233978-10844-acceptor-0@63a207b7-ServerConnector@ab0544c{SSL,[ssl, http/1.1]}{127.0.0.1:36315}, state=RUNNABLE, group=TGRP-ShardRoutingTest] at sun.nio.ch.ServerSocketChannelImpl.accept0(Native Method) at sun.nio.ch.ServerSocketChannelImpl.accept(ServerSocketChannelImpl.java:422) at sun.nio.ch.ServerSocketChannelImpl.accept(ServerSocketChannelImpl.java:250) at org.eclipse.jetty.server.ServerConnector.accept(ServerConnector.java:369) at org.eclipse.jetty.server.AbstractConnector$Acceptor.run(AbstractConnector.java:639) at org.eclipse.jetty.util.thread.QueuedThreadPool.runJob(QueuedThreadPool.java:762) at org.eclipse.jetty.util.thread.QueuedThreadPool$2.run(QueuedThreadPool.java:680) at java.lang.Thread.run(Thread.java:748) 2) Thread[id=10832, name=Thread-1241, state=WAITING, group=TGRP-ShardRoutingTest] at java.lang.Object.wait(Native Method) at java.lang.Object.wait(Object.java:502) at org.apache.solr.core.CloserThread.run(CoreContainer.java:1850) 3) Thread[id=10889, name=zkConnectionManagerCallback-4259-thread-1-EventThread, state=WAITING, group=TGRP-ShardRoutingTest] at sun.misc.Unsafe.park(Native Method) at java.util.concurrent.locks.LockSupport.park(LockSupport.java:175) at java.util.concurrent.locks.AbstractQueuedSynchronizer$ConditionObject.await(AbstractQueuedSynchronizer.java:2039) at java.util.concurrent.LinkedBlockingQueue.take(LinkedBlockingQueue.java:442) at org.apache.zookeeper.ClientCnxn$EventThread.run(ClientCnxn.java:502) 4) Thread[id=10818, name=Connection evictor, state=TIMED_WAITING, group=TGRP-ShardRoutingTest] at java.lang.Thread.sleep(Native Method) at org.apache.http.impl.client.IdleConnectionEvictor$1.run(IdleConnectionEvictor.java:66) at java.lang.Thread.run(Thread.java:748) 5) Thread[id=10873, name=zkConnectionManagerCallback-4275-thread-1, state=WAITING, group=TGRP-ShardRoutingTest] at sun.misc.Unsafe.park(Native Method) at java.util.concurrent.locks.LockSupport.park(LockSupport.java:175) at java.util.concurrent.locks.AbstractQueuedSynchronizer$ConditionObject.await(AbstractQueuedSynchronizer.java:2039) at java.util.concurrent.LinkedBlockingQueue.take(LinkedBlockingQueue.java:442) at java.util.concurrent.ThreadPoolExecutor.getTask(ThreadPoolExecutor.java:1074) at java.util.concurrent.ThreadPoolExecutor.runWorker(ThreadPoolExecutor.java:1134) at java.util.concurrent.ThreadPoolExecutor$Worker.run(ThreadPoolExecutor.java:624) at java.lang.Thread.run(Thread.java:748) 6) Thread[id=10875, name=MetricsHistoryHandler-3147-thread-1, state=TIMED_WAITING, group=TGRP-ShardRoutingTest] at sun.misc.Unsafe.park(Native Method) at java.util.concurrent.locks.LockSupport.parkNanos(LockSupport.java:215) at java.util.concurrent.locks.AbstractQueuedSynchronizer$ConditionObject.awaitNanos(AbstractQueuedSynchronizer.java:2078) at java.util.concurrent.ScheduledThreadPoolExecutor$DelayedWorkQueue.take(ScheduledThreadPoolExecutor.java:1093) at java.util.concurrent.ScheduledThreadPoolExecutor$DelayedWorkQueue.take(ScheduledThreadPoolExecutor.java:809) at java.util.concurrent.ThreadPoolExecutor.getTask(ThreadPoolExecutor.java:1074) at java.util.concurrent.ThreadPoolExecutor.runWorker(ThreadPoolExecutor.java:1134) at java.util.concurrent.ThreadPoolExecutor$Worker.run(ThreadPoolExecutor.java:624) at java.lang.Thread.run(Thread.java:748) 7) Thread[id=10807, name=qtp224460543-10807-acceptor-0@316bc31f-ServerConnector@7a22dd88{SSL,[ssl, http/1.1]}{127.0.0.1:37997}, state=RUNNABLE, group=TGRP-ShardRoutingTest] at sun.nio.ch.ServerSocketChannelImpl.accept0(Native Method) at sun.nio.ch.ServerSocketChannelImpl.accept(ServerSocketChannelImpl.java:422) at sun.nio.ch.ServerSocketChannelImpl.accept(ServerSocketChannelImpl.java:250) at org.eclipse.jetty.server.ServerConnector.accept(ServerConnector.java:369) at org.eclipse.jetty.server.AbstractConnector$Acceptor.run(AbstractConnector.java:639) at org.eclipse.jetty.util.thread.QueuedThreadPool.runJob(QueuedThreadPool.java:762) at org.eclipse.jetty.util.thread.QueuedThreadPool$2.run(QueuedThreadPool.java:680) at java.lang.Thread.run(Thread.java:748) 8) Thread[id=10812, name=qtp224460543-10812, state=RUNNABLE, group=TGRP-ShardRoutingTest] at sun.nio.ch.EPollArrayWrapper.epollWait(Native Method) at sun.nio.ch.EPollArrayWrapper.poll(EPollArrayWrapper.java:269) at sun.nio.ch.EPollSelectorImpl.doSelect(EPollSelectorImpl.java:93) at sun.nio.ch.SelectorImpl.lockAndDoSelect(SelectorImpl.java:86) at sun.nio.ch.SelectorImpl.select(SelectorImpl.java:97) at sun.nio.ch.SelectorImpl.select(SelectorImpl.java:101) at org.eclipse.jetty.io.ManagedSelector$SelectorProducer.select(ManagedSelector.java:396) at org.eclipse.jetty.io.ManagedSelector$SelectorProducer.produce(ManagedSelector.java:333) at org.eclipse.jetty.util.thread.strategy.EatWhatYouKill.produceTask(EatWhatYouKill.java:357) at org.eclipse.jetty.util.thread.strategy.EatWhatYouKill.doProduce(EatWhatYouKill.java:181) at org.eclipse.jetty.util.thread.strategy.EatWhatYouKill.tryProduce(EatWhatYouKill.java:168) at org.eclipse.jetty.util.thread.strategy.EatWhatYouKill.run(EatWhatYouKill.java:126) at org.eclipse.jetty.util.thread.ReservedThreadExecutor$ReservedThread.run(ReservedThreadExecutor.java:366) at org.eclipse.jetty.util.thread.QueuedThreadPool.runJob(QueuedThreadPool.java:762) at org.eclipse.jetty.util.thread.QueuedThreadPool$2.run(QueuedThreadPool.java:680) at java.lang.Thread.run(Thread.java:748) 9) Thread[id=10838, name=searcherExecutor-3135-thread-1, state=WAITING, group=TGRP-ShardRoutingTest] at sun.misc.Unsafe.park(Native Method) at java.util.concurrent.locks.LockSupport.park(LockSupport.java:175) at java.util.concurrent.locks.AbstractQueuedSynchronizer$ConditionObject.await(AbstractQueuedSynchronizer.java:2039) at java.util.concurrent.LinkedBlockingQueue.take(LinkedBlockingQueue.java:442) at java.util.concurrent.ThreadPoolExecutor.getTask(ThreadPoolExecutor.java:1074) at java.util.concurrent.ThreadPoolExecutor.runWorker(ThreadPoolExecutor.java:1134) at java.util.concurrent.ThreadPoolExecutor$Worker.run(ThreadPoolExecutor.java:624) at java.lang.Thread.run(Thread.java:748) 10) Thread[id=10907, name=SolrRrdBackendFactory-3132-thread-2, state=WAITING, group=TGRP-ShardRoutingTest] at sun.misc.Unsafe.park(Native Method) at java.util.concurrent.locks.LockSupport.park(LockSupport.java:175) at java.util.concurrent.locks.AbstractQueuedSynchronizer$ConditionObject.await(AbstractQueuedSynchronizer.java:2039) at java.util.concurrent.ScheduledThreadPoolExecutor$DelayedWorkQueue.take(ScheduledThreadPoolExecutor.java:1088) at java.util.concurrent.ScheduledThreadPoolExecutor$DelayedWorkQueue.take(ScheduledThreadPoolExecutor.java:809) at java.util.concurrent.ThreadPoolExecutor.getTask(ThreadPoolExecutor.java:1074) at java.util.concurrent.ThreadPoolExecutor.runWorker(ThreadPoolExecutor.java:1134) at java.util.concurrent.ThreadPoolExecutor$Worker.run(ThreadPoolExecutor.java:624) at java.lang.Thread.run(Thread.java:748) 11) Thread[id=10863, name=Connection evictor, state=TIMED_WAITING, group=TGRP-ShardRoutingTest] at java.lang.Thread.sleep(Native Method) at org.apache.http.impl.client.IdleConnectionEvictor$1.run(IdleConnectionEvictor.java:66) at java.lang.Thread.run(Thread.java:748) 12) Thread[id=10834, name=Scheduler-637235469, state=TIMED_WAITING, group=TGRP-ShardRoutingTest] at sun.misc.Unsafe.park(Native Method) at java.util.concurrent.locks.LockSupport.parkNanos(LockSupport.java:215) at java.util.concurrent.locks.AbstractQueuedSynchronizer$ConditionObject.awaitNanos(AbstractQueuedSynchronizer.java:2078) at java.util.concurrent.ScheduledThreadPoolExecutor$DelayedWorkQueue.take(ScheduledThreadPoolExecutor.java:1093) at java.util.concurrent.ScheduledThreadPoolExecutor$DelayedWorkQueue.take(ScheduledThreadPoolExecutor.java:809) at java.util.concurrent.ThreadPoolExecutor.getTask(ThreadPoolExecutor.java:1074) at java.util.concurrent.ThreadPoolExecutor.runWorker(ThreadPoolExecutor.java:1134) at java.util.concurrent.ThreadPoolExecutor$Worker.run(ThreadPoolExecutor.java:624) at java.lang.Thread.run(Thread.java:748) 13) Thread[id=10813, name=Scheduler-1658304632, state=TIMED_WAITING, group=TGRP-ShardRoutingTest] at sun.misc.Unsafe.park(Native Method) at java.util.concurrent.locks.LockSupport.parkNanos(LockSupport.java:215) at java.util.concurrent.locks.AbstractQueuedSynchronizer$ConditionObject.awaitNanos(AbstractQueuedSynchronizer.java:2078) at java.util.concurrent.ScheduledThreadPoolExecutor$DelayedWorkQueue.take(ScheduledThreadPoolExecutor.java:1093) at java.util.concurrent.ScheduledThreadPoolExecutor$DelayedWorkQueue.take(ScheduledThreadPoolExecutor.java:809) at java.util.concurrent.ThreadPoolExecutor.getTask(ThreadPoolExecutor.java:1074) at java.util.concurrent.ThreadPoolExecutor.runWorker(ThreadPoolExecutor.java:1134) at java.util.concurrent.ThreadPoolExecutor$Worker.run(ThreadPoolExecutor.java:624) at java.lang.Thread.run(Thread.java:748) 14) Thread[id=10845, name=qtp985233978-10845, state=TIMED_WAITING, group=TGRP-ShardRoutingTest] at sun.misc.Unsafe.park(Native Method) at java.util.concurrent.locks.LockSupport.parkNanos(LockSupport.java:215) at java.util.concurrent.locks.AbstractQueuedSynchronizer$ConditionObject.awaitNanos(AbstractQueuedSynchronizer.java:2078) at org.eclipse.jetty.util.BlockingArrayQueue.poll(BlockingArrayQueue.java:392) at org.eclipse.jetty.util.thread.QueuedThreadPool.idleJobPoll(QueuedThreadPool.java:653) at org.eclipse.jetty.util.thread.QueuedThreadPool.access$800(QueuedThreadPool.java:48) at org.eclipse.jetty.util.thread.QueuedThreadPool$2.run(QueuedThreadPool.java:717) at java.lang.Thread.run(Thread.java:748) 15) Thread[id=10869, name=zkConnectionManagerCallback-4268-thread-1, state=WAITING, group=TGRP-ShardRoutingTest] at sun.misc.Unsafe.park(Native Method) at java.util.concurrent.locks.LockSupport.park(LockSupport.java:175) at java.util.concurrent.locks.AbstractQueuedSynchronizer$ConditionObject.await(AbstractQueuedSynchronizer.java:2039) at java.util.concurrent.LinkedBlockingQueue.take(LinkedBlockingQueue.java:442) at java.util.concurrent.ThreadPoolExecutor.getTask(ThreadPoolExecutor.java:1074) at java.util.concurrent.ThreadPoolExecutor.runWorker(ThreadPoolExecutor.java:1134) at java.util.concurrent.ThreadPoolExecutor$Worker.run(ThreadPoolExecutor.java:624) at java.lang.Thread.run(Thread.java:748) 16) Thread[id=10867, name=TEST-ShardRoutingTest.test-seed#[3BAEA117C8AFA6D0]-SendThread(127.0.0.1:41436), state=TIMED_WAITING, group=TGRP-ShardRoutingTest] at java.lang.Thread.sleep(Native Method) at org.apache.zookeeper.client.StaticHostProvider.next(StaticHostProvider.java:105) at org.apache.zookeeper.ClientCnxn$SendThread.startConnect(ClientCnxn.java:1000) at org.apache.zookeeper.ClientCnxn$SendThread.run(ClientCnxn.java:1063) 17) Thread[id=10871, name=TEST-ShardRoutingTest.test-seed#[3BAEA117C8AFA6D0]-SendThread(127.0.0.1:41436), state=TIMED_WAITING, group=TGRP-ShardRoutingTest] at java.lang.Thread.sleep(Native Method) at org.apache.zookeeper.client.StaticHostProvider.next(StaticHostProvider.java:105) at org.apache.zookeeper.ClientCnxn$SendThread.startConnect(ClientCnxn.java:1000) at org.apache.zookeeper.ClientCnxn$SendThread.run(ClientCnxn.java:1063) 18) Thread[id=10846, name=qtp985233978-10846, state=TIMED_WAITING, group=TGRP-ShardRoutingTest] at sun.misc.Unsafe.park(Native Method) at java.util.concurrent.locks.LockSupport.parkNanos(LockSupport.java:215) at java.util.concurrent.locks.AbstractQueuedSynchronizer$ConditionObject.awaitNanos(AbstractQueuedSynchronizer.java:2078) at org.eclipse.jetty.util.BlockingArrayQueue.poll(BlockingArrayQueue.java:392) at org.eclipse.jetty.util.thread.QueuedThreadPool.idleJobPoll(QueuedThreadPool.java:653) at org.eclipse.jetty.util.thread.QueuedThreadPool.access$800(QueuedThreadPool.java:48) at org.eclipse.jetty.util.thread.QueuedThreadPool$2.run(QueuedThreadPool.java:717) at java.lang.Thread.run(Thread.java:748) 19) Thread[id=10842, name=qtp985233978-10842, state=RUNNABLE, group=TGRP-ShardRoutingTest] at sun.nio.ch.EPollArrayWrapper.epollWait(Native Method) at sun.nio.ch.EPollArrayWrapper.poll(EPollArrayWrapper.java:269) at sun.nio.ch.EPollSelectorImpl.doSelect(EPollSelectorImpl.java:93) at sun.nio.ch.SelectorImpl.lockAndDoSelect(SelectorImpl.java:86) at sun.nio.ch.SelectorImpl.select(SelectorImpl.java:97) at sun.nio.ch.SelectorImpl.select(SelectorImpl.java:101) at org.eclipse.jetty.io.ManagedSelector$SelectorProducer.select(ManagedSelector.java:396) at org.eclipse.jetty.io.ManagedSelector$SelectorProducer.produce(ManagedSelector.java:333) at org.eclipse.jetty.util.thread.strategy.EatWhatYouKill.produceTask(EatWhatYouKill.java:357) at org.eclipse.jetty.util.thread.strategy.EatWhatYouKill.doProduce(EatWhatYouKill.java:181) at org.eclipse.jetty.util.thread.strategy.EatWhatYouKill.tryProduce(EatWhatYouKill.java:168) at org.eclipse.jetty.util.thread.strategy.EatWhatYouKill.produce(EatWhatYouKill.java:132) at org.eclipse.jetty.io.ManagedSelector$$Lambda$31/1763084833.run(Unknown Source) at org.eclipse.jetty.util.thread.QueuedThreadPool.runJob(QueuedThreadPool.java:762) at org.eclipse.jetty.util.thread.QueuedThreadPool$2.run(QueuedThreadPool.java:680) at java.lang.Thread.run(Thread.java:748) 20) Thread[id=10824, name=TEST-ShardRoutingTest.test-seed#[3BAEA117C8AFA6D0]-EventThread, state=WAITING, group=TGRP-ShardRoutingTest] at sun.misc.Unsafe.park(Native Method) at java.util.concurrent.locks.LockSupport.park(LockSupport.java:175) at java.util.concurrent.locks.AbstractQueuedSynchronizer$ConditionObject.await(AbstractQueuedSynchronizer.java:2039) at java.util.concurrent.LinkedBlockingQueue.take(LinkedBlockingQueue.java:442) at org.apache.zookeeper.ClientCnxn$EventThread.run(ClientCnxn.java:502) 21) Thread[id=10861, name=Connection evictor, state=TIMED_WAITING, group=TGRP-ShardRoutingTest] at java.lang.Thread.sleep(Native Method) at org.apache.http.impl.client.IdleConnectionEvictor$1.run(IdleConnectionEvictor.java:66) at java.lang.Thread.run(Thread.java:748) 22) Thread[id=10817, name=Connection evictor, state=TIMED_WAITING, group=TGRP-ShardRoutingTest] at java.lang.Thread.sleep(Native Method) at org.apache.http.impl.client.IdleConnectionEvictor$1.run(IdleConnectionEvictor.java:66) at java.lang.Thread.run(Thread.java:748) 23) Thread[id=10825, name=zkConnectionManagerCallback-4252-thread-1, state=WAITING, group=TGRP-ShardRoutingTest] at sun.misc.Unsafe.park(Native Method) at java.util.concurrent.locks.LockSupport.park(LockSupport.java:175) at java.util.concurrent.locks.AbstractQueuedSynchronizer$ConditionObject.await(AbstractQueuedSynchronizer.java:2039) at java.util.concurrent.LinkedBlockingQueue.take(LinkedBlockingQueue.java:442) at java.util.concurrent.ThreadPoolExecutor.getTask(ThreadPoolExecutor.java:1074) at java.util.concurrent.ThreadPoolExecutor.runWorker(ThreadPoolExecutor.java:1134) at java.util.concurrent.ThreadPoolExecutor$Worker.run(ThreadPoolExecutor.java:624) at java.lang.Thread.run(Thread.java:748) 24) Thread[id=10896, name=OverseerAutoScalingTriggerThread-73626801718951947-127.0.0.1:37997_-n_0000000001, state=WAITING, group=Overseer autoscaling triggers] at java.lang.Object.wait(Native Method) at java.lang.Object.wait(Object.java:502) at org.apache.zookeeper.ClientCnxn.submitRequest(ClientCnxn.java:1409) at org.apache.zookeeper.ZooKeeper.getData(ZooKeeper.java:1213) at org.apache.solr.common.cloud.SolrZkClient.lambda$getData$5(SolrZkClient.java:341) at org.apache.solr.common.cloud.SolrZkClient$$Lambda$48/490700523.execute(Unknown Source) at org.apache.solr.common.cloud.ZkCmdExecutor.retryOperation(ZkCmdExecutor.java:60) at org.apache.solr.common.cloud.SolrZkClient.getData(SolrZkClient.java:341) at org.apache.solr.client.solrj.impl.ZkDistribStateManager.getAutoScalingConfig(ZkDistribStateManager.java:176) at org.apache.solr.client.solrj.cloud.DistribStateManager.getAutoScalingConfig(DistribStateManager.java:83) at org.apache.solr.cloud.autoscaling.OverseerTriggerThread.run(OverseerTriggerThread.java:131) at java.lang.Thread.run(Thread.java:748) 25) Thread[id=10805, name=qtp224460543-10805, state=TIMED_WAITING, group=TGRP-ShardRoutingTest] at sun.misc.Unsafe.park(Native Method) at java.util.concurrent.locks.LockSupport.parkNanos(LockSupport.java:215) at java.util.concurrent.locks.AbstractQueuedSynchronizer$ConditionObject.awaitNanos(AbstractQueuedSynchronizer.java:2078) at org.eclipse.jetty.util.BlockingArrayQueue.poll(BlockingArrayQueue.java:392) at org.eclipse.jetty.util.thread.QueuedThreadPool.idleJobPoll(QueuedThreadPool.java:653) at org.eclipse.jetty.util.thread.QueuedThreadPool.access$800(QueuedThreadPool.java:48) at org.eclipse.jetty.util.thread.QueuedThreadPool$2.run(QueuedThreadPool.java:717) at java.lang.Thread.run(Thread.java:748) 26) Thread[id=10872, name=TEST-ShardRoutingTest.test-seed#[3BAEA117C8AFA6D0]-EventThread, state=WAITING, group=TGRP-ShardRoutingTest] at sun.misc.Unsafe.park(Native Method) at java.util.concurrent.locks.LockSupport.park(LockSupport.java:175) at java.util.concurrent.locks.AbstractQueuedSynchronizer$ConditionObject.await(AbstractQueuedSynchronizer.java:2039) at java.util.concurrent.LinkedBlockingQueue.take(LinkedBlockingQueue.java:442) at org.apache.zookeeper.ClientCnxn$EventThread.run(ClientCnxn.java:502) 27) Thread[id=10819, name=Connection evictor, state=TIMED_WAITING, group=TGRP-ShardRoutingTest] at java.lang.Thread.sleep(Native Method) at org.apache.http.impl.client.IdleConnectionEvictor$1.run(IdleConnectionEvictor.java:66) at java.lang.Thread.run(Thread.java:748) 28) Thread[id=10908, name=SolrRrdBackendFactory-3146-thread-2, state=WAITING, group=TGRP-ShardRoutingTest] at sun.misc.Unsafe.park(Native Method) at java.util.concurrent.locks.LockSupport.park(LockSupport.java:175) at java.util.concurrent.locks.AbstractQueuedSynchronizer$ConditionObject.await(AbstractQueuedSynchronizer.java:2039) at java.util.concurrent.ScheduledThreadPoolExecutor$DelayedWorkQueue.take(ScheduledThreadPoolExecutor.java:1088) at java.util.concurrent.ScheduledThreadPoolExecutor$DelayedWorkQueue.take(ScheduledThreadPoolExecutor.java:809) at java.util.concurrent.ThreadPoolExecutor.getTask(ThreadPoolExecutor.java:1074) at java.util.concurrent.ThreadPoolExecutor.runWorker(ThreadPoolExecutor.java:1134) at java.util.concurrent.ThreadPoolExecutor$Worker.run(ThreadPoolExecutor.java:624) at java.lang.Thread.run(Thread.java:748) 29) Thread[id=10830, name=SolrRrdBackendFactory-3132-thread-1, state=TIMED_WAITING, group=TGRP-ShardRoutingTest] at sun.misc.Unsafe.park(Native Method) at java.util.concurrent.locks.LockSupport.parkNanos(LockSupport.java:215) at java.util.concurrent.locks.AbstractQueuedSynchronizer$ConditionObject.awaitNanos(AbstractQueuedSynchronizer.java:2078) at java.util.concurrent.ScheduledThreadPoolExecutor$DelayedWorkQueue.take(ScheduledThreadPoolExecutor.java:1093) at java.util.concurrent.ScheduledThreadPoolExecutor$DelayedWorkQueue.take(ScheduledThreadPoolExecutor.java:809) at java.util.concurrent.ThreadPoolExecutor.getTask(ThreadPoolExecutor.java:1074) at java.util.concurrent.ThreadPoolExecutor.runWorker(ThreadPoolExecutor.java:1134) at java.util.concurrent.ThreadPoolExecutor$Worker.run(ThreadPoolExecutor.java:624) at java.lang.Thread.run(Thread.java:748) 30) Thread[id=10862, name=Connection evictor, state=TIMED_WAITING, group=TGRP-ShardRoutingTest] at java.lang.Thread.sleep(Native Method) at org.apache.http.impl.client.IdleConnectionEvictor$1.run(IdleConnectionEvictor.java:66) at java.lang.Thread.run(Thread.java:748) 31) Thread[id=10868, name=TEST-ShardRoutingTest.test-seed#[3BAEA117C8AFA6D0]-EventThread, state=WAITING, group=TGRP-ShardRoutingTest] at sun.misc.Unsafe.park(Native Method) at java.util.concurrent.locks.LockSupport.park(LockSupport.java:175) at java.util.concurrent.locks.AbstractQueuedSynchronizer$ConditionObject.await(AbstractQueuedSynchronizer.java:2039) at java.util.concurrent.LinkedBlockingQueue.take(LinkedBlockingQueue.java:442) at org.apache.zookeeper.ClientCnxn$EventThread.run(ClientCnxn.java:502) 32) Thread[id=10823, name=TEST-ShardRoutingTest.test-seed#[3BAEA117C8AFA6D0]-SendThread(127.0.0.1:41436), state=TIMED_WAITING, group=TGRP-ShardRoutingTest] at java.lang.Thread.sleep(Native Method) at org.apache.zookeeper.ClientCnxn$SendThread.run(ClientCnxn.java:1054) 33) Thread[id=10895, name=OverseerCollectionConfigSetProcessor-73626801718951947-127.0.0.1:37997_-n_0000000001, state=TIMED_WAITING, group=Overseer collection creation process.] at java.lang.Thread.sleep(Native Method) at org.apache.solr.common.cloud.ZkCmdExecutor.retryDelay(ZkCmdExecutor.java:111) at org.apache.solr.common.cloud.ZkCmdExecutor.retryOperation(ZkCmdExecutor.java:70) at org.apache.solr.common.cloud.SolrZkClient.getData(SolrZkClient.java:341) at org.apache.solr.cloud.OverseerTaskProcessor.amILeader(OverseerTaskProcessor.java:398) at org.apache.solr.cloud.OverseerTaskProcessor.run(OverseerTaskProcessor.java:157) at java.lang.Thread.run(Thread.java:748) 34) Thread[id=10829, name=zkConnectionManagerCallback-4259-thread-1, state=WAITING, group=TGRP-ShardRoutingTest] at sun.misc.Unsafe.park(Native Method) at java.util.concurrent.locks.LockSupport.park(LockSupport.java:175) at java.util.concurrent.locks.AbstractQueuedSynchronizer$ConditionObject.await(AbstractQueuedSynchronizer.java:2039) at java.util.concurrent.LinkedBlockingQueue.take(LinkedBlockingQueue.java:442) at java.util.concurrent.ThreadPoolExecutor.getTask(ThreadPoolExecutor.java:1074) at java.util.concurrent.ThreadPoolExecutor.runWorker(ThreadPoolExecutor.java:1134) at java.util.concurrent.ThreadPoolExecutor$Worker.run(ThreadPoolExecutor.java:624) at java.lang.Thread.run(Thread.java:748) 35) Thread[id=10848, name=qtp985233978-10848, state=TIMED_WAITING, group=TGRP-ShardRoutingTest] at sun.misc.Unsafe.park(Native Method) at java.util.concurrent.locks.LockSupport.parkNanos(LockSupport.java:215) at java.util.concurrent.locks.AbstractQueuedSynchronizer$ConditionObject.awaitNanos(AbstractQueuedSynchronizer.java:2078) at org.eclipse.jetty.util.BlockingArrayQueue.poll(BlockingArrayQueue.java:392) at org.eclipse.jetty.util.thread.QueuedThreadPool.idleJobPoll(QueuedThreadPool.java:653) at org.eclipse.jetty.util.thread.QueuedThreadPool.access$800(QueuedThreadPool.java:48) at org.eclipse.jetty.util.thread.QueuedThreadPool$2.run(QueuedThreadPool.java:717) at java.lang.Thread.run(Thread.java:748) 36) Thread[id=10874, name=SolrRrdBackendFactory-3146-thread-1, state=TIMED_WAITING, group=TGRP-ShardRoutingTest] at sun.misc.Unsafe.park(Native Method) at java.util.concurrent.locks.LockSupport.parkNanos(LockSupport.java:215) at java.util.concurrent.locks.AbstractQueuedSynchronizer$ConditionObject.awaitNanos(AbstractQueuedSynchronizer.java:2078) at java.util.concurrent.ScheduledThreadPoolExecutor$DelayedWorkQueue.take(ScheduledThreadPoolExecutor.java:1093) at java.util.concurrent.ScheduledThreadPoolExecutor$DelayedWorkQueue.take(ScheduledThreadPoolExecutor.java:809) at java.util.concurrent.ThreadPoolExecutor.getTask(ThreadPoolExecutor.java:1074) at java.util.concurrent.ThreadPoolExecutor.runWorker(ThreadPoolExecutor.java:1134) at java.util.concurrent.ThreadPoolExecutor$Worker.run(ThreadPoolExecutor.java:624) at java.lang.Thread.run(Thread.java:748) 37) Thread[id=10808, name=qtp224460543-10808, state=TIMED_WAITING, group=TGRP-ShardRoutingTest] at sun.misc.Unsafe.park(Native Method) at java.util.concurrent.locks.LockSupport.parkNanos(LockSupport.java:215) at java.util.concurrent.locks.AbstractQueuedSynchronizer$ConditionObject.awaitNanos(AbstractQueuedSynchronizer.java:2078) at org.eclipse.jetty.util.BlockingArrayQueue.poll(BlockingArrayQueue.java:392) at org.eclipse.jetty.util.thread.QueuedThreadPool.idleJobPoll(QueuedThreadPool.java:653) at org.eclipse.jetty.util.thread.QueuedThreadPool.access$800(QueuedThreadPool.java:48) at org.eclipse.jetty.util.thread.QueuedThreadPool$2.run(QueuedThreadPool.java:717) at java.lang.Thread.run(Thread.java:748) 38) Thread[id=10843, name=qtp985233978-10843, state=RUNNABLE, group=TGRP-ShardRoutingTest] at sun.nio.ch.EPollArrayWrapper.epollWait(Native Method) at sun.nio.ch.EPollArrayWrapper.poll(EPollArrayWrapper.java:269) at sun.nio.ch.EPollSelectorImpl.doSelect(EPollSelectorImpl.java:93) at sun.nio.ch.SelectorImpl.lockAndDoSelect(SelectorImpl.java:86) at sun.nio.ch.SelectorImpl.select(SelectorImpl.java:97) at sun.nio.ch.SelectorImpl.select(SelectorImpl.java:101) at org.eclipse.jetty.io.ManagedSelector$SelectorProducer.select(ManagedSelector.java:396) at org.eclipse.jetty.io.ManagedSelector$SelectorProducer.produce(ManagedSelector.java:333) at org.eclipse.jetty.util.thread.strategy.EatWhatYouKill.produceTask(EatWhatYouKill.java:357) at org.eclipse.jetty.util.thread.strategy.EatWhatYouKill.doProduce(EatWhatYouKill.java:181) at org.eclipse.jetty.util.thread.strategy.EatWhatYouKill.tryProduce(EatWhatYouKill.java:168) at org.eclipse.jetty.util.thread.strategy.EatWhatYouKill.produce(EatWhatYouKill.java:132) at org.eclipse.jetty.io.ManagedSelector$$Lambda$31/1763084833.run(Unknown Source) at org.eclipse.jetty.util.thread.QueuedThreadPool.runJob(QueuedThreadPool.java:762) at org.eclipse.jetty.util.thread.QueuedThreadPool$2.run(QueuedThreadPool.java:680) at java.lang.Thread.run(Thread.java:748) 39) Thread[id=10841, name=Connection evictor, state=TIMED_WAITING, group=TGRP-ShardRoutingTest] at java.lang.Thread.sleep(Native Method) at org.apache.http.impl.client.IdleConnectionEvictor$1.run(IdleConnectionEvictor.java:66) at java.lang.Thread.run(Thread.java:748) 40) Thread[id=10850, name=Scheduler-400581374, state=TIMED_WAITING, group=TGRP-ShardRoutingTest] at sun.misc.Unsafe.park(Native Method) at java.util.concurrent.locks.LockSupport.parkNanos(LockSupport.java:215) at java.util.concurrent.locks.AbstractQueuedSynchronizer$ConditionObject.awaitNanos(AbstractQueuedSynchronizer.java:2078) at java.util.concurrent.ScheduledThreadPoolExecutor$DelayedWorkQueue.take(ScheduledThreadPoolExecutor.java:1093) at java.util.concurrent.ScheduledThreadPoolExecutor$DelayedWorkQueue.take(ScheduledThreadPoolExecutor.java:809) at java.util.concurrent.ThreadPoolExecutor.getTask(ThreadPoolExecutor.java:1074) at java.util.concurrent.ThreadPoolExecutor.runWorker(ThreadPoolExecutor.java:1134) at java.util.concurrent.ThreadPoolExecutor$Worker.run(ThreadPoolExecutor.java:624) at java.lang.Thread.run(Thread.java:748) 41) Thread[id=10831, name=MetricsHistoryHandler-3133-thread-1, state=TIMED_WAITING, group=TGRP-ShardRoutingTest] at sun.misc.Unsafe.park(Native Method) at java.util.concurrent.locks.LockSupport.parkNanos(LockSupport.java:215) at java.util.concurrent.locks.AbstractQueuedSynchronizer$ConditionObject.awaitNanos(AbstractQueuedSynchronizer.java:2078) at java.util.concurrent.ScheduledThreadPoolExecutor$DelayedWorkQueue.take(ScheduledThreadPoolExecutor.java:1093) at java.util.concurrent.ScheduledThreadPoolExecutor$DelayedWorkQueue.take(ScheduledThreadPoolExecutor.java:809) at java.util.concurrent.ThreadPoolExecutor.getTask(ThreadPoolExecutor.java:1074) at java.util.concurrent.ThreadPoolExecutor.runWorker(ThreadPoolExecutor.java:1134) at java.util.concurrent.ThreadPoolExecutor$Worker.run(ThreadPoolExecutor.java:624) at java.lang.Thread.run(Thread.java:748) 42) Thread[id=10847, name=qtp985233978-10847, state=TIMED_WAITING, group=TGRP-ShardRoutingTest] at sun.misc.Unsafe.park(Native Method) at java.util.concurrent.locks.LockSupport.parkNanos(LockSupport.java:215) at java.util.concurrent.locks.AbstractQueuedSynchronizer$ConditionObject.awaitNanos(AbstractQueuedSynchronizer.java:2078) at org.eclipse.jetty.util.BlockingArrayQueue.poll(BlockingArrayQueue.java:392) at org.eclipse.jetty.util.thread.QueuedThreadPool.idleJobPoll(QueuedThreadPool.java:653) at org.eclipse.jetty.util.thread.QueuedThreadPool.access$800(QueuedThreadPool.java:48) at org.eclipse.jetty.util.thread.QueuedThreadPool$2.run(QueuedThreadPool.java:717) at java.lang.Thread.run(Thread.java:748) 43) Thread[id=10809, name=qtp224460543-10809, state=TIMED_WAITING, group=TGRP-ShardRoutingTest] at sun.misc.Unsafe.park(Native Method) at java.util.concurrent.locks.LockSupport.parkNanos(LockSupport.java:215) at java.util.concurrent.locks.AbstractQueuedSynchronizer$ConditionObject.await(AbstractQueuedSynchronizer.java:2163) at org.eclipse.jetty.util.thread.ReservedThreadExecutor$ReservedThread.reservedWait(ReservedThreadExecutor.java:292) at org.eclipse.jetty.util.thread.ReservedThreadExecutor$ReservedThread.run(ReservedThreadExecutor.java:357) at org.eclipse.jetty.util.thread.QueuedThreadPool.runJob(QueuedThreadPool.java:762) at org.eclipse.jetty.util.thread.QueuedThreadPool$2.run(QueuedThreadPool.java:680) at java.lang.Thread.run(Thread.java:748) 44) Thread[id=10806, name=qtp224460543-10806, state=TIMED_WAITING, group=TGRP-ShardRoutingTest] at sun.misc.Unsafe.park(Native Method) at java.util.concurrent.locks.LockSupport.parkNanos(LockSupport.java:215) at java.util.concurrent.locks.AbstractQueuedSynchronizer$ConditionObject.awaitNanos(AbstractQueuedSynchronizer.java:2078) at org.eclipse.jetty.util.BlockingArrayQueue.poll(BlockingArrayQueue.java:392) at org.eclipse.jetty.util.thread.QueuedThreadPool.idleJobPoll(QueuedThreadPool.java:653) at org.eclipse.jetty.util.thread.QueuedThreadPool.access$800(QueuedThreadPool.java:48) at org.eclipse.jetty.util.thread.QueuedThreadPool$2.run(QueuedThreadPool.java:717) at java.lang.Thread.run(Thread.java:748) 45) Thread[id=10810, name=qtp224460543-10810, state=TIMED_WAITING, group=TGRP-ShardRoutingTest] at sun.misc.Unsafe.park(Native Method) at java.util.concurrent.locks.LockSupport.parkNanos(LockSupport.java:215) at java.util.concurrent.locks.AbstractQueuedSynchronizer$ConditionObject.awaitNanos(AbstractQueuedSynchronizer.java:2078) at org.eclipse.jetty.util.BlockingArrayQueue.poll(BlockingArrayQueue.java:392) at org.eclipse.jetty.util.thread.QueuedThreadPool.idleJobPoll(QueuedThreadPool.java:653) at org.eclipse.jetty.util.thread.QueuedThreadPool.access$800(QueuedThreadPool.java:48) at org.eclipse.jetty.util.thread.QueuedThreadPool$2.run(QueuedThreadPool.java:717) at java.lang.Thread.run(Thread.java:748) 46) Thread[id=10876, name=Thread-1250, state=WAITING, group=TGRP-ShardRoutingTest] at java.lang.Object.wait(Native Method) at java.lang.Object.wait(Object.java:502) at org.apache.solr.core.CloserThread.run(CoreContainer.java:1850) 47) Thread[id=10894, name=OverseerStateUpdate-73626801718951947-127.0.0.1:37997_-n_0000000001, state=TIMED_WAITING, group=Overseer state updater.] at java.lang.Thread.sleep(Native Method) at org.apache.solr.common.cloud.ZkCmdExecutor.retryDelay(ZkCmdExecutor.java:111) at org.apache.solr.common.cloud.ZkCmdExecutor.retryOperation(ZkCmdExecutor.java:70) at org.apache.solr.common.cloud.SolrZkClient.getData(SolrZkClient.java:341) at org.apache.solr.cloud.Overseer$ClusterStateUpdater.amILeader(Overseer.java:421) at org.apache.solr.cloud.Overseer$ClusterStateUpdater.run(Overseer.java:134) at java.lang.Thread.run(Thread.java:748) 48) Thread[id=10811, name=qtp224460543-10811, state=RUNNABLE, group=TGRP-ShardRoutingTest] at sun.nio.ch.EPollArrayWrapper.epollWait(Native Method) at sun.nio.ch.EPollArrayWrapper.poll(EPollArrayWrapper.java:269) at sun.nio.ch.EPollSelectorImpl.doSelect(EPollSelectorImpl.java:93) at sun.nio.ch.SelectorImpl.lockAndDoSelect(SelectorImpl.java:86) at sun.nio.ch.SelectorImpl.select(SelectorImpl.java:97) at sun.nio.ch.SelectorImpl.select(SelectorImpl.java:101) at org.eclipse.jetty.io.ManagedSelector$SelectorProducer.select(ManagedSelector.java:396) at org.eclipse.jetty.io.ManagedSelector$SelectorProducer.produce(ManagedSelector.java:333) at org.eclipse.jetty.util.thread.strategy.EatWhatYouKill.produceTask(EatWhatYouKill.java:357) at org.eclipse.jetty.util.thread.strategy.EatWhatYouKill.doProduce(EatWhatYouKill.java:181) at org.eclipse.jetty.util.thread.strategy.EatWhatYouKill.tryProduce(EatWhatYouKill.java:168) at org.eclipse.jetty.util.thread.strategy.EatWhatYouKill.run(EatWhatYouKill.java:126) at org.eclipse.jetty.util.thread.ReservedThreadExecutor$ReservedThread.run(ReservedThreadExecutor.java:366) at org.eclipse.jetty.util.thread.QueuedThreadPool.runJob(QueuedThreadPool.java:762) at org.eclipse.jetty.util.thread.QueuedThreadPool$2.run(QueuedThreadPool.java:680) at java.lang.Thread.run(Thread.java:748) 49) Thread[id=10849, name=qtp985233978-10849, state=TIMED_WAITING, group=TGRP-ShardRoutingTest] at sun.misc.Unsafe.park(Native Method) at java.util.concurrent.locks.LockSupport.parkNanos(LockSupport.java:215) at java.util.concurrent.locks.AbstractQueuedSynchronizer$ConditionObject.awaitNanos(AbstractQueuedSynchronizer.java:2078) at org.eclipse.jetty.util.BlockingArrayQueue.poll(BlockingArrayQueue.java:392) at org.eclipse.jetty.util.thread.QueuedThreadPool.idleJobPoll(QueuedThreadPool.java:653) at org.eclipse.jetty.util.thread.QueuedThreadPool.access$800(QueuedThreadPool.java:48) at org.eclipse.jetty.util.thread.QueuedThreadPool$2.run(QueuedThreadPool.java:717) at java.lang.Thread.run(Thread.java:748) 50) Thread[id=10888, name=zkConnectionManagerCallback-4259-thread-1-SendThread(127.0.0.1:41436), state=TIMED_WAITING, group=TGRP-ShardRoutingTest] at java.lang.Thread.sleep(Native Method) at org.apache.zookeeper.client.StaticHostProvider.next(StaticHostProvider.java:105) at org.apache.zookeeper.ClientCnxn$SendThread.startConnect(ClientCnxn.java:1000) at org.apache.zookeeper.ClientCnxn$SendThread.run(ClientCnxn.java:1063)
Stack Trace:
com.carrotsearch.randomizedtesting.ThreadLeakError: 50 threads leaked from SUITE scope at org.apache.solr.cloud.ShardRoutingTest:
1) Thread[id=10844, name=qtp985233978-10844-acceptor-0@63a207b7-ServerConnector@ab0544c{SSL,[ssl, http/1.1]}{127.0.0.1:36315}, state=RUNNABLE, group=TGRP-ShardRoutingTest]
at sun.nio.ch.ServerSocketChannelImpl.accept0(Native Method)
at sun.nio.ch.ServerSocketChannelImpl.accept(ServerSocketChannelImpl.java:422)
at sun.nio.ch.ServerSocketChannelImpl.accept(ServerSocketChannelImpl.java:250)
at org.eclipse.jetty.server.ServerConnector.accept(ServerConnector.java:369)
at org.eclipse.jetty.server.AbstractConnector$Acceptor.run(AbstractConnector.java:639)
at org.eclipse.jetty.util.thread.QueuedThreadPool.runJob(QueuedThreadPool.java:762)
at org.eclipse.jetty.util.thread.QueuedThreadPool$2.run(QueuedThreadPool.java:680)
at java.lang.Thread.run(Thread.java:748)
2) Thread[id=10832, name=Thread-1241, state=WAITING, group=TGRP-ShardRoutingTest]
at java.lang.Object.wait(Native Method)
at java.lang.Object.wait(Object.java:502)
at org.apache.solr.core.CloserThread.run(CoreContainer.java:1850)
3) Thread[id=10889, name=zkConnectionManagerCallback-4259-thread-1-EventThread, state=WAITING, group=TGRP-ShardRoutingTest]
at sun.misc.Unsafe.park(Native Method)
at java.util.concurrent.locks.LockSupport.park(LockSupport.java:175)
at java.util.concurrent.locks.AbstractQueuedSynchronizer$ConditionObject.await(AbstractQueuedSynchronizer.java:2039)
at java.util.concurrent.LinkedBlockingQueue.take(LinkedBlockingQueue.java:442)
at org.apache.zookeeper.ClientCnxn$EventThread.run(ClientCnxn.java:502)
4) Thread[id=10818, name=Connection evictor, state=TIMED_WAITING, group=TGRP-ShardRoutingTest]
at java.lang.Thread.sleep(Native Method)
at org.apache.http.impl.client.IdleConnectionEvictor$1.run(IdleConnectionEvictor.java:66)
at java.lang.Thread.run(Thread.java:748)
5) Thread[id=10873, name=zkConnectionManagerCallback-4275-thread-1, state=WAITING, group=TGRP-ShardRoutingTest]
at sun.misc.Unsafe.park(Native Method)
at java.util.concurrent.locks.LockSupport.park(LockSupport.java:175)
at java.util.concurrent.locks.AbstractQueuedSynchronizer$ConditionObject.await(AbstractQueuedSynchronizer.java:2039)
at java.util.concurrent.LinkedBlockingQueue.take(LinkedBlockingQueue.java:442)
at java.util.concurrent.ThreadPoolExecutor.getTask(ThreadPoolExecutor.java:1074)
at java.util.concurrent.ThreadPoolExecutor.runWorker(ThreadPoolExecutor.java:1134)
at java.util.concurrent.ThreadPoolExecutor$Worker.run(ThreadPoolExecutor.java:624)
at java.lang.Thread.run(Thread.java:748)
6) Thread[id=10875, name=MetricsHistoryHandler-3147-thread-1, state=TIMED_WAITING, group=TGRP-ShardRoutingTest]
at sun.misc.Unsafe.park(Native Method)
at java.util.concurrent.locks.LockSupport.parkNanos(LockSupport.java:215)
at java.util.concurrent.locks.AbstractQueuedSynchronizer$ConditionObject.awaitNanos(AbstractQueuedSynchronizer.java:2078)
at java.util.concurrent.ScheduledThreadPoolExecutor$DelayedWorkQueue.take(ScheduledThreadPoolExecutor.java:1093)
at java.util.concurrent.ScheduledThreadPoolExecutor$DelayedWorkQueue.take(ScheduledThreadPoolExecutor.java:809)
at java.util.concurrent.ThreadPoolExecutor.getTask(ThreadPoolExecutor.java:1074)
at java.util.concurrent.ThreadPoolExecutor.runWorker(ThreadPoolExecutor.java:1134)
at java.util.concurrent.ThreadPoolExecutor$Worker.run(ThreadPoolExecutor.java:624)
at java.lang.Thread.run(Thread.java:748)
7) Thread[id=10807, name=qtp224460543-10807-acceptor-0@316bc31f-ServerConnector@7a22dd88{SSL,[ssl, http/1.1]}{127.0.0.1:37997}, state=RUNNABLE, group=TGRP-ShardRoutingTest]
at sun.nio.ch.ServerSocketChannelImpl.accept0(Native Method)
at sun.nio.ch.ServerSocketChannelImpl.accept(ServerSocketChannelImpl.java:422)
at sun.nio.ch.ServerSocketChannelImpl.accept(ServerSocketChannelImpl.java:250)
at org.eclipse.jetty.server.ServerConnector.accept(ServerConnector.java:369)
at org.eclipse.jetty.server.AbstractConnector$Acceptor.run(AbstractConnector.java:639)
at org.eclipse.jetty.util.thread.QueuedThreadPool.runJob(QueuedThreadPool.java:762)
at org.eclipse.jetty.util.thread.QueuedThreadPool$2.run(QueuedThreadPool.java:680)
at java.lang.Thread.run(Thread.java:748)
8) Thread[id=10812, name=qtp224460543-10812, state=RUNNABLE, group=TGRP-ShardRoutingTest]
at sun.nio.ch.EPollArrayWrapper.epollWait(Native Method)
at sun.nio.ch.EPollArrayWrapper.poll(EPollArrayWrapper.java:269)
at sun.nio.ch.EPollSelectorImpl.doSelect(EPollSelectorImpl.java:93)
at sun.nio.ch.SelectorImpl.lockAndDoSelect(SelectorImpl.java:86)
at sun.nio.ch.SelectorImpl.select(SelectorImpl.java:97)
at sun.nio.ch.SelectorImpl.select(SelectorImpl.java:101)
at org.eclipse.jetty.io.ManagedSelector$SelectorProducer.select(ManagedSelector.java:396)
at org.eclipse.jetty.io.ManagedSelector$SelectorProducer.produce(ManagedSelector.java:333)
at org.eclipse.jetty.util.thread.strategy.EatWhatYouKill.produceTask(EatWhatYouKill.java:357)
at org.eclipse.jetty.util.thread.strategy.EatWhatYouKill.doProduce(EatWhatYouKill.java:181)
at org.eclipse.jetty.util.thread.strategy.EatWhatYouKill.tryProduce(EatWhatYouKill.java:168)
at org.eclipse.jetty.util.thread.strategy.EatWhatYouKill.run(EatWhatYouKill.java:126)
at org.eclipse.jetty.util.thread.ReservedThreadExecutor$ReservedThread.run(ReservedThreadExecutor.java:366)
at org.eclipse.jetty.util.thread.QueuedThreadPool.runJob(QueuedThreadPool.java:762)
at org.eclipse.jetty.util.thread.QueuedThreadPool$2.run(QueuedThreadPool.java:680)
at java.lang.Thread.run(Thread.java:748)
9) Thread[id=10838, name=searcherExecutor-3135-thread-1, state=WAITING, group=TGRP-ShardRoutingTest]
at sun.misc.Unsafe.park(Native Method)
at java.util.concurrent.locks.LockSupport.park(LockSupport.java:175)
at java.util.concurrent.locks.AbstractQueuedSynchronizer$ConditionObject.await(AbstractQueuedSynchronizer.java:2039)
at java.util.concurrent.LinkedBlockingQueue.take(LinkedBlockingQueue.java:442)
at java.util.concurrent.ThreadPoolExecutor.getTask(ThreadPoolExecutor.java:1074)
at java.util.concurrent.ThreadPoolExecutor.runWorker(ThreadPoolExecutor.java:1134)
at java.util.concurrent.ThreadPoolExecutor$Worker.run(ThreadPoolExecutor.java:624)
at java.lang.Thread.run(Thread.java:748)
10) Thread[id=10907, name=SolrRrdBackendFactory-3132-thread-2, state=WAITING, group=TGRP-ShardRoutingTest]
at sun.misc.Unsafe.park(Native Method)
at java.util.concurrent.locks.LockSupport.park(LockSupport.java:175)
at java.util.concurrent.locks.AbstractQueuedSynchronizer$ConditionObject.await(AbstractQueuedSynchronizer.java:2039)
at java.util.concurrent.ScheduledThreadPoolExecutor$DelayedWorkQueue.take(ScheduledThreadPoolExecutor.java:1088)
at java.util.concurrent.ScheduledThreadPoolExecutor$DelayedWorkQueue.take(ScheduledThreadPoolExecutor.java:809)
at java.util.concurrent.ThreadPoolExecutor.getTask(ThreadPoolExecutor.java:1074)
at java.util.concurrent.ThreadPoolExecutor.runWorker(ThreadPoolExecutor.java:1134)
at java.util.concurrent.ThreadPoolExecutor$Worker.run(ThreadPoolExecutor.java:624)
at java.lang.Thread.run(Thread.java:748)
11) Thread[id=10863, name=Connection evictor, state=TIMED_WAITING, group=TGRP-ShardRoutingTest]
at java.lang.Thread.sleep(Native Method)
at org.apache.http.impl.client.IdleConnectionEvictor$1.run(IdleConnectionEvictor.java:66)
at java.lang.Thread.run(Thread.java:748)
12) Thread[id=10834, name=Scheduler-637235469, state=TIMED_WAITING, group=TGRP-ShardRoutingTest]
at sun.misc.Unsafe.park(Native Method)
at java.util.concurrent.locks.LockSupport.parkNanos(LockSupport.java:215)
at java.util.concurrent.locks.AbstractQueuedSynchronizer$ConditionObject.awaitNanos(AbstractQueuedSynchronizer.java:2078)
at java.util.concurrent.ScheduledThreadPoolExecutor$DelayedWorkQueue.take(ScheduledThreadPoolExecutor.java:1093)
at java.util.concurrent.ScheduledThreadPoolExecutor$DelayedWorkQueue.take(ScheduledThreadPoolExecutor.java:809)
at java.util.concurrent.ThreadPoolExecutor.getTask(ThreadPoolExecutor.java:1074)
at java.util.concurrent.ThreadPoolExecutor.runWorker(ThreadPoolExecutor.java:1134)
at java.util.concurrent.ThreadPoolExecutor$Worker.run(ThreadPoolExecutor.java:624)
at java.lang.Thread.run(Thread.java:748)
13) Thread[id=10813, name=Scheduler-1658304632, state=TIMED_WAITING, group=TGRP-ShardRoutingTest]
at sun.misc.Unsafe.park(Native Method)
at java.util.concurrent.locks.LockSupport.parkNanos(LockSupport.java:215)
at java.util.concurrent.locks.AbstractQueuedSynchronizer$ConditionObject.awaitNanos(AbstractQueuedSynchronizer.java:2078)
at java.util.concurrent.ScheduledThreadPoolExecutor$DelayedWorkQueue.take(ScheduledThreadPoolExecutor.java:1093)
at java.util.concurrent.ScheduledThreadPoolExecutor$DelayedWorkQueue.take(ScheduledThreadPoolExecutor.java:809)
at java.util.concurrent.ThreadPoolExecutor.getTask(ThreadPoolExecutor.java:1074)
at java.util.concurrent.ThreadPoolExecutor.runWorker(ThreadPoolExecutor.java:1134)
at java.util.concurrent.ThreadPoolExecutor$Worker.run(ThreadPoolExecutor.java:624)
at java.lang.Thread.run(Thread.java:748)
14) Thread[id=10845, name=qtp985233978-10845, state=TIMED_WAITING, group=TGRP-ShardRoutingTest]
at sun.misc.Unsafe.park(Native Method)
at java.util.concurrent.locks.LockSupport.parkNanos(LockSupport.java:215)
at java.util.concurrent.locks.AbstractQueuedSynchronizer$ConditionObject.awaitNanos(AbstractQueuedSynchronizer.java:2078)
at org.eclipse.jetty.util.BlockingArrayQueue.poll(BlockingArrayQueue.java:392)
at org.eclipse.jetty.util.thread.QueuedThreadPool.idleJobPoll(QueuedThreadPool.java:653)
at org.eclipse.jetty.util.thread.QueuedThreadPool.access$800(QueuedThreadPool.java:48)
at org.eclipse.jetty.util.thread.QueuedThreadPool$2.run(QueuedThreadPool.java:717)
at java.lang.Thread.run(Thread.java:748)
15) Thread[id=10869, name=zkConnectionManagerCallback-4268-thread-1, state=WAITING, group=TGRP-ShardRoutingTest]
at sun.misc.Unsafe.park(Native Method)
at java.util.concurrent.locks.LockSupport.park(LockSupport.java:175)
at java.util.concurrent.locks.AbstractQueuedSynchronizer$ConditionObject.await(AbstractQueuedSynchronizer.java:2039)
at java.util.concurrent.LinkedBlockingQueue.take(LinkedBlockingQueue.java:442)
at java.util.concurrent.ThreadPoolExecutor.getTask(ThreadPoolExecutor.java:1074)
at java.util.concurrent.ThreadPoolExecutor.runWorker(ThreadPoolExecutor.java:1134)
at java.util.concurrent.ThreadPoolExecutor$Worker.run(ThreadPoolExecutor.java:624)
at java.lang.Thread.run(Thread.java:748)
16) Thread[id=10867, name=TEST-ShardRoutingTest.test-seed#[3BAEA117C8AFA6D0]-SendThread(127.0.0.1:41436), state=TIMED_WAITING, group=TGRP-ShardRoutingTest]
at java.lang.Thread.sleep(Native Method)
at org.apache.zookeeper.client.StaticHostProvider.next(StaticHostProvider.java:105)
at org.apache.zookeeper.ClientCnxn$SendThread.startConnect(ClientCnxn.java:1000)
at org.apache.zookeeper.ClientCnxn$SendThread.run(ClientCnxn.java:1063)
17) Thread[id=10871, name=TEST-ShardRoutingTest.test-seed#[3BAEA117C8AFA6D0]-SendThread(127.0.0.1:41436), state=TIMED_WAITING, group=TGRP-ShardRoutingTest]
at java.lang.Thread.sleep(Native Method)
at org.apache.zookeeper.client.StaticHostProvider.next(StaticHostProvider.java:105)
at org.apache.zookeeper.ClientCnxn$SendThread.startConnect(ClientCnxn.java:1000)
at org.apache.zookeeper.ClientCnxn$SendThread.run(ClientCnxn.java:1063)
18) Thread[id=10846, name=qtp985233978-10846, state=TIMED_WAITING, group=TGRP-ShardRoutingTest]
at sun.misc.Unsafe.park(Native Method)
at java.util.concurrent.locks.LockSupport.parkNanos(LockSupport.java:215)
at java.util.concurrent.locks.AbstractQueuedSynchronizer$ConditionObject.awaitNanos(AbstractQueuedSynchronizer.java:2078)
at org.eclipse.jetty.util.BlockingArrayQueue.poll(BlockingArrayQueue.java:392)
at org.eclipse.jetty.util.thread.QueuedThreadPool.idleJobPoll(QueuedThreadPool.java:653)
at org.eclipse.jetty.util.thread.QueuedThreadPool.access$800(QueuedThreadPool.java:48)
at org.eclipse.jetty.util.thread.QueuedThreadPool$2.run(QueuedThreadPool.java:717)
at java.lang.Thread.run(Thread.java:748)
19) Thread[id=10842, name=qtp985233978-10842, state=RUNNABLE, group=TGRP-ShardRoutingTest]
at sun.nio.ch.EPollArrayWrapper.epollWait(Native Method)
at sun.nio.ch.EPollArrayWrapper.poll(EPollArrayWrapper.java:269)
at sun.nio.ch.EPollSelectorImpl.doSelect(EPollSelectorImpl.java:93)
at sun.nio.ch.SelectorImpl.lockAndDoSelect(SelectorImpl.java:86)
at sun.nio.ch.SelectorImpl.select(SelectorImpl.java:97)
at sun.nio.ch.SelectorImpl.select(SelectorImpl.java:101)
at org.eclipse.jetty.io.ManagedSelector$SelectorProducer.select(ManagedSelector.java:396)
at org.eclipse.jetty.io.ManagedSelector$SelectorProducer.produce(ManagedSelector.java:333)
at org.eclipse.jetty.util.thread.strategy.EatWhatYouKill.produceTask(EatWhatYouKill.java:357)
at org.eclipse.jetty.util.thread.strategy.EatWhatYouKill.doProduce(EatWhatYouKill.java:181)
at org.eclipse.jetty.util.thread.strategy.EatWhatYouKill.tryProduce(EatWhatYouKill.java:168)
at org.eclipse.jetty.util.thread.strategy.EatWhatYouKill.produce(EatWhatYouKill.java:132)
at org.eclipse.jetty.io.ManagedSelector$$Lambda$31/1763084833.run(Unknown Source)
at org.eclipse.jetty.util.thread.QueuedThreadPool.runJob(QueuedThreadPool.java:762)
at org.eclipse.jetty.util.thread.QueuedThreadPool$2.run(QueuedThreadPool.java:680)
at java.lang.Thread.run(Thread.java:748)
20) Thread[id=10824, name=TEST-ShardRoutingTest.test-seed#[3BAEA117C8AFA6D0]-EventThread, state=WAITING, group=TGRP-ShardRoutingTest]
at sun.misc.Unsafe.park(Native Method)
at java.util.concurrent.locks.LockSupport.park(LockSupport.java:175)
at java.util.concurrent.locks.AbstractQueuedSynchronizer$ConditionObject.await(AbstractQueuedSynchronizer.java:2039)
at java.util.concurrent.LinkedBlockingQueue.take(LinkedBlockingQueue.java:442)
at org.apache.zookeeper.ClientCnxn$EventThread.run(ClientCnxn.java:502)
21) Thread[id=10861, name=Connection evictor, state=TIMED_WAITING, group=TGRP-ShardRoutingTest]
at java.lang.Thread.sleep(Native Method)
at org.apache.http.impl.client.IdleConnectionEvictor$1.run(IdleConnectionEvictor.java:66)
at java.lang.Thread.run(Thread.java:748)
22) Thread[id=10817, name=Connection evictor, state=TIMED_WAITING, group=TGRP-ShardRoutingTest]
at java.lang.Thread.sleep(Native Method)
at org.apache.http.impl.client.IdleConnectionEvictor$1.run(IdleConnectionEvictor.java:66)
at java.lang.Thread.run(Thread.java:748)
23) Thread[id=10825, name=zkConnectionManagerCallback-4252-thread-1, state=WAITING, group=TGRP-ShardRoutingTest]
at sun.misc.Unsafe.park(Native Method)
at java.util.concurrent.locks.LockSupport.park(LockSupport.java:175)
at java.util.concurrent.locks.AbstractQueuedSynchronizer$ConditionObject.await(AbstractQueuedSynchronizer.java:2039)
at java.util.concurrent.LinkedBlockingQueue.take(LinkedBlockingQueue.java:442)
at java.util.concurrent.ThreadPoolExecutor.getTask(ThreadPoolExecutor.java:1074)
at java.util.concurrent.ThreadPoolExecutor.runWorker(ThreadPoolExecutor.java:1134)
at java.util.concurrent.ThreadPoolExecutor$Worker.run(ThreadPoolExecutor.java:624)
at java.lang.Thread.run(Thread.java:748)
24) Thread[id=10896, name=OverseerAutoScalingTriggerThread-73626801718951947-127.0.0.1:37997_-n_0000000001, state=WAITING, group=Overseer autoscaling triggers]
at java.lang.Object.wait(Native Method)
at java.lang.Object.wait(Object.java:502)
at org.apache.zookeeper.ClientCnxn.submitRequest(ClientCnxn.java:1409)
at org.apache.zookeeper.ZooKeeper.getData(ZooKeeper.java:1213)
at org.apache.solr.common.cloud.SolrZkClient.lambda$getData$5(SolrZkClient.java:341)
at org.apache.solr.common.cloud.SolrZkClient$$Lambda$48/490700523.execute(Unknown Source)
at org.apache.solr.common.cloud.ZkCmdExecutor.retryOperation(ZkCmdExecutor.java:60)
at org.apache.solr.common.cloud.SolrZkClient.getData(SolrZkClient.java:341)
at org.apache.solr.client.solrj.impl.ZkDistribStateManager.getAutoScalingConfig(ZkDistribStateManager.java:176)
at org.apache.solr.client.solrj.cloud.DistribStateManager.getAutoScalingConfig(DistribStateManager.java:83)
at org.apache.solr.cloud.autoscaling.OverseerTriggerThread.run(OverseerTriggerThread.java:131)
at java.lang.Thread.run(Thread.java:748)
25) Thread[id=10805, name=qtp224460543-10805, state=TIMED_WAITING, group=TGRP-ShardRoutingTest]
at sun.misc.Unsafe.park(Native Method)
at java.util.concurrent.locks.LockSupport.parkNanos(LockSupport.java:215)
at java.util.concurrent.locks.AbstractQueuedSynchronizer$ConditionObject.awaitNanos(AbstractQueuedSynchronizer.java:2078)
at org.eclipse.jetty.util.BlockingArrayQueue.poll(BlockingArrayQueue.java:392)
at org.eclipse.jetty.util.thread.QueuedThreadPool.idleJobPoll(QueuedThreadPool.java:653)
at org.eclipse.jetty.util.thread.QueuedThreadPool.access$800(QueuedThreadPool.java:48)
at org.eclipse.jetty.util.thread.QueuedThreadPool$2.run(QueuedThreadPool.java:717)
at java.lang.Thread.run(Thread.java:748)
26) Thread[id=10872, name=TEST-ShardRoutingTest.test-seed#[3BAEA117C8AFA6D0]-EventThread, state=WAITING, group=TGRP-ShardRoutingTest]
at sun.misc.Unsafe.park(Native Method)
at java.util.concurrent.locks.LockSupport.park(LockSupport.java:175)
at java.util.concurrent.locks.AbstractQueuedSynchronizer$ConditionObject.await(AbstractQueuedSynchronizer.java:2039)
at java.util.concurrent.LinkedBlockingQueue.take(LinkedBlockingQueue.java:442)
at org.apache.zookeeper.ClientCnxn$EventThread.run(ClientCnxn.java:502)
27) Thread[id=10819, name=Connection evictor, state=TIMED_WAITING, group=TGRP-ShardRoutingTest]
at java.lang.Thread.sleep(Native Method)
at org.apache.http.impl.client.IdleConnectionEvictor$1.run(IdleConnectionEvictor.java:66)
at java.lang.Thread.run(Thread.java:748)
28) Thread[id=10908, name=SolrRrdBackendFactory-3146-thread-2, state=WAITING, group=TGRP-ShardRoutingTest]
at sun.misc.Unsafe.park(Native Method)
at java.util.concurrent.locks.LockSupport.park(LockSupport.java:175)
at java.util.concurrent.locks.AbstractQueuedSynchronizer$ConditionObject.await(AbstractQueuedSynchronizer.java:2039)
at java.util.concurrent.ScheduledThreadPoolExecutor$DelayedWorkQueue.take(ScheduledThreadPoolExecutor.java:1088)
at java.util.concurrent.ScheduledThreadPoolExecutor$DelayedWorkQueue.take(ScheduledThreadPoolExecutor.java:809)
at java.util.concurrent.ThreadPoolExecutor.getTask(ThreadPoolExecutor.java:1074)
at java.util.concurrent.ThreadPoolExecutor.runWorker(ThreadPoolExecutor.java:1134)
at java.util.concurrent.ThreadPoolExecutor$Worker.run(ThreadPoolExecutor.java:624)
at java.lang.Thread.run(Thread.java:748)
29) Thread[id=10830, name=SolrRrdBackendFactory-3132-thread-1, state=TIMED_WAITING, group=TGRP-ShardRoutingTest]
at sun.misc.Unsafe.park(Native Method)
at java.util.concurrent.locks.LockSupport.parkNanos(LockSupport.java:215)
at java.util.concurrent.locks.AbstractQueuedSynchronizer$ConditionObject.awaitNanos(AbstractQueuedSynchronizer.java:2078)
at java.util.concurrent.ScheduledThreadPoolExecutor$DelayedWorkQueue.take(ScheduledThreadPoolExecutor.java:1093)
at java.util.concurrent.ScheduledThreadPoolExecutor$DelayedWorkQueue.take(ScheduledThreadPoolExecutor.java:809)
at java.util.concurrent.ThreadPoolExecutor.getTask(ThreadPoolExecutor.java:1074)
at java.util.concurrent.ThreadPoolExecutor.runWorker(ThreadPoolExecutor.java:1134)
at java.util.concurrent.ThreadPoolExecutor$Worker.run(ThreadPoolExecutor.java:624)
at java.lang.Thread.run(Thread.java:748)
30) Thread[id=10862, name=Connection evictor, state=TIMED_WAITING, group=TGRP-ShardRoutingTest]
at java.lang.Thread.sleep(Native Method)
at org.apache.http.impl.client.IdleConnectionEvictor$1.run(IdleConnectionEvictor.java:66)
at java.lang.Thread.run(Thread.java:748)
31) Thread[id=10868, name=TEST-ShardRoutingTest.test-seed#[3BAEA117C8AFA6D0]-EventThread, state=WAITING, group=TGRP-ShardRoutingTest]
at sun.misc.Unsafe.park(Native Method)
at java.util.concurrent.locks.LockSupport.park(LockSupport.java:175)
at java.util.concurrent.locks.AbstractQueuedSynchronizer$ConditionObject.await(AbstractQueuedSynchronizer.java:2039)
at java.util.concurrent.LinkedBlockingQueue.take(LinkedBlockingQueue.java:442)
at org.apache.zookeeper.ClientCnxn$EventThread.run(ClientCnxn.java:502)
32) Thread[id=10823, name=TEST-ShardRoutingTest.test-seed#[3BAEA117C8AFA6D0]-SendThread(127.0.0.1:41436), state=TIMED_WAITING, group=TGRP-ShardRoutingTest]
at java.lang.Thread.sleep(Native Method)
at org.apache.zookeeper.ClientCnxn$SendThread.run(ClientCnxn.java:1054)
33) Thread[id=10895, name=OverseerCollectionConfigSetProcessor-73626801718951947-127.0.0.1:37997_-n_0000000001, state=TIMED_WAITING, group=Overseer collection creation process.]
at java.lang.Thread.sleep(Native Method)
at org.apache.solr.common.cloud.ZkCmdExecutor.retryDelay(ZkCmdExecutor.java:111)
at org.apache.solr.common.cloud.ZkCmdExecutor.retryOperation(ZkCmdExecutor.java:70)
at org.apache.solr.common.cloud.SolrZkClient.getData(SolrZkClient.java:341)
at org.apache.solr.cloud.OverseerTaskProcessor.amILeader(OverseerTaskProcessor.java:398)
at org.apache.solr.cloud.OverseerTaskProcessor.run(OverseerTaskProcessor.java:157)
at java.lang.Thread.run(Thread.java:748)
34) Thread[id=10829, name=zkConnectionManagerCallback-4259-thread-1, state=WAITING, group=TGRP-ShardRoutingTest]
at sun.misc.Unsafe.park(Native Method)
at java.util.concurrent.locks.LockSupport.park(LockSupport.java:175)
at java.util.concurrent.locks.AbstractQueuedSynchronizer$ConditionObject.await(AbstractQueuedSynchronizer.java:2039)
at java.util.concurrent.LinkedBlockingQueue.take(LinkedBlockingQueue.java:442)
at java.util.concurrent.ThreadPoolExecutor.getTask(ThreadPoolExecutor.java:1074)
at java.util.concurrent.ThreadPoolExecutor.runWorker(ThreadPoolExecutor.java:1134)
at java.util.concurrent.ThreadPoolExecutor$Worker.run(ThreadPoolExecutor.java:624)
at java.lang.Thread.run(Thread.java:748)
35) Thread[id=10848, name=qtp985233978-10848, state=TIMED_WAITING, group=TGRP-ShardRoutingTest]
at sun.misc.Unsafe.park(Native Method)
at java.util.concurrent.locks.LockSupport.parkNanos(LockSupport.java:215)
at java.util.concurrent.locks.AbstractQueuedSynchronizer$ConditionObject.awaitNanos(AbstractQueuedSynchronizer.java:2078)
at org.eclipse.jetty.util.BlockingArrayQueue.poll(BlockingArrayQueue.java:392)
at org.eclipse.jetty.util.thread.QueuedThreadPool.idleJobPoll(QueuedThreadPool.java:653)
at org.eclipse.jetty.util.thread.QueuedThreadPool.access$800(QueuedThreadPool.java:48)
at org.eclipse.jetty.util.thread.QueuedThreadPool$2.run(QueuedThreadPool.java:717)
at java.lang.Thread.run(Thread.java:748)
36) Thread[id=10874, name=SolrRrdBackendFactory-3146-thread-1, state=TIMED_WAITING, group=TGRP-ShardRoutingTest]
at sun.misc.Unsafe.park(Native Method)
at java.util.concurrent.locks.LockSupport.parkNanos(LockSupport.java:215)
at java.util.concurrent.locks.AbstractQueuedSynchronizer$ConditionObject.awaitNanos(AbstractQueuedSynchronizer.java:2078)
at java.util.concurrent.ScheduledThreadPoolExecutor$DelayedWorkQueue.take(ScheduledThreadPoolExecutor.java:1093)
at java.util.concurrent.ScheduledThreadPoolExecutor$DelayedWorkQueue.take(ScheduledThreadPoolExecutor.java:809)
at java.util.concurrent.ThreadPoolExecutor.getTask(ThreadPoolExecutor.java:1074)
at java.util.concurrent.ThreadPoolExecutor.runWorker(ThreadPoolExecutor.java:1134)
at java.util.concurrent.ThreadPoolExecutor$Worker.run(ThreadPoolExecutor.java:624)
at java.lang.Thread.run(Thread.java:748)
37) Thread[id=10808, name=qtp224460543-10808, state=TIMED_WAITING, group=TGRP-ShardRoutingTest]
at sun.misc.Unsafe.park(Native Method)
at java.util.concurrent.locks.LockSupport.parkNanos(LockSupport.java:215)
at java.util.concurrent.locks.AbstractQueuedSynchronizer$ConditionObject.awaitNanos(AbstractQueuedSynchronizer.java:2078)
at org.eclipse.jetty.util.BlockingArrayQueue.poll(BlockingArrayQueue.java:392)
at org.eclipse.jetty.util.thread.QueuedThreadPool.idleJobPoll(QueuedThreadPool.java:653)
at org.eclipse.jetty.util.thread.QueuedThreadPool.access$800(QueuedThreadPool.java:48)
at org.eclipse.jetty.util.thread.QueuedThreadPool$2.run(QueuedThreadPool.java:717)
at java.lang.Thread.run(Thread.java:748)
38) Thread[id=10843, name=qtp985233978-10843, state=RUNNABLE, group=TGRP-ShardRoutingTest]
at sun.nio.ch.EPollArrayWrapper.epollWait(Native Method)
at sun.nio.ch.EPollArrayWrapper.poll(EPollArrayWrapper.java:269)
at sun.nio.ch.EPollSelectorImpl.doSelect(EPollSelectorImpl.java:93)
at sun.nio.ch.SelectorImpl.lockAndDoSelect(SelectorImpl.java:86)
at sun.nio.ch.SelectorImpl.select(SelectorImpl.java:97)
at sun.nio.ch.SelectorImpl.select(SelectorImpl.java:101)
at org.eclipse.jetty.io.ManagedSelector$SelectorProducer.select(ManagedSelector.java:396)
at org.eclipse.jetty.io.ManagedSelector$SelectorProducer.produce(ManagedSelector.java:333)
at org.eclipse.jetty.util.thread.strategy.EatWhatYouKill.produceTask(EatWhatYouKill.java:357)
at org.eclipse.jetty.util.thread.strategy.EatWhatYouKill.doProduce(EatWhatYouKill.java:181)
at org.eclipse.jetty.util.thread.strategy.EatWhatYouKill.tryProduce(EatWhatYouKill.java:168)
at org.eclipse.jetty.util.thread.strategy.EatWhatYouKill.produce(EatWhatYouKill.java:132)
at org.eclipse.jetty.io.ManagedSelector$$Lambda$31/1763084833.run(Unknown Source)
at org.eclipse.jetty.util.thread.QueuedThreadPool.runJob(QueuedThreadPool.java:762)
at org.eclipse.jetty.util.thread.QueuedThreadPool$2.run(QueuedThreadPool.java:680)
at java.lang.Thread.run(Thread.java:748)
39) Thread[id=10841, name=Connection evictor, state=TIMED_WAITING, group=TGRP-ShardRoutingTest]
at java.lang.Thread.sleep(Native Method)
at org.apache.http.impl.client.IdleConnectionEvictor$1.run(IdleConnectionEvictor.java:66)
at java.lang.Thread.run(Thread.java:748)
40) Thread[id=10850, name=Scheduler-400581374, state=TIMED_WAITING, group=TGRP-ShardRoutingTest]
at sun.misc.Unsafe.park(Native Method)
at java.util.concurrent.locks.LockSupport.parkNanos(LockSupport.java:215)
at java.util.concurrent.locks.AbstractQueuedSynchronizer$ConditionObject.awaitNanos(AbstractQueuedSynchronizer.java:2078)
at java.util.concurrent.ScheduledThreadPoolExecutor$DelayedWorkQueue.take(ScheduledThreadPoolExecutor.java:1093)
at java.util.concurrent.ScheduledThreadPoolExecutor$DelayedWorkQueue.take(ScheduledThreadPoolExecutor.java:809)
at java.util.concurrent.ThreadPoolExecutor.getTask(ThreadPoolExecutor.java:1074)
at java.util.concurrent.ThreadPoolExecutor.runWorker(ThreadPoolExecutor.java:1134)
at java.util.concurrent.ThreadPoolExecutor$Worker.run(ThreadPoolExecutor.java:624)
at java.lang.Thread.run(Thread.java:748)
41) Thread[id=10831, name=MetricsHistoryHandler-3133-thread-1, state=TIMED_WAITING, group=TGRP-ShardRoutingTest]
at sun.misc.Unsafe.park(Native Method)
at java.util.concurrent.locks.LockSupport.parkNanos(LockSupport.java:215)
at java.util.concurrent.locks.AbstractQueuedSynchronizer$ConditionObject.awaitNanos(AbstractQueuedSynchronizer.java:2078)
at java.util.concurrent.ScheduledThreadPoolExecutor$DelayedWorkQueue.take(ScheduledThreadPoolExecutor.java:1093)
at java.util.concurrent.ScheduledThreadPoolExecutor$DelayedWorkQueue.take(ScheduledThreadPoolExecutor.java:809)
at java.util.concurrent.ThreadPoolExecutor.getTask(ThreadPoolExecutor.java:1074)
at java.util.concurrent.ThreadPoolExecutor.runWorker(ThreadPoolExecutor.java:1134)
at java.util.concurrent.ThreadPoolExecutor$Worker.run(ThreadPoolExecutor.java:624)
at java.lang.Thread.run(Thread.java:748)
42) Thread[id=10847, name=qtp985233978-10847, state=TIMED_WAITING, group=TGRP-ShardRoutingTest]
at sun.misc.Unsafe.park(Native Method)
at java.util.concurrent.locks.LockSupport.parkNanos(LockSupport.java:215)
at java.util.concurrent.locks.AbstractQueuedSynchronizer$ConditionObject.awaitNanos(AbstractQueuedSynchronizer.java:2078)
at org.eclipse.jetty.util.BlockingArrayQueue.poll(BlockingArrayQueue.java:392)
at org.eclipse.jetty.util.thread.QueuedThreadPool.idleJobPoll(QueuedThreadPool.java:653)
at org.eclipse.jetty.util.thread.QueuedThreadPool.access$800(QueuedThreadPool.java:48)
at org.eclipse.jetty.util.thread.QueuedThreadPool$2.run(QueuedThreadPool.java:717)
at java.lang.Thread.run(Thread.java:748)
43) Thread[id=10809, name=qtp224460543-10809, state=TIMED_WAITING, group=TGRP-ShardRoutingTest]
at sun.misc.Unsafe.park(Native Method)
at java.util.concurrent.locks.LockSupport.parkNanos(LockSupport.java:215)
at java.util.concurrent.locks.AbstractQueuedSynchronizer$ConditionObject.await(AbstractQueuedSynchronizer.java:2163)
at org.eclipse.jetty.util.thread.ReservedThreadExecutor$ReservedThread.reservedWait(ReservedThreadExecutor.java:292)
at org.eclipse.jetty.util.thread.ReservedThreadExecutor$ReservedThread.run(ReservedThreadExecutor.java:357)
at org.eclipse.jetty.util.thread.QueuedThreadPool.runJob(QueuedThreadPool.java:762)
at org.eclipse.jetty.util.thread.QueuedThreadPool$2.run(QueuedThreadPool.java:680)
at java.lang.Thread.run(Thread.java:748)
44) Thread[id=10806, name=qtp224460543-10806, state=TIMED_WAITING, group=TGRP-ShardRoutingTest]
at sun.misc.Unsafe.park(Native Method)
at java.util.concurrent.locks.LockSupport.parkNanos(LockSupport.java:215)
at java.util.concurrent.locks.AbstractQueuedSynchronizer$ConditionObject.awaitNanos(AbstractQueuedSynchronizer.java:2078)
at org.eclipse.jetty.util.BlockingArrayQueue.poll(BlockingArrayQueue.java:392)
at org.eclipse.jetty.util.thread.QueuedThreadPool.idleJobPoll(QueuedThreadPool.java:653)
at org.eclipse.jetty.util.thread.QueuedThreadPool.access$800(QueuedThreadPool.java:48)
at org.eclipse.jetty.util.thread.QueuedThreadPool$2.run(QueuedThreadPool.java:717)
at java.lang.Thread.run(Thread.java:748)
45) Thread[id=10810, name=qtp224460543-10810, state=TIMED_WAITING, group=TGRP-ShardRoutingTest]
at sun.misc.Unsafe.park(Native Method)
at java.util.concurrent.locks.LockSupport.parkNanos(LockSupport.java:215)
at java.util.concurrent.locks.AbstractQueuedSynchronizer$ConditionObject.awaitNanos(AbstractQueuedSynchronizer.java:2078)
at org.eclipse.jetty.util.BlockingArrayQueue.poll(BlockingArrayQueue.java:392)
at org.eclipse.jetty.util.thread.QueuedThreadPool.idleJobPoll(QueuedThreadPool.java:653)
at org.eclipse.jetty.util.thread.QueuedThreadPool.access$800(QueuedThreadPool.java:48)
at org.eclipse.jetty.util.thread.QueuedThreadPool$2.run(QueuedThreadPool.java:717)
at java.lang.Thread.run(Thread.java:748)
46) Thread[id=10876, name=Thread-1250, state=WAITING, group=TGRP-ShardRoutingTest]
at java.lang.Object.wait(Native Method)
at java.lang.Object.wait(Object.java:502)
at org.apache.solr.core.CloserThread.run(CoreContainer.java:1850)
47) Thread[id=10894, name=OverseerStateUpdate-73626801718951947-127.0.0.1:37997_-n_0000000001, state=TIMED_WAITING, group=Overseer state updater.]
at java.lang.Thread.sleep(Native Method)
at org.apache.solr.common.cloud.ZkCmdExecutor.retryDelay(ZkCmdExecutor.java:111)
at org.apache.solr.common.cloud.ZkCmdExecutor.retryOperation(ZkCmdExecutor.java:70)
at org.apache.solr.common.cloud.SolrZkClient.getData(SolrZkClient.java:341)
at org.apache.solr.cloud.Overseer$ClusterStateUpdater.amILeader(Overseer.java:421)
at org.apache.solr.cloud.Overseer$ClusterStateUpdater.run(Overseer.java:134)
at java.lang.Thread.run(Thread.java:748)
48) Thread[id=10811, name=qtp224460543-10811, state=RUNNABLE, group=TGRP-ShardRoutingTest]
at sun.nio.ch.EPollArrayWrapper.epollWait(Native Method)
at sun.nio.ch.EPollArrayWrapper.poll(EPollArrayWrapper.java:269)
at sun.nio.ch.EPollSelectorImpl.doSelect(EPollSelectorImpl.java:93)
at sun.nio.ch.SelectorImpl.lockAndDoSelect(SelectorImpl.java:86)
at sun.nio.ch.SelectorImpl.select(SelectorImpl.java:97)
at sun.nio.ch.SelectorImpl.select(SelectorImpl.java:101)
at org.eclipse.jetty.io.ManagedSelector$SelectorProducer.select(ManagedSelector.java:396)
at org.eclipse.jetty.io.ManagedSelector$SelectorProducer.produce(ManagedSelector.java:333)
at org.eclipse.jetty.util.thread.strategy.EatWhatYouKill.produceTask(EatWhatYouKill.java:357)
at org.eclipse.jetty.util.thread.strategy.EatWhatYouKill.doProduce(EatWhatYouKill.java:181)
at org.eclipse.jetty.util.thread.strategy.EatWhatYouKill.tryProduce(EatWhatYouKill.java:168)
at org.eclipse.jetty.util.thread.strategy.EatWhatYouKill.run(EatWhatYouKill.java:126)
at org.eclipse.jetty.util.thread.ReservedThreadExecutor$ReservedThread.run(ReservedThreadExecutor.java:366)
at org.eclipse.jetty.util.thread.QueuedThreadPool.runJob(QueuedThreadPool.java:762)
at org.eclipse.jetty.util.thread.QueuedThreadPool$2.run(QueuedThreadPool.java:680)
at java.lang.Thread.run(Thread.java:748)
49) Thread[id=10849, name=qtp985233978-10849, state=TIMED_WAITING, group=TGRP-ShardRoutingTest]
at sun.misc.Unsafe.park(Native Method)
at java.util.concurrent.locks.LockSupport.parkNanos(LockSupport.java:215)
at java.util.concurrent.locks.AbstractQueuedSynchronizer$ConditionObject.awaitNanos(AbstractQueuedSynchronizer.java:2078)
at org.eclipse.jetty.util.BlockingArrayQueue.poll(BlockingArrayQueue.java:392)
at org.eclipse.jetty.util.thread.QueuedThreadPool.idleJobPoll(QueuedThreadPool.java:653)
at org.eclipse.jetty.util.thread.QueuedThreadPool.access$800(QueuedThreadPool.java:48)
at org.eclipse.jetty.util.thread.QueuedThreadPool$2.run(QueuedThreadPool.java:717)
at java.lang.Thread.run(Thread.java:748)
50) Thread[id=10888, name=zkConnectionManagerCallback-4259-thread-1-SendThread(127.0.0.1:41436), state=TIMED_WAITING, group=TGRP-ShardRoutingTest]
at java.lang.Thread.sleep(Native Method)
at org.apache.zookeeper.client.StaticHostProvider.next(StaticHostProvider.java:105)
at org.apache.zookeeper.ClientCnxn$SendThread.startConnect(ClientCnxn.java:1000)
at org.apache.zookeeper.ClientCnxn$SendThread.run(ClientCnxn.java:1063)
at __randomizedtesting.SeedInfo.seed([3BAEA117C8AFA6D0]:0)
FAILED: junit.framework.TestSuite.org.apache.solr.cloud.ShardRoutingTest
Error Message:
There are still zombie threads that couldn't be terminated: 1) Thread[id=10908, name=SolrRrdBackendFactory-3146-thread-2, state=WAITING, group=TGRP-ShardRoutingTest] at sun.misc.Unsafe.park(Native Method) at java.util.concurrent.locks.LockSupport.park(LockSupport.java:175) at java.util.concurrent.locks.AbstractQueuedSynchronizer$ConditionObject.await(AbstractQueuedSynchronizer.java:2039) at java.util.concurrent.ScheduledThreadPoolExecutor$DelayedWorkQueue.take(ScheduledThreadPoolExecutor.java:1088) at java.util.concurrent.ScheduledThreadPoolExecutor$DelayedWorkQueue.take(ScheduledThreadPoolExecutor.java:809) at java.util.concurrent.ThreadPoolExecutor.getTask(ThreadPoolExecutor.java:1074) at java.util.concurrent.ThreadPoolExecutor.runWorker(ThreadPoolExecutor.java:1134) at java.util.concurrent.ThreadPoolExecutor$Worker.run(ThreadPoolExecutor.java:624) at java.lang.Thread.run(Thread.java:748) 2) Thread[id=10830, name=SolrRrdBackendFactory-3132-thread-1, state=TIMED_WAITING, group=TGRP-ShardRoutingTest] at sun.misc.Unsafe.park(Native Method) at java.util.concurrent.locks.LockSupport.parkNanos(LockSupport.java:215) at java.util.concurrent.locks.AbstractQueuedSynchronizer$ConditionObject.awaitNanos(AbstractQueuedSynchronizer.java:2078) at java.util.concurrent.ScheduledThreadPoolExecutor$DelayedWorkQueue.take(ScheduledThreadPoolExecutor.java:1093) at java.util.concurrent.ScheduledThreadPoolExecutor$DelayedWorkQueue.take(ScheduledThreadPoolExecutor.java:809) at java.util.concurrent.ThreadPoolExecutor.getTask(ThreadPoolExecutor.java:1074) at java.util.concurrent.ThreadPoolExecutor.runWorker(ThreadPoolExecutor.java:1134) at java.util.concurrent.ThreadPoolExecutor$Worker.run(ThreadPoolExecutor.java:624) at java.lang.Thread.run(Thread.java:748) 3) Thread[id=10823, name=TEST-ShardRoutingTest.test-seed#[3BAEA117C8AFA6D0]-SendThread(127.0.0.1:41436), state=TIMED_WAITING, group=TGRP-ShardRoutingTest] at java.lang.Thread.sleep(Native Method) at org.apache.zookeeper.client.StaticHostProvider.next(StaticHostProvider.java:105) at org.apache.zookeeper.ClientCnxn$SendThread.startConnect(ClientCnxn.java:1000) at org.apache.zookeeper.ClientCnxn$SendThread.run(ClientCnxn.java:1063) 4) Thread[id=10832, name=Thread-1241, state=WAITING, group=TGRP-ShardRoutingTest] at java.lang.Object.wait(Native Method) at java.lang.Object.wait(Object.java:502) at org.apache.solr.core.CloserThread.run(CoreContainer.java:1850) 5) Thread[id=10829, name=zkConnectionManagerCallback-4259-thread-1, state=WAITING, group=TGRP-ShardRoutingTest] at sun.misc.Unsafe.park(Native Method) at java.util.concurrent.locks.LockSupport.park(LockSupport.java:175) at java.util.concurrent.locks.AbstractQueuedSynchronizer$ConditionObject.await(AbstractQueuedSynchronizer.java:2039) at java.util.concurrent.LinkedBlockingQueue.take(LinkedBlockingQueue.java:442) at java.util.concurrent.ThreadPoolExecutor.getTask(ThreadPoolExecutor.java:1074) at java.util.concurrent.ThreadPoolExecutor.runWorker(ThreadPoolExecutor.java:1134) at java.util.concurrent.ThreadPoolExecutor$Worker.run(ThreadPoolExecutor.java:624) at java.lang.Thread.run(Thread.java:748) 6) Thread[id=10874, name=SolrRrdBackendFactory-3146-thread-1, state=TIMED_WAITING, group=TGRP-ShardRoutingTest] at sun.misc.Unsafe.park(Native Method) at java.util.concurrent.locks.LockSupport.parkNanos(LockSupport.java:215) at java.util.concurrent.locks.AbstractQueuedSynchronizer$ConditionObject.awaitNanos(AbstractQueuedSynchronizer.java:2078) at java.util.concurrent.ScheduledThreadPoolExecutor$DelayedWorkQueue.take(ScheduledThreadPoolExecutor.java:1093) at java.util.concurrent.ScheduledThreadPoolExecutor$DelayedWorkQueue.take(ScheduledThreadPoolExecutor.java:809) at java.util.concurrent.ThreadPoolExecutor.getTask(ThreadPoolExecutor.java:1074) at java.util.concurrent.ThreadPoolExecutor.runWorker(ThreadPoolExecutor.java:1134) at java.util.concurrent.ThreadPoolExecutor$Worker.run(ThreadPoolExecutor.java:624) at java.lang.Thread.run(Thread.java:748) 7) Thread[id=10873, name=zkConnectionManagerCallback-4275-thread-1, state=WAITING, group=TGRP-ShardRoutingTest] at sun.misc.Unsafe.park(Native Method) at java.util.concurrent.locks.LockSupport.park(LockSupport.java:175) at java.util.concurrent.locks.AbstractQueuedSynchronizer$ConditionObject.await(AbstractQueuedSynchronizer.java:2039) at java.util.concurrent.LinkedBlockingQueue.take(LinkedBlockingQueue.java:442) at java.util.concurrent.ThreadPoolExecutor.getTask(ThreadPoolExecutor.java:1074) at java.util.concurrent.ThreadPoolExecutor.runWorker(ThreadPoolExecutor.java:1134) at java.util.concurrent.ThreadPoolExecutor$Worker.run(ThreadPoolExecutor.java:624) at java.lang.Thread.run(Thread.java:748) 8) Thread[id=10875, name=MetricsHistoryHandler-3147-thread-1, state=TIMED_WAITING, group=TGRP-ShardRoutingTest] at sun.misc.Unsafe.park(Native Method) at java.util.concurrent.locks.LockSupport.parkNanos(LockSupport.java:215) at java.util.concurrent.locks.AbstractQueuedSynchronizer$ConditionObject.awaitNanos(AbstractQueuedSynchronizer.java:2078) at java.util.concurrent.ScheduledThreadPoolExecutor$DelayedWorkQueue.take(ScheduledThreadPoolExecutor.java:1093) at java.util.concurrent.ScheduledThreadPoolExecutor$DelayedWorkQueue.take(ScheduledThreadPoolExecutor.java:809) at java.util.concurrent.ThreadPoolExecutor.getTask(ThreadPoolExecutor.java:1074) at java.util.concurrent.ThreadPoolExecutor.runWorker(ThreadPoolExecutor.java:1134) at java.util.concurrent.ThreadPoolExecutor$Worker.run(ThreadPoolExecutor.java:624) at java.lang.Thread.run(Thread.java:748) 9) Thread[id=10843, name=qtp985233978-10843, state=RUNNABLE, group=TGRP-ShardRoutingTest] at sun.nio.ch.EPollArrayWrapper.epollWait(Native Method) at sun.nio.ch.EPollArrayWrapper.poll(EPollArrayWrapper.java:269) at sun.nio.ch.EPollSelectorImpl.doSelect(EPollSelectorImpl.java:93) at sun.nio.ch.SelectorImpl.lockAndDoSelect(SelectorImpl.java:86) at sun.nio.ch.SelectorImpl.select(SelectorImpl.java:97) at sun.nio.ch.SelectorImpl.select(SelectorImpl.java:101) at org.eclipse.jetty.io.ManagedSelector$SelectorProducer.select(ManagedSelector.java:396) at org.eclipse.jetty.io.ManagedSelector$SelectorProducer.produce(ManagedSelector.java:333) at org.eclipse.jetty.util.thread.strategy.EatWhatYouKill.produceTask(EatWhatYouKill.java:357) at org.eclipse.jetty.util.thread.strategy.EatWhatYouKill.doProduce(EatWhatYouKill.java:181) at org.eclipse.jetty.util.thread.strategy.EatWhatYouKill.tryProduce(EatWhatYouKill.java:168) at org.eclipse.jetty.util.thread.strategy.EatWhatYouKill.produce(EatWhatYouKill.java:132) at org.eclipse.jetty.io.ManagedSelector$$Lambda$31/1763084833.run(Unknown Source) at org.eclipse.jetty.util.thread.QueuedThreadPool.runJob(QueuedThreadPool.java:762) at org.eclipse.jetty.util.thread.QueuedThreadPool$2.run(QueuedThreadPool.java:680) at java.lang.Thread.run(Thread.java:748) 10) Thread[id=10812, name=qtp224460543-10812, state=RUNNABLE, group=TGRP-ShardRoutingTest] at sun.nio.ch.EPollArrayWrapper.epollWait(Native Method) at sun.nio.ch.EPollArrayWrapper.poll(EPollArrayWrapper.java:269) at sun.nio.ch.EPollSelectorImpl.doSelect(EPollSelectorImpl.java:93) at sun.nio.ch.SelectorImpl.lockAndDoSelect(SelectorImpl.java:86) at sun.nio.ch.SelectorImpl.select(SelectorImpl.java:97) at sun.nio.ch.SelectorImpl.select(SelectorImpl.java:101) at org.eclipse.jetty.io.ManagedSelector$SelectorProducer.select(ManagedSelector.java:396) at org.eclipse.jetty.io.ManagedSelector$SelectorProducer.produce(ManagedSelector.java:333) at org.eclipse.jetty.util.thread.strategy.EatWhatYouKill.produceTask(EatWhatYouKill.java:357) at org.eclipse.jetty.util.thread.strategy.EatWhatYouKill.doProduce(EatWhatYouKill.java:181) at org.eclipse.jetty.util.thread.strategy.EatWhatYouKill.tryProduce(EatWhatYouKill.java:168) at org.eclipse.jetty.util.thread.strategy.EatWhatYouKill.run(EatWhatYouKill.java:126) at org.eclipse.jetty.util.thread.ReservedThreadExecutor$ReservedThread.run(ReservedThreadExecutor.java:366) at org.eclipse.jetty.util.thread.QueuedThreadPool.runJob(QueuedThreadPool.java:762) at org.eclipse.jetty.util.thread.QueuedThreadPool$2.run(QueuedThreadPool.java:680) at java.lang.Thread.run(Thread.java:748) 11) Thread[id=10850, name=Scheduler-400581374, state=TIMED_WAITING, group=TGRP-ShardRoutingTest] at sun.misc.Unsafe.park(Native Method) at java.util.concurrent.locks.LockSupport.parkNanos(LockSupport.java:215) at java.util.concurrent.locks.AbstractQueuedSynchronizer$ConditionObject.awaitNanos(AbstractQueuedSynchronizer.java:2078) at java.util.concurrent.ScheduledThreadPoolExecutor$DelayedWorkQueue.take(ScheduledThreadPoolExecutor.java:1093) at java.util.concurrent.ScheduledThreadPoolExecutor$DelayedWorkQueue.take(ScheduledThreadPoolExecutor.java:809) at java.util.concurrent.ThreadPoolExecutor.getTask(ThreadPoolExecutor.java:1074) at java.util.concurrent.ThreadPoolExecutor.runWorker(ThreadPoolExecutor.java:1134) at java.util.concurrent.ThreadPoolExecutor$Worker.run(ThreadPoolExecutor.java:624) at java.lang.Thread.run(Thread.java:748) 12) Thread[id=10838, name=searcherExecutor-3135-thread-1, state=WAITING, group=TGRP-ShardRoutingTest] at sun.misc.Unsafe.park(Native Method) at java.util.concurrent.locks.LockSupport.park(LockSupport.java:175) at java.util.concurrent.locks.AbstractQueuedSynchronizer$ConditionObject.await(AbstractQueuedSynchronizer.java:2039) at java.util.concurrent.LinkedBlockingQueue.take(LinkedBlockingQueue.java:442) at java.util.concurrent.ThreadPoolExecutor.getTask(ThreadPoolExecutor.java:1074) at java.util.concurrent.ThreadPoolExecutor.runWorker(ThreadPoolExecutor.java:1134) at java.util.concurrent.ThreadPoolExecutor$Worker.run(ThreadPoolExecutor.java:624) at java.lang.Thread.run(Thread.java:748) 13) Thread[id=10907, name=SolrRrdBackendFactory-3132-thread-2, state=WAITING, group=TGRP-ShardRoutingTest] at sun.misc.Unsafe.park(Native Method) at java.util.concurrent.locks.LockSupport.park(LockSupport.java:175) at java.util.concurrent.locks.AbstractQueuedSynchronizer$ConditionObject.await(AbstractQueuedSynchronizer.java:2039) at java.util.concurrent.ScheduledThreadPoolExecutor$DelayedWorkQueue.take(ScheduledThreadPoolExecutor.java:1088) at java.util.concurrent.ScheduledThreadPoolExecutor$DelayedWorkQueue.take(ScheduledThreadPoolExecutor.java:809) at java.util.concurrent.ThreadPoolExecutor.getTask(ThreadPoolExecutor.java:1074) at java.util.concurrent.ThreadPoolExecutor.runWorker(ThreadPoolExecutor.java:1134) at java.util.concurrent.ThreadPoolExecutor$Worker.run(ThreadPoolExecutor.java:624) at java.lang.Thread.run(Thread.java:748) 14) Thre
[...truncated too long message...]
y disallowed.ivy.jars.list as its length is 0.
-ivy-fail-disallowed-ivy-version:
ivy-fail:
ivy-fail:
ivy-configure:
[ivy:configure] :: loading settings :: file = /home/jenkins/jenkins-slave/workspace/Lucene-Solr-Tests-7.x/lucene/top-level-ivy-settings.xml
resolve:
ivy-availability-check:
[loadresource] Do not set property disallowed.ivy.jars.list as its length is 0.
-ivy-fail-disallowed-ivy-version:
ivy-fail:
ivy-configure:
[ivy:configure] :: loading settings :: file = /home/jenkins/jenkins-slave/workspace/Lucene-Solr-Tests-7.x/lucene/top-level-ivy-settings.xml
resolve:
ivy-availability-check:
[loadresource] Do not set property disallowed.ivy.jars.list as its length is 0.
-ivy-fail-disallowed-ivy-version:
ivy-fail:
ivy-fail:
ivy-configure:
[ivy:configure] :: loading settings :: file = /home/jenkins/jenkins-slave/workspace/Lucene-Solr-Tests-7.x/lucene/top-level-ivy-settings.xml
resolve:
ivy-availability-check:
[loadresource] Do not set property disallowed.ivy.jars.list as its length is 0.
-ivy-fail-disallowed-ivy-version:
ivy-fail:
ivy-configure:
[ivy:configure] :: loading settings :: file = /home/jenkins/jenkins-slave/workspace/Lucene-Solr-Tests-7.x/lucene/top-level-ivy-settings.xml
resolve:
ivy-availability-check:
[loadresource] Do not set property disallowed.ivy.jars.list as its length is 0.
-ivy-fail-disallowed-ivy-version:
ivy-fail:
ivy-fail:
ivy-configure:
[ivy:configure] :: loading settings :: file = /home/jenkins/jenkins-slave/workspace/Lucene-Solr-Tests-7.x/lucene/top-level-ivy-settings.xml
resolve:
ivy-availability-check:
[loadresource] Do not set property disallowed.ivy.jars.list as its length is 0.
-ivy-fail-disallowed-ivy-version:
ivy-fail:
ivy-fail:
ivy-configure:
[ivy:configure] :: loading settings :: file = /home/jenkins/jenkins-slave/workspace/Lucene-Solr-Tests-7.x/lucene/top-level-ivy-settings.xml
resolve:
ivy-availability-check:
[loadresource] Do not set property disallowed.ivy.jars.list as its length is 0.
-ivy-fail-disallowed-ivy-version:
ivy-fail:
ivy-fail:
ivy-configure:
[ivy:configure] :: loading settings :: file = /home/jenkins/jenkins-slave/workspace/Lucene-Solr-Tests-7.x/lucene/top-level-ivy-settings.xml
resolve:
ivy-availability-check:
[loadresource] Do not set property disallowed.ivy.jars.list as its length is 0.
-ivy-fail-disallowed-ivy-version:
ivy-fail:
ivy-fail:
ivy-configure:
[ivy:configure] :: loading settings :: file = /home/jenkins/jenkins-slave/workspace/Lucene-Solr-Tests-7.x/lucene/top-level-ivy-settings.xml
resolve:
ivy-availability-check:
[loadresource] Do not set property disallowed.ivy.jars.list as its length is 0.
-ivy-fail-disallowed-ivy-version:
ivy-fail:
ivy-fail:
ivy-configure:
[ivy:configure] :: loading settings :: file = /home/jenkins/jenkins-slave/workspace/Lucene-Solr-Tests-7.x/lucene/top-level-ivy-settings.xml
resolve:
ivy-availability-check:
[loadresource] Do not set property disallowed.ivy.jars.list as its length is 0.
-ivy-fail-disallowed-ivy-version:
ivy-fail:
ivy-fail:
ivy-configure:
[ivy:configure] :: loading settings :: file = /home/jenkins/jenkins-slave/workspace/Lucene-Solr-Tests-7.x/lucene/top-level-ivy-settings.xml
resolve:
ivy-availability-check:
[loadresource] Do not set property disallowed.ivy.jars.list as its length is 0.
-ivy-fail-disallowed-ivy-version:
ivy-fail:
ivy-fail:
ivy-configure:
[ivy:configure] :: loading settings :: file = /home/jenkins/jenkins-slave/workspace/Lucene-Solr-Tests-7.x/lucene/top-level-ivy-settings.xml
resolve:
ivy-availability-check:
[loadresource] Do not set property disallowed.ivy.jars.list as its length is 0.
-ivy-fail-disallowed-ivy-version:
ivy-fail:
ivy-fail:
ivy-configure:
[ivy:configure] :: loading settings :: file = /home/jenkins/jenkins-slave/workspace/Lucene-Solr-Tests-7.x/lucene/top-level-ivy-settings.xml
resolve:
ivy-availability-check:
[loadresource] Do not set property disallowed.ivy.jars.list as its length is 0.
-ivy-fail-disallowed-ivy-version:
ivy-fail:
ivy-fail:
ivy-configure:
[ivy:configure] :: loading settings :: file = /home/jenkins/jenkins-slave/workspace/Lucene-Solr-Tests-7.x/lucene/top-level-ivy-settings.xml
resolve:
ivy-availability-check:
[loadresource] Do not set property disallowed.ivy.jars.list as its length is 0.
-ivy-fail-disallowed-ivy-version:
ivy-fail:
ivy-fail:
ivy-configure:
[ivy:configure] :: loading settings :: file = /home/jenkins/jenkins-slave/workspace/Lucene-Solr-Tests-7.x/lucene/top-level-ivy-settings.xml
resolve:
jar-checksums:
[mkdir] Created dir: /home/jenkins/jenkins-slave/workspace/Lucene-Solr-Tests-7.x/solr/null1537491544
[copy] Copying 241 files to /home/jenkins/jenkins-slave/workspace/Lucene-Solr-Tests-7.x/solr/null1537491544
[delete] Deleting directory /home/jenkins/jenkins-slave/workspace/Lucene-Solr-Tests-7.x/solr/null1537491544
check-working-copy:
[ivy:cachepath] :: resolving dependencies :: org.eclipse.jgit#org.eclipse.jgit-caller;working
[ivy:cachepath] confs: [default]
[ivy:cachepath] found org.eclipse.jgit#org.eclipse.jgit;4.6.0.201612231935-r in public
[ivy:cachepath] found com.jcraft#jsch;0.1.53 in public
[ivy:cachepath] found com.googlecode.javaewah#JavaEWAH;1.1.6 in public
[ivy:cachepath] found org.apache.httpcomponents#httpclient;4.3.6 in public
[ivy:cachepath] found org.apache.httpcomponents#httpcore;4.3.3 in public
[ivy:cachepath] found commons-logging#commons-logging;1.1.3 in public
[ivy:cachepath] found commons-codec#commons-codec;1.6 in public
[ivy:cachepath] found org.slf4j#slf4j-api;1.7.2 in public
[ivy:cachepath] :: resolution report :: resolve 106ms :: artifacts dl 21ms
---------------------------------------------------------------------
| | modules || artifacts |
| conf | number| search|dwnlded|evicted|| number|dwnlded|
---------------------------------------------------------------------
| default | 8 | 0 | 0 | 0 || 8 | 0 |
---------------------------------------------------------------------
[wc-checker] Initializing working copy...
[wc-checker] SLF4J: Failed to load class "org.slf4j.impl.StaticLoggerBinder".
[wc-checker] SLF4J: Defaulting to no-operation (NOP) logger implementation
[wc-checker] SLF4J: See http://www.slf4j.org/codes.html#StaticLoggerBinder for further details.
[wc-checker] Checking working copy status...
-jenkins-base:
BUILD SUCCESSFUL
Total time: 157 minutes 42 seconds
Archiving artifacts
java.lang.InterruptedException: no matches found within 10000
at hudson.FilePath$34.hasMatch(FilePath.java:2678)
at hudson.FilePath$34.invoke(FilePath.java:2557)
at hudson.FilePath$34.invoke(FilePath.java:2547)
at hudson.FilePath$FileCallableWrapper.call(FilePath.java:2918)
Also: hudson.remoting.Channel$CallSiteStackTrace: Remote call to lucene2
at hudson.remoting.Channel.attachCallSiteStackTrace(Channel.java:1741)
at hudson.remoting.UserRequest$ExceptionResponse.retrieve(UserRequest.java:357)
at hudson.remoting.Channel.call(Channel.java:955)
at hudson.FilePath.act(FilePath.java:1036)
at hudson.FilePath.act(FilePath.java:1025)
at hudson.FilePath.validateAntFileMask(FilePath.java:2547)
at hudson.tasks.ArtifactArchiver.perform(ArtifactArchiver.java:243)
at hudson.tasks.BuildStepCompatibilityLayer.perform(BuildStepCompatibilityLayer.java:81)
at hudson.tasks.BuildStepMonitor$1.perform(BuildStepMonitor.java:20)
at hudson.model.AbstractBuild$AbstractBuildExecution.perform(AbstractBuild.java:744)
at hudson.model.AbstractBuild$AbstractBuildExecution.performAllBuildSteps(AbstractBuild.java:690)
at hudson.model.Build$BuildExecution.post2(Build.java:186)
at hudson.model.AbstractBuild$AbstractBuildExecution.post(AbstractBuild.java:635)
at hudson.model.Run.execute(Run.java:1819)
at hudson.model.FreeStyleBuild.run(FreeStyleBuild.java:43)
at hudson.model.ResourceController.execute(ResourceController.java:97)
at hudson.model.Executor.run(Executor.java:429)
Caused: hudson.FilePath$TunneledInterruptedException
at hudson.FilePath$FileCallableWrapper.call(FilePath.java:2920)
at hudson.remoting.UserRequest.perform(UserRequest.java:212)
at hudson.remoting.UserRequest.perform(UserRequest.java:54)
at hudson.remoting.Request$2.run(Request.java:369)
at hudson.remoting.InterceptingExecutorService$1.call(InterceptingExecutorService.java:72)
at java.util.concurrent.FutureTask.run(FutureTask.java:266)
at java.util.concurrent.ThreadPoolExecutor.runWorker(ThreadPoolExecutor.java:1142)
at java.util.concurrent.ThreadPoolExecutor$Worker.run(ThreadPoolExecutor.java:617)
at java.lang.Thread.run(Thread.java:748)
Caused: java.lang.InterruptedException: java.lang.InterruptedException: no matches found within 10000
at hudson.FilePath.act(FilePath.java:1038)
at hudson.FilePath.act(FilePath.java:1025)
at hudson.FilePath.validateAntFileMask(FilePath.java:2547)
at hudson.tasks.ArtifactArchiver.perform(ArtifactArchiver.java:243)
at hudson.tasks.BuildStepCompatibilityLayer.perform(BuildStepCompatibilityLayer.java:81)
at hudson.tasks.BuildStepMonitor$1.perform(BuildStepMonitor.java:20)
at hudson.model.AbstractBuild$AbstractBuildExecution.perform(AbstractBuild.java:744)
at hudson.model.AbstractBuild$AbstractBuildExecution.performAllBuildSteps(AbstractBuild.java:690)
at hudson.model.Build$BuildExecution.post2(Build.java:186)
at hudson.model.AbstractBuild$AbstractBuildExecution.post(AbstractBuild.java:635)
at hudson.model.Run.execute(Run.java:1819)
at hudson.model.FreeStyleBuild.run(FreeStyleBuild.java:43)
at hudson.model.ResourceController.execute(ResourceController.java:97)
at hudson.model.Executor.run(Executor.java:429)
No artifacts found that match the file pattern "**/*.events,heapdumps/**,**/hs_err_pid*". Configuration error?
Recording test results
Build step 'Publish JUnit test result report' changed build result to UNSTABLE
Email was triggered for: Unstable (Test Failures)
Sending email for trigger: Unstable (Test Failures)
[JENKINS] Lucene-Solr-Tests-7.x - Build # 1015 - Still Unstable
Posted by Apache Jenkins Server <je...@builds.apache.org>.
Build: https://builds.apache.org/job/Lucene-Solr-Tests-7.x/1015/
2 tests failed.
FAILED: org.apache.solr.cloud.AliasIntegrationTest.test
Error Message:
Collection not found: testalias6
Stack Trace:
org.apache.solr.common.SolrException: Collection not found: testalias6
at __randomizedtesting.SeedInfo.seed([7B98F69C00DA112:8FEDB0B36EF1CCEA]:0)
at org.apache.solr.client.solrj.impl.CloudSolrClient.requestWithRetryOnStaleState(CloudSolrClient.java:851)
at org.apache.solr.client.solrj.impl.CloudSolrClient.request(CloudSolrClient.java:817)
at org.apache.solr.client.solrj.SolrRequest.process(SolrRequest.java:194)
at org.apache.solr.client.solrj.SolrClient.query(SolrClient.java:983)
at org.apache.solr.cloud.AliasIntegrationTest.searchSeveralWays(AliasIntegrationTest.java:579)
at org.apache.solr.cloud.AliasIntegrationTest.searchSeveralWays(AliasIntegrationTest.java:573)
at org.apache.solr.cloud.AliasIntegrationTest.test(AliasIntegrationTest.java:533)
at sun.reflect.NativeMethodAccessorImpl.invoke0(Native Method)
at sun.reflect.NativeMethodAccessorImpl.invoke(NativeMethodAccessorImpl.java:62)
at sun.reflect.DelegatingMethodAccessorImpl.invoke(DelegatingMethodAccessorImpl.java:43)
at java.lang.reflect.Method.invoke(Method.java:498)
at com.carrotsearch.randomizedtesting.RandomizedRunner.invoke(RandomizedRunner.java:1742)
at com.carrotsearch.randomizedtesting.RandomizedRunner$8.evaluate(RandomizedRunner.java:935)
at com.carrotsearch.randomizedtesting.RandomizedRunner$9.evaluate(RandomizedRunner.java:971)
at com.carrotsearch.randomizedtesting.RandomizedRunner$10.evaluate(RandomizedRunner.java:985)
at com.carrotsearch.randomizedtesting.rules.SystemPropertiesRestoreRule$1.evaluate(SystemPropertiesRestoreRule.java:57)
at org.apache.lucene.util.TestRuleSetupTeardownChained$1.evaluate(TestRuleSetupTeardownChained.java:49)
at org.apache.lucene.util.AbstractBeforeAfterRule$1.evaluate(AbstractBeforeAfterRule.java:45)
at org.apache.lucene.util.TestRuleThreadAndTestName$1.evaluate(TestRuleThreadAndTestName.java:48)
at org.apache.lucene.util.TestRuleIgnoreAfterMaxFailures$1.evaluate(TestRuleIgnoreAfterMaxFailures.java:64)
at org.apache.lucene.util.TestRuleMarkFailure$1.evaluate(TestRuleMarkFailure.java:47)
at com.carrotsearch.randomizedtesting.rules.StatementAdapter.evaluate(StatementAdapter.java:36)
at com.carrotsearch.randomizedtesting.ThreadLeakControl$StatementRunner.run(ThreadLeakControl.java:368)
at com.carrotsearch.randomizedtesting.ThreadLeakControl.forkTimeoutingTask(ThreadLeakControl.java:817)
at com.carrotsearch.randomizedtesting.ThreadLeakControl$3.evaluate(ThreadLeakControl.java:468)
at com.carrotsearch.randomizedtesting.RandomizedRunner.runSingleTest(RandomizedRunner.java:944)
at com.carrotsearch.randomizedtesting.RandomizedRunner$5.evaluate(RandomizedRunner.java:830)
at com.carrotsearch.randomizedtesting.RandomizedRunner$6.evaluate(RandomizedRunner.java:880)
at com.carrotsearch.randomizedtesting.RandomizedRunner$7.evaluate(RandomizedRunner.java:891)
at com.carrotsearch.randomizedtesting.rules.StatementAdapter.evaluate(StatementAdapter.java:36)
at com.carrotsearch.randomizedtesting.rules.SystemPropertiesRestoreRule$1.evaluate(SystemPropertiesRestoreRule.java:57)
at org.apache.lucene.util.AbstractBeforeAfterRule$1.evaluate(AbstractBeforeAfterRule.java:45)
at com.carrotsearch.randomizedtesting.rules.StatementAdapter.evaluate(StatementAdapter.java:36)
at org.apache.lucene.util.TestRuleStoreClassName$1.evaluate(TestRuleStoreClassName.java:41)
at com.carrotsearch.randomizedtesting.rules.NoShadowingOrOverridesOnMethodsRule$1.evaluate(NoShadowingOrOverridesOnMethodsRule.java:40)
at com.carrotsearch.randomizedtesting.rules.NoShadowingOrOverridesOnMethodsRule$1.evaluate(NoShadowingOrOverridesOnMethodsRule.java:40)
at com.carrotsearch.randomizedtesting.rules.StatementAdapter.evaluate(StatementAdapter.java:36)
at com.carrotsearch.randomizedtesting.rules.StatementAdapter.evaluate(StatementAdapter.java:36)
at com.carrotsearch.randomizedtesting.rules.StatementAdapter.evaluate(StatementAdapter.java:36)
at org.apache.lucene.util.TestRuleAssertionsRequired$1.evaluate(TestRuleAssertionsRequired.java:53)
at org.apache.lucene.util.TestRuleMarkFailure$1.evaluate(TestRuleMarkFailure.java:47)
at org.apache.lucene.util.TestRuleIgnoreAfterMaxFailures$1.evaluate(TestRuleIgnoreAfterMaxFailures.java:64)
at org.apache.lucene.util.TestRuleIgnoreTestSuites$1.evaluate(TestRuleIgnoreTestSuites.java:54)
at com.carrotsearch.randomizedtesting.rules.StatementAdapter.evaluate(StatementAdapter.java:36)
at com.carrotsearch.randomizedtesting.ThreadLeakControl$StatementRunner.run(ThreadLeakControl.java:368)
at java.lang.Thread.run(Thread.java:748)
FAILED: org.apache.solr.common.cloud.TestCollectionStateWatchers.testWaitForStateWatcherIsRetainedOnPredicateFailure
Error Message:
Did not see a fully active cluster after 30 seconds
Stack Trace:
java.lang.AssertionError: Did not see a fully active cluster after 30 seconds
at __randomizedtesting.SeedInfo.seed([9638D6B90F4139AA:1E0E74EAD7EED1B8]:0)
at org.junit.Assert.fail(Assert.java:93)
at org.junit.Assert.assertTrue(Assert.java:43)
at org.apache.solr.common.cloud.TestCollectionStateWatchers.testWaitForStateWatcherIsRetainedOnPredicateFailure(TestCollectionStateWatchers.java:256)
at sun.reflect.NativeMethodAccessorImpl.invoke0(Native Method)
at sun.reflect.NativeMethodAccessorImpl.invoke(NativeMethodAccessorImpl.java:62)
at sun.reflect.DelegatingMethodAccessorImpl.invoke(DelegatingMethodAccessorImpl.java:43)
at java.lang.reflect.Method.invoke(Method.java:498)
at com.carrotsearch.randomizedtesting.RandomizedRunner.invoke(RandomizedRunner.java:1742)
at com.carrotsearch.randomizedtesting.RandomizedRunner$8.evaluate(RandomizedRunner.java:935)
at com.carrotsearch.randomizedtesting.RandomizedRunner$9.evaluate(RandomizedRunner.java:971)
at com.carrotsearch.randomizedtesting.RandomizedRunner$10.evaluate(RandomizedRunner.java:985)
at com.carrotsearch.randomizedtesting.rules.SystemPropertiesRestoreRule$1.evaluate(SystemPropertiesRestoreRule.java:57)
at org.apache.lucene.util.TestRuleSetupTeardownChained$1.evaluate(TestRuleSetupTeardownChained.java:49)
at org.apache.lucene.util.AbstractBeforeAfterRule$1.evaluate(AbstractBeforeAfterRule.java:45)
at org.apache.lucene.util.TestRuleThreadAndTestName$1.evaluate(TestRuleThreadAndTestName.java:48)
at org.apache.lucene.util.TestRuleIgnoreAfterMaxFailures$1.evaluate(TestRuleIgnoreAfterMaxFailures.java:64)
at org.apache.lucene.util.TestRuleMarkFailure$1.evaluate(TestRuleMarkFailure.java:47)
at com.carrotsearch.randomizedtesting.rules.StatementAdapter.evaluate(StatementAdapter.java:36)
at com.carrotsearch.randomizedtesting.ThreadLeakControl$StatementRunner.run(ThreadLeakControl.java:368)
at com.carrotsearch.randomizedtesting.ThreadLeakControl.forkTimeoutingTask(ThreadLeakControl.java:817)
at com.carrotsearch.randomizedtesting.ThreadLeakControl$3.evaluate(ThreadLeakControl.java:468)
at com.carrotsearch.randomizedtesting.RandomizedRunner.runSingleTest(RandomizedRunner.java:944)
at com.carrotsearch.randomizedtesting.RandomizedRunner$5.evaluate(RandomizedRunner.java:830)
at com.carrotsearch.randomizedtesting.RandomizedRunner$6.evaluate(RandomizedRunner.java:880)
at com.carrotsearch.randomizedtesting.RandomizedRunner$7.evaluate(RandomizedRunner.java:891)
at com.carrotsearch.randomizedtesting.rules.StatementAdapter.evaluate(StatementAdapter.java:36)
at com.carrotsearch.randomizedtesting.rules.SystemPropertiesRestoreRule$1.evaluate(SystemPropertiesRestoreRule.java:57)
at org.apache.lucene.util.AbstractBeforeAfterRule$1.evaluate(AbstractBeforeAfterRule.java:45)
at com.carrotsearch.randomizedtesting.rules.StatementAdapter.evaluate(StatementAdapter.java:36)
at org.apache.lucene.util.TestRuleStoreClassName$1.evaluate(TestRuleStoreClassName.java:41)
at com.carrotsearch.randomizedtesting.rules.NoShadowingOrOverridesOnMethodsRule$1.evaluate(NoShadowingOrOverridesOnMethodsRule.java:40)
at com.carrotsearch.randomizedtesting.rules.NoShadowingOrOverridesOnMethodsRule$1.evaluate(NoShadowingOrOverridesOnMethodsRule.java:40)
at com.carrotsearch.randomizedtesting.rules.StatementAdapter.evaluate(StatementAdapter.java:36)
at com.carrotsearch.randomizedtesting.rules.StatementAdapter.evaluate(StatementAdapter.java:36)
at com.carrotsearch.randomizedtesting.rules.StatementAdapter.evaluate(StatementAdapter.java:36)
at org.apache.lucene.util.TestRuleAssertionsRequired$1.evaluate(TestRuleAssertionsRequired.java:53)
at org.apache.lucene.util.TestRuleMarkFailure$1.evaluate(TestRuleMarkFailure.java:47)
at org.apache.lucene.util.TestRuleIgnoreAfterMaxFailures$1.evaluate(TestRuleIgnoreAfterMaxFailures.java:64)
at org.apache.lucene.util.TestRuleIgnoreTestSuites$1.evaluate(TestRuleIgnoreTestSuites.java:54)
at com.carrotsearch.randomizedtesting.rules.StatementAdapter.evaluate(StatementAdapter.java:36)
at com.carrotsearch.randomizedtesting.ThreadLeakControl$StatementRunner.run(ThreadLeakControl.java:368)
at java.lang.Thread.run(Thread.java:748)
Build Log:
[...truncated 13419 lines...]
[junit4] Suite: org.apache.solr.cloud.AliasIntegrationTest
[junit4] 2> 1314124 INFO (SUITE-AliasIntegrationTest-seed#[7B98F69C00DA112]-worker) [ ] o.a.s.SolrTestCaseJ4 SecureRandom sanity checks: test.solr.allowed.securerandom=null & java.security.egd=file:/dev/./urandom
[junit4] 2> Creating dataDir: /home/jenkins/jenkins-slave/workspace/Lucene-Solr-Tests-7.x/solr/build/solr-core/test/J0/temp/solr.cloud.AliasIntegrationTest_7B98F69C00DA112-001/init-core-data-001
[junit4] 2> 1314125 WARN (SUITE-AliasIntegrationTest-seed#[7B98F69C00DA112]-worker) [ ] o.a.s.SolrTestCaseJ4 startTrackingSearchers: numOpens=42 numCloses=42
[junit4] 2> 1314125 INFO (SUITE-AliasIntegrationTest-seed#[7B98F69C00DA112]-worker) [ ] o.a.s.SolrTestCaseJ4 Using PointFields (NUMERIC_POINTS_SYSPROP=true) w/NUMERIC_DOCVALUES_SYSPROP=false
[junit4] 2> 1314145 INFO (SUITE-AliasIntegrationTest-seed#[7B98F69C00DA112]-worker) [ ] o.a.s.SolrTestCaseJ4 Randomized ssl (true) and clientAuth (true) via: @org.apache.solr.util.RandomizeSSL(reason=, ssl=NaN, value=NaN, clientAuth=NaN)
[junit4] 2> 1314161 INFO (SUITE-AliasIntegrationTest-seed#[7B98F69C00DA112]-worker) [ ] o.a.s.c.MiniSolrCloudCluster Starting cluster of 2 servers in /home/jenkins/jenkins-slave/workspace/Lucene-Solr-Tests-7.x/solr/build/solr-core/test/J0/temp/solr.cloud.AliasIntegrationTest_7B98F69C00DA112-001/tempDir-001
[junit4] 2> 1314161 INFO (SUITE-AliasIntegrationTest-seed#[7B98F69C00DA112]-worker) [ ] o.a.s.c.ZkTestServer STARTING ZK TEST SERVER
[junit4] 2> 1314163 INFO (Thread-1082) [ ] o.a.s.c.ZkTestServer client port:0.0.0.0/0.0.0.0:0
[junit4] 2> 1314163 INFO (Thread-1082) [ ] o.a.s.c.ZkTestServer Starting server
[junit4] 2> 1314183 ERROR (Thread-1082) [ ] o.a.z.s.ZooKeeperServer ZKShutdownHandler is not registered, so ZooKeeper server won't take any action on ERROR or SHUTDOWN server state changes
[junit4] 2> 1314272 INFO (SUITE-AliasIntegrationTest-seed#[7B98F69C00DA112]-worker) [ ] o.a.s.c.ZkTestServer start zk server on port:44340
[junit4] 2> 1314354 INFO (zkConnectionManagerCallback-1784-thread-1) [ ] o.a.s.c.c.ConnectionManager zkClient has connected
[junit4] 2> 1314372 INFO (jetty-launcher-1781-thread-2) [ ] o.e.j.s.Server jetty-9.4.11.v20180605; built: 2018-06-05T18:24:03.829Z; git: d5fc0523cfa96bfebfbda19606cad384d772f04c; jvm 1.8.0_191-b12
[junit4] 2> 1314411 INFO (jetty-launcher-1781-thread-2) [ ] o.e.j.s.session DefaultSessionIdManager workerName=node0
[junit4] 2> 1314411 INFO (jetty-launcher-1781-thread-2) [ ] o.e.j.s.session No SessionScavenger set, using defaults
[junit4] 2> 1314411 INFO (jetty-launcher-1781-thread-2) [ ] o.e.j.s.session node0 Scavenging every 660000ms
[junit4] 2> 1314423 INFO (jetty-launcher-1781-thread-1) [ ] o.e.j.s.Server jetty-9.4.11.v20180605; built: 2018-06-05T18:24:03.829Z; git: d5fc0523cfa96bfebfbda19606cad384d772f04c; jvm 1.8.0_191-b12
[junit4] 2> 1314424 INFO (jetty-launcher-1781-thread-1) [ ] o.e.j.s.session DefaultSessionIdManager workerName=node0
[junit4] 2> 1314424 INFO (jetty-launcher-1781-thread-1) [ ] o.e.j.s.session No SessionScavenger set, using defaults
[junit4] 2> 1314424 INFO (jetty-launcher-1781-thread-1) [ ] o.e.j.s.session node0 Scavenging every 600000ms
[junit4] 2> 1314443 INFO (jetty-launcher-1781-thread-1) [ ] o.e.j.s.h.ContextHandler Started o.e.j.s.ServletContextHandler@3d0b8c17{/solr,null,AVAILABLE}
[junit4] 2> 1314444 INFO (jetty-launcher-1781-thread-1) [ ] o.e.j.s.AbstractConnector Started ServerConnector@22ffc5e{SSL,[ssl, http/1.1]}{127.0.0.1:43790}
[junit4] 2> 1314444 INFO (jetty-launcher-1781-thread-1) [ ] o.e.j.s.Server Started @1314765ms
[junit4] 2> 1314444 INFO (jetty-launcher-1781-thread-1) [ ] o.a.s.c.s.e.JettySolrRunner Jetty properties: {hostContext=/solr, hostPort=43790}
[junit4] 2> 1314444 ERROR (jetty-launcher-1781-thread-1) [ ] o.a.s.u.StartupLoggingUtils Missing Java Option solr.log.dir. Logging may be missing or incomplete.
[junit4] 2> 1314444 INFO (jetty-launcher-1781-thread-1) [ ] o.a.s.s.SolrDispatchFilter Using logger factory org.apache.logging.slf4j.Log4jLoggerFactory
[junit4] 2> 1314444 INFO (jetty-launcher-1781-thread-1) [ ] o.a.s.s.SolrDispatchFilter ___ _ Welcome to Apache Solr? version 7.6.0
[junit4] 2> 1314444 INFO (jetty-launcher-1781-thread-1) [ ] o.a.s.s.SolrDispatchFilter / __| ___| |_ _ Starting in cloud mode on port null
[junit4] 2> 1314444 INFO (jetty-launcher-1781-thread-1) [ ] o.a.s.s.SolrDispatchFilter \__ \/ _ \ | '_| Install dir: null
[junit4] 2> 1314444 INFO (jetty-launcher-1781-thread-1) [ ] o.a.s.s.SolrDispatchFilter |___/\___/_|_| Start time: 2018-11-08T09:58:50.061Z
[junit4] 2> 1314445 INFO (jetty-launcher-1781-thread-2) [ ] o.e.j.s.h.ContextHandler Started o.e.j.s.ServletContextHandler@1d68c66d{/solr,null,AVAILABLE}
[junit4] 2> 1314446 INFO (jetty-launcher-1781-thread-2) [ ] o.e.j.s.AbstractConnector Started ServerConnector@17d85aca{SSL,[ssl, http/1.1]}{127.0.0.1:35477}
[junit4] 2> 1314446 INFO (jetty-launcher-1781-thread-2) [ ] o.e.j.s.Server Started @1314767ms
[junit4] 2> 1314446 INFO (jetty-launcher-1781-thread-2) [ ] o.a.s.c.s.e.JettySolrRunner Jetty properties: {hostContext=/solr, hostPort=35477}
[junit4] 2> 1314446 ERROR (jetty-launcher-1781-thread-2) [ ] o.a.s.u.StartupLoggingUtils Missing Java Option solr.log.dir. Logging may be missing or incomplete.
[junit4] 2> 1314446 INFO (jetty-launcher-1781-thread-2) [ ] o.a.s.s.SolrDispatchFilter Using logger factory org.apache.logging.slf4j.Log4jLoggerFactory
[junit4] 2> 1314446 INFO (jetty-launcher-1781-thread-2) [ ] o.a.s.s.SolrDispatchFilter ___ _ Welcome to Apache Solr? version 7.6.0
[junit4] 2> 1314446 INFO (jetty-launcher-1781-thread-2) [ ] o.a.s.s.SolrDispatchFilter / __| ___| |_ _ Starting in cloud mode on port null
[junit4] 2> 1314446 INFO (jetty-launcher-1781-thread-2) [ ] o.a.s.s.SolrDispatchFilter \__ \/ _ \ | '_| Install dir: null
[junit4] 2> 1314446 INFO (jetty-launcher-1781-thread-2) [ ] o.a.s.s.SolrDispatchFilter |___/\___/_|_| Start time: 2018-11-08T09:58:50.063Z
[junit4] 2> 1314482 INFO (zkConnectionManagerCallback-1786-thread-1) [ ] o.a.s.c.c.ConnectionManager zkClient has connected
[junit4] 2> 1314483 INFO (jetty-launcher-1781-thread-1) [ ] o.a.s.s.SolrDispatchFilter solr.xml found in ZooKeeper. Loading...
[junit4] 2> 1314510 INFO (zkConnectionManagerCallback-1788-thread-1) [ ] o.a.s.c.c.ConnectionManager zkClient has connected
[junit4] 2> 1314533 INFO (jetty-launcher-1781-thread-2) [ ] o.a.s.s.SolrDispatchFilter solr.xml found in ZooKeeper. Loading...
[junit4] 2> 1315352 INFO (jetty-launcher-1781-thread-2) [ ] o.a.s.c.ZkContainer Zookeeper client=127.0.0.1:44340/solr
[junit4] 2> 1315366 INFO (zkConnectionManagerCallback-1792-thread-1) [ ] o.a.s.c.c.ConnectionManager zkClient has connected
[junit4] 2> 1315430 INFO (zkConnectionManagerCallback-1794-thread-1) [ ] o.a.s.c.c.ConnectionManager zkClient has connected
[junit4] 2> 1315738 INFO (jetty-launcher-1781-thread-2) [n:127.0.0.1:35477_solr ] o.a.s.c.OverseerElectionContext I am going to be the leader 127.0.0.1:35477_solr
[junit4] 2> 1315739 INFO (jetty-launcher-1781-thread-2) [n:127.0.0.1:35477_solr ] o.a.s.c.Overseer Overseer (id=73631017107193860-127.0.0.1:35477_solr-n_0000000000) starting
[junit4] 2> 1315761 INFO (jetty-launcher-1781-thread-1) [ ] o.a.s.c.ZkContainer Zookeeper client=127.0.0.1:44340/solr
[junit4] 2> 1315796 INFO (zkConnectionManagerCallback-1800-thread-1) [ ] o.a.s.c.c.ConnectionManager zkClient has connected
[junit4] 2> 1315797 WARN (NIOServerCxn.Factory:0.0.0.0/0.0.0.0:0) [ ] o.a.z.s.NIOServerCnxn Unable to read additional data from client sessionid 0x10597051b200005, likely client has closed socket
[junit4] 2> 1315814 INFO (zkConnectionManagerCallback-1807-thread-1) [ ] o.a.s.c.c.ConnectionManager zkClient has connected
[junit4] 2> 1315814 INFO (zkConnectionManagerCallback-1805-thread-1) [ ] o.a.s.c.c.ConnectionManager zkClient has connected
[junit4] 2> 1315865 INFO (jetty-launcher-1781-thread-2) [n:127.0.0.1:35477_solr ] o.a.s.c.s.i.ZkClientClusterStateProvider Cluster at 127.0.0.1:44340/solr ready
[junit4] 2> 1315868 INFO (jetty-launcher-1781-thread-1) [n:127.0.0.1:43790_solr ] o.a.s.c.ZkController Register node as live in ZooKeeper:/live_nodes/127.0.0.1:43790_solr
[junit4] 2> 1315898 INFO (OverseerStateUpdate-73631017107193860-127.0.0.1:35477_solr-n_0000000000) [n:127.0.0.1:35477_solr ] o.a.s.c.Overseer Starting to work on the main queue : 127.0.0.1:35477_solr
[junit4] 2> 1315955 INFO (zkCallback-1793-thread-1) [ ] o.a.s.c.c.ZkStateReader Updated live nodes from ZooKeeper... (0) -> (1)
[junit4] 2> 1315955 INFO (zkCallback-1804-thread-1) [ ] o.a.s.c.c.ZkStateReader Updated live nodes from ZooKeeper... (0) -> (1)
[junit4] 2> 1315973 INFO (jetty-launcher-1781-thread-2) [n:127.0.0.1:35477_solr ] o.a.s.c.TransientSolrCoreCacheDefault Allocating transient cache for 2147483647 transient cores
[junit4] 2> 1315973 INFO (jetty-launcher-1781-thread-2) [n:127.0.0.1:35477_solr ] o.a.s.c.ZkController Register node as live in ZooKeeper:/live_nodes/127.0.0.1:35477_solr
[junit4] 2> 1316008 INFO (zkCallback-1804-thread-1) [ ] o.a.s.c.c.ZkStateReader Updated live nodes from ZooKeeper... (1) -> (2)
[junit4] 2> 1316064 INFO (zkCallback-1793-thread-1) [ ] o.a.s.c.c.ZkStateReader Updated live nodes from ZooKeeper... (1) -> (2)
[junit4] 2> 1316068 INFO (zkCallback-1806-thread-2) [ ] o.a.s.c.c.ZkStateReader Updated live nodes from ZooKeeper... (0) -> (2)
[junit4] 2> 1316114 INFO (zkConnectionManagerCallback-1815-thread-1) [ ] o.a.s.c.c.ConnectionManager zkClient has connected
[junit4] 2> 1316115 INFO (jetty-launcher-1781-thread-1) [n:127.0.0.1:43790_solr ] o.a.s.c.c.ZkStateReader Updated live nodes from ZooKeeper... (0) -> (2)
[junit4] 2> 1316116 INFO (jetty-launcher-1781-thread-1) [n:127.0.0.1:43790_solr ] o.a.s.c.s.i.ZkClientClusterStateProvider Cluster at 127.0.0.1:44340/solr ready
[junit4] 2> 1316116 INFO (jetty-launcher-1781-thread-1) [n:127.0.0.1:43790_solr ] o.a.s.h.a.MetricsHistoryHandler No .system collection, keeping metrics history in memory.
[junit4] 2> 1316166 INFO (jetty-launcher-1781-thread-2) [n:127.0.0.1:35477_solr ] o.a.s.h.a.MetricsHistoryHandler No .system collection, keeping metrics history in memory.
[junit4] 2> 1316348 INFO (jetty-launcher-1781-thread-1) [n:127.0.0.1:43790_solr ] o.a.s.m.r.SolrJmxReporter JMX monitoring for 'solr_43790.solr.node' (registry 'solr.node') enabled at server: com.sun.jmx.mbeanserver.JmxMBeanServer@573dceeb
[junit4] 2> 1316426 INFO (jetty-launcher-1781-thread-2) [n:127.0.0.1:35477_solr ] o.a.s.m.r.SolrJmxReporter JMX monitoring for 'solr_35477.solr.node' (registry 'solr.node') enabled at server: com.sun.jmx.mbeanserver.JmxMBeanServer@573dceeb
[junit4] 2> 1316496 INFO (jetty-launcher-1781-thread-2) [n:127.0.0.1:35477_solr ] o.a.s.m.r.SolrJmxReporter JMX monitoring for 'solr_35477.solr.jvm' (registry 'solr.jvm') enabled at server: com.sun.jmx.mbeanserver.JmxMBeanServer@573dceeb
[junit4] 2> 1316496 INFO (jetty-launcher-1781-thread-2) [n:127.0.0.1:35477_solr ] o.a.s.m.r.SolrJmxReporter JMX monitoring for 'solr_35477.solr.jetty' (registry 'solr.jetty') enabled at server: com.sun.jmx.mbeanserver.JmxMBeanServer@573dceeb
[junit4] 2> 1316497 INFO (jetty-launcher-1781-thread-2) [n:127.0.0.1:35477_solr ] o.a.s.c.CorePropertiesLocator Found 0 core definitions underneath /home/jenkins/jenkins-slave/workspace/Lucene-Solr-Tests-7.x/solr/build/solr-core/test/J0/temp/solr.cloud.AliasIntegrationTest_7B98F69C00DA112-001/tempDir-001/node2/.
[junit4] 2> 1316522 INFO (jetty-launcher-1781-thread-1) [n:127.0.0.1:43790_solr ] o.a.s.m.r.SolrJmxReporter JMX monitoring for 'solr_43790.solr.jvm' (registry 'solr.jvm') enabled at server: com.sun.jmx.mbeanserver.JmxMBeanServer@573dceeb
[junit4] 2> 1316522 INFO (jetty-launcher-1781-thread-1) [n:127.0.0.1:43790_solr ] o.a.s.m.r.SolrJmxReporter JMX monitoring for 'solr_43790.solr.jetty' (registry 'solr.jetty') enabled at server: com.sun.jmx.mbeanserver.JmxMBeanServer@573dceeb
[junit4] 2> 1316523 INFO (jetty-launcher-1781-thread-1) [n:127.0.0.1:43790_solr ] o.a.s.c.CorePropertiesLocator Found 0 core definitions underneath /home/jenkins/jenkins-slave/workspace/Lucene-Solr-Tests-7.x/solr/build/solr-core/test/J0/temp/solr.cloud.AliasIntegrationTest_7B98F69C00DA112-001/tempDir-001/node1/.
[junit4] 2> 1317016 INFO (zkConnectionManagerCallback-1818-thread-1) [ ] o.a.s.c.c.ConnectionManager zkClient has connected
[junit4] 2> 1317150 INFO (zkConnectionManagerCallback-1823-thread-1) [ ] o.a.s.c.c.ConnectionManager zkClient has connected
[junit4] 2> 1317171 INFO (SUITE-AliasIntegrationTest-seed#[7B98F69C00DA112]-worker) [ ] o.a.s.c.c.ZkStateReader Updated live nodes from ZooKeeper... (0) -> (2)
[junit4] 2> 1317172 INFO (SUITE-AliasIntegrationTest-seed#[7B98F69C00DA112]-worker) [ ] o.a.s.c.s.i.ZkClientClusterStateProvider Cluster at 127.0.0.1:44340/solr ready
[junit4] 2> 1317430 INFO (TEST-AliasIntegrationTest.testModifyPropertiesCAR-seed#[7B98F69C00DA112]) [ ] o.a.s.SolrTestCaseJ4 ###Starting testModifyPropertiesCAR
[junit4] 2> 1318126 INFO (qtp1203029794-6234) [n:127.0.0.1:35477_solr ] o.a.s.h.a.CollectionsHandler Invoked Collection Action :create with params collection.configName=conf&name=collection1meta&nrtReplicas=1&action=CREATE&numShards=2&wt=javabin&version=2 and sendToOCPQueue=true
[junit4] 2> 1318252 INFO (OverseerThreadFactory-2476-thread-1-processing-n:127.0.0.1:35477_solr) [n:127.0.0.1:35477_solr ] o.a.s.c.a.c.CreateCollectionCmd Create collection collection1meta
[junit4] 2> 1318423 INFO (qtp1203029794-6230) [n:127.0.0.1:35477_solr ] o.a.s.s.HttpSolrCall [admin] webapp=null path=/admin/metrics params={prefix=CONTAINER.fs.usableSpace,CONTAINER.fs.totalSpace,CORE.coreName&wt=javabin&version=2&group=solr.node,solr.core} status=0 QTime=0
[junit4] 2> 1318622 INFO (qtp1208933906-6243) [n:127.0.0.1:43790_solr ] o.a.s.s.HttpSolrCall [admin] webapp=null path=/admin/metrics params={prefix=CONTAINER.fs.usableSpace,CONTAINER.fs.totalSpace,CORE.coreName&wt=javabin&version=2&group=solr.node,solr.core} status=0 QTime=0
[junit4] 2> 1318691 INFO (OverseerStateUpdate-73631017107193860-127.0.0.1:35477_solr-n_0000000000) [n:127.0.0.1:35477_solr ] o.a.s.c.o.SliceMutator createReplica() {
[junit4] 2> "operation":"ADDREPLICA",
[junit4] 2> "collection":"collection1meta",
[junit4] 2> "shard":"shard1",
[junit4] 2> "core":"collection1meta_shard1_replica_n1",
[junit4] 2> "state":"down",
[junit4] 2> "base_url":"https://127.0.0.1:43790/solr",
[junit4] 2> "type":"NRT",
[junit4] 2> "waitForFinalState":"false"}
[junit4] 2> 1318694 INFO (OverseerStateUpdate-73631017107193860-127.0.0.1:35477_solr-n_0000000000) [n:127.0.0.1:35477_solr ] o.a.s.c.o.SliceMutator createReplica() {
[junit4] 2> "operation":"ADDREPLICA",
[junit4] 2> "collection":"collection1meta",
[junit4] 2> "shard":"shard2",
[junit4] 2> "core":"collection1meta_shard2_replica_n2",
[junit4] 2> "state":"down",
[junit4] 2> "base_url":"https://127.0.0.1:35477/solr",
[junit4] 2> "type":"NRT",
[junit4] 2> "waitForFinalState":"false"}
[junit4] 2> 1318944 INFO (qtp1208933906-6239) [n:127.0.0.1:43790_solr x:collection1meta_shard1_replica_n1] o.a.s.h.a.CoreAdminOperation core create command qt=/admin/cores&coreNodeName=core_node3&collection.configName=conf&newCollection=true&name=collection1meta_shard1_replica_n1&action=CREATE&numShards=2&collection=collection1meta&shard=shard1&wt=javabin&version=2&replicaType=NRT
[junit4] 2> 1318944 INFO (qtp1208933906-6239) [n:127.0.0.1:43790_solr x:collection1meta_shard1_replica_n1] o.a.s.c.TransientSolrCoreCacheDefault Allocating transient cache for 2147483647 transient cores
[junit4] 2> 1318983 INFO (qtp1203029794-6235) [n:127.0.0.1:35477_solr x:collection1meta_shard2_replica_n2] o.a.s.h.a.CoreAdminOperation core create command qt=/admin/cores&coreNodeName=core_node4&collection.configName=conf&newCollection=true&name=collection1meta_shard2_replica_n2&action=CREATE&numShards=2&collection=collection1meta&shard=shard2&wt=javabin&version=2&replicaType=NRT
[junit4] 2> 1320238 INFO (qtp1208933906-6239) [n:127.0.0.1:43790_solr c:collection1meta s:shard1 r:core_node3 x:collection1meta_shard1_replica_n1] o.a.s.c.SolrConfig Using Lucene MatchVersion: 7.6.0
[junit4] 2> 1320310 INFO (qtp1208933906-6239) [n:127.0.0.1:43790_solr c:collection1meta s:shard1 r:core_node3 x:collection1meta_shard1_replica_n1] o.a.s.s.IndexSchema [collection1meta_shard1_replica_n1] Schema name=minimal
[junit4] 2> 1320314 INFO (qtp1203029794-6235) [n:127.0.0.1:35477_solr c:collection1meta s:shard2 r:core_node4 x:collection1meta_shard2_replica_n2] o.a.s.c.SolrConfig Using Lucene MatchVersion: 7.6.0
[junit4] 2> 1320325 INFO (qtp1208933906-6239) [n:127.0.0.1:43790_solr c:collection1meta s:shard1 r:core_node3 x:collection1meta_shard1_replica_n1] o.a.s.s.IndexSchema Loaded schema minimal/1.1 with uniqueid field id
[junit4] 2> 1320325 INFO (qtp1208933906-6239) [n:127.0.0.1:43790_solr c:collection1meta s:shard1 r:core_node3 x:collection1meta_shard1_replica_n1] o.a.s.c.CoreContainer Creating SolrCore 'collection1meta_shard1_replica_n1' using configuration from collection collection1meta, trusted=true
[junit4] 2> 1320327 INFO (qtp1208933906-6239) [n:127.0.0.1:43790_solr c:collection1meta s:shard1 r:core_node3 x:collection1meta_shard1_replica_n1] o.a.s.m.r.SolrJmxReporter JMX monitoring for 'solr_43790.solr.core.collection1meta.shard1.replica_n1' (registry 'solr.core.collection1meta.shard1.replica_n1') enabled at server: com.sun.jmx.mbeanserver.JmxMBeanServer@573dceeb
[junit4] 2> 1320327 INFO (qtp1208933906-6239) [n:127.0.0.1:43790_solr c:collection1meta s:shard1 r:core_node3 x:collection1meta_shard1_replica_n1] o.a.s.c.SolrCore [[collection1meta_shard1_replica_n1] ] Opening new SolrCore at [/home/jenkins/jenkins-slave/workspace/Lucene-Solr-Tests-7.x/solr/build/solr-core/test/J0/temp/solr.cloud.AliasIntegrationTest_7B98F69C00DA112-001/tempDir-001/node1/collection1meta_shard1_replica_n1], dataDir=[/home/jenkins/jenkins-slave/workspace/Lucene-Solr-Tests-7.x/solr/build/solr-core/test/J0/temp/solr.cloud.AliasIntegrationTest_7B98F69C00DA112-001/tempDir-001/node1/./collection1meta_shard1_replica_n1/data/]
[junit4] 2> 1320423 INFO (qtp1203029794-6235) [n:127.0.0.1:35477_solr c:collection1meta s:shard2 r:core_node4 x:collection1meta_shard2_replica_n2] o.a.s.s.IndexSchema [collection1meta_shard2_replica_n2] Schema name=minimal
[junit4] 2> 1320425 INFO (qtp1203029794-6235) [n:127.0.0.1:35477_solr c:collection1meta s:shard2 r:core_node4 x:collection1meta_shard2_replica_n2] o.a.s.s.IndexSchema Loaded schema minimal/1.1 with uniqueid field id
[junit4] 2> 1320425 INFO (qtp1203029794-6235) [n:127.0.0.1:35477_solr c:collection1meta s:shard2 r:core_node4 x:collection1meta_shard2_replica_n2] o.a.s.c.CoreContainer Creating SolrCore 'collection1meta_shard2_replica_n2' using configuration from collection collection1meta, trusted=true
[junit4] 2> 1320453 INFO (qtp1203029794-6235) [n:127.0.0.1:35477_solr c:collection1meta s:shard2 r:core_node4 x:collection1meta_shard2_replica_n2] o.a.s.m.r.SolrJmxReporter JMX monitoring for 'solr_35477.solr.core.collection1meta.shard2.replica_n2' (registry 'solr.core.collection1meta.shard2.replica_n2') enabled at server: com.sun.jmx.mbeanserver.JmxMBeanServer@573dceeb
[junit4] 2> 1320453 INFO (qtp1203029794-6235) [n:127.0.0.1:35477_solr c:collection1meta s:shard2 r:core_node4 x:collection1meta_shard2_replica_n2] o.a.s.c.SolrCore [[collection1meta_shard2_replica_n2] ] Opening new SolrCore at [/home/jenkins/jenkins-slave/workspace/Lucene-Solr-Tests-7.x/solr/build/solr-core/test/J0/temp/solr.cloud.AliasIntegrationTest_7B98F69C00DA112-001/tempDir-001/node2/collection1meta_shard2_replica_n2], dataDir=[/home/jenkins/jenkins-slave/workspace/Lucene-Solr-Tests-7.x/solr/build/solr-core/test/J0/temp/solr.cloud.AliasIntegrationTest_7B98F69C00DA112-001/tempDir-001/node2/./collection1meta_shard2_replica_n2/data/]
[junit4] 2> 1320819 INFO (qtp1208933906-6239) [n:127.0.0.1:43790_solr c:collection1meta s:shard1 r:core_node3 x:collection1meta_shard1_replica_n1] o.a.s.u.UpdateHandler Using UpdateLog implementation: org.apache.solr.update.UpdateLog
[junit4] 2> 1320819 INFO (qtp1208933906-6239) [n:127.0.0.1:43790_solr c:collection1meta s:shard1 r:core_node3 x:collection1meta_shard1_replica_n1] o.a.s.u.UpdateLog Initializing UpdateLog: dataDir=null defaultSyncLevel=FLUSH numRecordsToKeep=100 maxNumLogsToKeep=10 numVersionBuckets=65536
[junit4] 2> 1320855 INFO (qtp1208933906-6239) [n:127.0.0.1:43790_solr c:collection1meta s:shard1 r:core_node3 x:collection1meta_shard1_replica_n1] o.a.s.u.CommitTracker Hard AutoCommit: disabled
[junit4] 2> 1320855 INFO (qtp1208933906-6239) [n:127.0.0.1:43790_solr c:collection1meta s:shard1 r:core_node3 x:collection1meta_shard1_replica_n1] o.a.s.u.CommitTracker Soft AutoCommit: disabled
[junit4] 2> 1320889 INFO (qtp1208933906-6239) [n:127.0.0.1:43790_solr c:collection1meta s:shard1 r:core_node3 x:collection1meta_shard1_replica_n1] o.a.s.s.SolrIndexSearcher Opening [Searcher@7ecdd553[collection1meta_shard1_replica_n1] main]
[junit4] 2> 1320890 INFO (qtp1208933906-6239) [n:127.0.0.1:43790_solr c:collection1meta s:shard1 r:core_node3 x:collection1meta_shard1_replica_n1] o.a.s.r.ManagedResourceStorage Configured ZooKeeperStorageIO with znodeBase: /configs/conf
[junit4] 2> 1320891 INFO (qtp1208933906-6239) [n:127.0.0.1:43790_solr c:collection1meta s:shard1 r:core_node3 x:collection1meta_shard1_replica_n1] o.a.s.r.ManagedResourceStorage Loaded null at path _rest_managed.json using ZooKeeperStorageIO:path=/configs/conf
[junit4] 2> 1320891 INFO (qtp1208933906-6239) [n:127.0.0.1:43790_solr c:collection1meta s:shard1 r:core_node3 x:collection1meta_shard1_replica_n1] o.a.s.h.ReplicationHandler Commits will be reserved for 10000ms.
[junit4] 2> 1320891 INFO (qtp1208933906-6239) [n:127.0.0.1:43790_solr c:collection1meta s:shard1 r:core_node3 x:collection1meta_shard1_replica_n1] o.a.s.u.UpdateLog Could not find max version in index or recent updates, using new clock 1616559353635012608
[junit4] 2> 1320953 INFO (qtp1208933906-6239) [n:127.0.0.1:43790_solr c:collection1meta s:shard1 r:core_node3 x:collection1meta_shard1_replica_n1] o.a.s.c.ZkShardTerms Successful update of terms at /collections/collection1meta/terms/shard1 to Terms{values={core_node3=0}, version=0}
[junit4] 2> 1320966 INFO (searcherExecutor-2485-thread-1-processing-n:127.0.0.1:43790_solr x:collection1meta_shard1_replica_n1 c:collection1meta s:shard1 r:core_node3) [n:127.0.0.1:43790_solr c:collection1meta s:shard1 r:core_node3 x:collection1meta_shard1_replica_n1] o.a.s.c.SolrCore [collection1meta_shard1_replica_n1] Registered new searcher Searcher@7ecdd553[collection1meta_shard1_replica_n1] main{ExitableDirectoryReader(UninvertingDirectoryReader())}
[junit4] 2> 1320968 INFO (qtp1208933906-6239) [n:127.0.0.1:43790_solr c:collection1meta s:shard1 r:core_node3 x:collection1meta_shard1_replica_n1] o.a.s.c.ShardLeaderElectionContext Enough replicas found to continue.
[junit4] 2> 1320968 INFO (qtp1208933906-6239) [n:127.0.0.1:43790_solr c:collection1meta s:shard1 r:core_node3 x:collection1meta_shard1_replica_n1] o.a.s.c.ShardLeaderElectionContext I may be the new leader - try and sync
[junit4] 2> 1320968 INFO (qtp1208933906-6239) [n:127.0.0.1:43790_solr c:collection1meta s:shard1 r:core_node3 x:collection1meta_shard1_replica_n1] o.a.s.c.SyncStrategy Sync replicas to https://127.0.0.1:43790/solr/collection1meta_shard1_replica_n1/
[junit4] 2> 1320968 INFO (qtp1208933906-6239) [n:127.0.0.1:43790_solr c:collection1meta s:shard1 r:core_node3 x:collection1meta_shard1_replica_n1] o.a.s.c.SyncStrategy Sync Success - now sync replicas to me
[junit4] 2> 1320968 INFO (qtp1208933906-6239) [n:127.0.0.1:43790_solr c:collection1meta s:shard1 r:core_node3 x:collection1meta_shard1_replica_n1] o.a.s.c.SyncStrategy https://127.0.0.1:43790/solr/collection1meta_shard1_replica_n1/ has no replicas
[junit4] 2> 1320968 INFO (qtp1208933906-6239) [n:127.0.0.1:43790_solr c:collection1meta s:shard1 r:core_node3 x:collection1meta_shard1_replica_n1] o.a.s.c.ShardLeaderElectionContext Found all replicas participating in election, clear LIR
[junit4] 2> 1320988 INFO (qtp1208933906-6239) [n:127.0.0.1:43790_solr c:collection1meta s:shard1 r:core_node3 x:collection1meta_shard1_replica_n1] o.a.s.c.ShardLeaderElectionContext I am the new leader: https://127.0.0.1:43790/solr/collection1meta_shard1_replica_n1/ shard1
[junit4] 2> 1321047 INFO (qtp1203029794-6235) [n:127.0.0.1:35477_solr c:collection1meta s:shard2 r:core_node4 x:collection1meta_shard2_replica_n2] o.a.s.u.UpdateHandler Using UpdateLog implementation: org.apache.solr.update.UpdateLog
[junit4] 2> 1321047 INFO (qtp1203029794-6235) [n:127.0.0.1:35477_solr c:collection1meta s:shard2 r:core_node4 x:collection1meta_shard2_replica_n2] o.a.s.u.UpdateLog Initializing UpdateLog: dataDir=null defaultSyncLevel=FLUSH numRecordsToKeep=100 maxNumLogsToKeep=10 numVersionBuckets=65536
[junit4] 2> 1321048 INFO (qtp1203029794-6235) [n:127.0.0.1:35477_solr c:collection1meta s:shard2 r:core_node4 x:collection1meta_shard2_replica_n2] o.a.s.u.CommitTracker Hard AutoCommit: disabled
[junit4] 2> 1321048 INFO (qtp1203029794-6235) [n:127.0.0.1:35477_solr c:collection1meta s:shard2 r:core_node4 x:collection1meta_shard2_replica_n2] o.a.s.u.CommitTracker Soft AutoCommit: disabled
[junit4] 2> 1321050 INFO (qtp1203029794-6235) [n:127.0.0.1:35477_solr c:collection1meta s:shard2 r:core_node4 x:collection1meta_shard2_replica_n2] o.a.s.s.SolrIndexSearcher Opening [Searcher@64ba63b0[collection1meta_shard2_replica_n2] main]
[junit4] 2> 1321086 INFO (qtp1203029794-6235) [n:127.0.0.1:35477_solr c:collection1meta s:shard2 r:core_node4 x:collection1meta_shard2_replica_n2] o.a.s.r.ManagedResourceStorage Configured ZooKeeperStorageIO with znodeBase: /configs/conf
[junit4] 2> 1321086 INFO (qtp1203029794-6235) [n:127.0.0.1:35477_solr c:collection1meta s:shard2 r:core_node4 x:collection1meta_shard2_replica_n2] o.a.s.r.ManagedResourceStorage Loaded null at path _rest_managed.json using ZooKeeperStorageIO:path=/configs/conf
[junit4] 2> 1321087 INFO (qtp1203029794-6235) [n:127.0.0.1:35477_solr c:collection1meta s:shard2 r:core_node4 x:collection1meta_shard2_replica_n2] o.a.s.h.ReplicationHandler Commits will be reserved for 10000ms.
[junit4] 2> 1321113 INFO (qtp1208933906-6239) [n:127.0.0.1:43790_solr c:collection1meta s:shard1 r:core_node3 x:collection1meta_shard1_replica_n1] o.a.s.c.ZkController I am the leader, no recovery necessary
[junit4] 2> 1321114 INFO (qtp1208933906-6239) [n:127.0.0.1:43790_solr c:collection1meta s:shard1 r:core_node3 x:collection1meta_shard1_replica_n1] o.a.s.s.HttpSolrCall [admin] webapp=null path=/admin/cores params={qt=/admin/cores&coreNodeName=core_node3&collection.configName=conf&newCollection=true&name=collection1meta_shard1_replica_n1&action=CREATE&numShards=2&collection=collection1meta&shard=shard1&wt=javabin&version=2&replicaType=NRT} status=0 QTime=2170
[junit4] 2> 1321133 INFO (searcherExecutor-2486-thread-1-processing-n:127.0.0.1:35477_solr x:collection1meta_shard2_replica_n2 c:collection1meta s:shard2 r:core_node4) [n:127.0.0.1:35477_solr c:collection1meta s:shard2 r:core_node4 x:collection1meta_shard2_replica_n2] o.a.s.c.SolrCore [collection1meta_shard2_replica_n2] Registered new searcher Searcher@64ba63b0[collection1meta_shard2_replica_n2] main{ExitableDirectoryReader(UninvertingDirectoryReader())}
[junit4] 2> 1321133 INFO (qtp1203029794-6235) [n:127.0.0.1:35477_solr c:collection1meta s:shard2 r:core_node4 x:collection1meta_shard2_replica_n2] o.a.s.u.UpdateLog Could not find max version in index or recent updates, using new clock 1616559353888768000
[junit4] 2> 1321152 INFO (qtp1203029794-6235) [n:127.0.0.1:35477_solr c:collection1meta s:shard2 r:core_node4 x:collection1meta_shard2_replica_n2] o.a.s.c.ZkShardTerms Successful update of terms at /collections/collection1meta/terms/shard2 to Terms{values={core_node4=0}, version=0}
[junit4] 2> 1321187 INFO (qtp1203029794-6235) [n:127.0.0.1:35477_solr c:collection1meta s:shard2 r:core_node4 x:collection1meta_shard2_replica_n2] o.a.s.c.ShardLeaderElectionContext Enough replicas found to continue.
[junit4] 2> 1321187 INFO (qtp1203029794-6235) [n:127.0.0.1:35477_solr c:collection1meta s:shard2 r:core_node4 x:collection1meta_shard2_replica_n2] o.a.s.c.ShardLeaderElectionContext I may be the new leader - try and sync
[junit4] 2> 1321187 INFO (qtp1203029794-6235) [n:127.0.0.1:35477_solr c:collection1meta s:shard2 r:core_node4 x:collection1meta_shard2_replica_n2] o.a.s.c.SyncStrategy Sync replicas to https://127.0.0.1:35477/solr/collection1meta_shard2_replica_n2/
[junit4] 2> 1321187 INFO (qtp1203029794-6235) [n:127.0.0.1:35477_solr c:collection1meta s:shard2 r:core_node4 x:collection1meta_shard2_replica_n2] o.a.s.c.SyncStrategy Sync Success - now sync replicas to me
[junit4] 2> 1321188 INFO (qtp1203029794-6235) [n:127.0.0.1:35477_solr c:collection1meta s:shard2 r:core_node4 x:collection1meta_shard2_replica_n2] o.a.s.c.SyncStrategy https://127.0.0.1:35477/solr/collection1meta_shard2_replica_n2/ has no replicas
[junit4] 2> 1321188 INFO (qtp1203029794-6235) [n:127.0.0.1:35477_solr c:collection1meta s:shard2 r:core_node4 x:collection1meta_shard2_replica_n2] o.a.s.c.ShardLeaderElectionContext Found all replicas participating in election, clear LIR
[junit4] 2> 1321224 INFO (qtp1203029794-6235) [n:127.0.0.1:35477_solr c:collection1meta s:shard2 r:core_node4 x:collection1meta_shard2_replica_n2] o.a.s.c.ShardLeaderElectionContext I am the new leader: https://127.0.0.1:35477/solr/collection1meta_shard2_replica_n2/ shard2
[junit4] 2> 1321258 INFO (zkCallback-1806-thread-1) [ ] o.a.s.c.c.ZkStateReader A cluster state change: [WatchedEvent state:SyncConnected type:NodeDataChanged path:/collections/collection1meta/state.json] for collection [collection1meta] has occurred - updating... (live nodes size: [2])
[junit4] 2> 1321421 INFO (zkCallback-1806-thread-1) [ ] o.a.s.c.c.ZkStateReader A cluster state change: [WatchedEvent state:SyncConnected type:NodeDataChanged path:/collections/collection1meta/state.json] for collection [collection1meta] has occurred - updating... (live nodes size: [2])
[junit4] 2> 1321434 INFO (qtp1203029794-6235) [n:127.0.0.1:35477_solr c:collection1meta s:shard2 r:core_node4 x:collection1meta_shard2_replica_n2] o.a.s.c.ZkController I am the leader, no recovery necessary
[junit4] 2> 1321435 INFO (qtp1203029794-6235) [n:127.0.0.1:35477_solr c:collection1meta s:shard2 r:core_node4 x:collection1meta_shard2_replica_n2] o.a.s.s.HttpSolrCall [admin] webapp=null path=/admin/cores params={qt=/admin/cores&coreNodeName=core_node4&collection.configName=conf&newCollection=true&name=collection1meta_shard2_replica_n2&action=CREATE&numShards=2&collection=collection1meta&shard=shard2&wt=javabin&version=2&replicaType=NRT} status=0 QTime=2452
[junit4] 2> 1321492 INFO (qtp1203029794-6234) [n:127.0.0.1:35477_solr ] o.a.s.h.a.CollectionsHandler Wait for new collection to be active for at most 30 seconds. Check all shard replicas
[junit4] 2> 1321629 INFO (zkCallback-1793-thread-2) [ ] o.a.s.c.c.ZkStateReader A cluster state change: [WatchedEvent state:SyncConnected type:NodeDataChanged path:/collections/collection1meta/state.json] for collection [collection1meta] has occurred - updating... (live nodes size: [2])
[junit4] 2> 1321633 INFO (zkCallback-1806-thread-1) [ ] o.a.s.c.c.ZkStateReader A cluster state change: [WatchedEvent state:SyncConnected type:NodeDataChanged path:/collections/collection1meta/state.json] for collection [collection1meta] has occurred - updating... (live nodes size: [2])
[junit4] 2> 1322348 INFO (OverseerCollectionConfigSetProcessor-73631017107193860-127.0.0.1:35477_solr-n_0000000000) [n:127.0.0.1:35477_solr ] o.a.s.c.OverseerTaskQueue Response ZK path: /overseer/collection-queue-work/qnr-0000000000 doesn't exist. Requestor may have disconnected from ZooKeeper
[junit4] 2> 1322492 INFO (qtp1203029794-6234) [n:127.0.0.1:35477_solr ] o.a.s.s.HttpSolrCall [admin] webapp=null path=/admin/collections params={collection.configName=conf&name=collection1meta&nrtReplicas=1&action=CREATE&numShards=2&wt=javabin&version=2} status=0 QTime=4366
[junit4] 2> 1322493 INFO (qtp1203029794-6233) [n:127.0.0.1:35477_solr ] o.a.s.h.a.CollectionsHandler Invoked Collection Action :create with params collection.configName=conf&name=collection2meta&nrtReplicas=1&action=CREATE&numShards=1&wt=javabin&version=2 and sendToOCPQueue=true
[junit4] 2> 1322533 INFO (OverseerThreadFactory-2476-thread-2-processing-n:127.0.0.1:35477_solr) [n:127.0.0.1:35477_solr ] o.a.s.c.a.c.CreateCollectionCmd Create collection collection2meta
[junit4] 2> 1322878 INFO (qtp1203029794-6237) [n:127.0.0.1:35477_solr ] o.a.s.s.HttpSolrCall [admin] webapp=null path=/admin/metrics params={wt=javabin&version=2&key=solr.core.collection1meta.shard2.replica_n2:INDEX.sizeInBytes} status=0 QTime=18
[junit4] 2> 1322879 INFO (qtp1203029794-6235) [n:127.0.0.1:35477_solr ] o.a.s.s.HttpSolrCall [admin] webapp=null path=/admin/metrics params={prefix=CONTAINER.fs.usableSpace,CONTAINER.fs.totalSpace,CORE.coreName&wt=javabin&version=2&group=solr.node,solr.core} status=0 QTime=0
[junit4] 2> 1322883 INFO (qtp1208933906-6245) [n:127.0.0.1:43790_solr ] o.a.s.s.HttpSolrCall [admin] webapp=null path=/admin/metrics params={wt=javabin&version=2&key=solr.core.collection1meta.shard1.replica_n1:INDEX.sizeInBytes} status=0 QTime=0
[junit4] 2> 1322910 INFO (qtp1208933906-6246) [n:127.0.0.1:43790_solr ] o.a.s.s.HttpSolrCall [admin] webapp=null path=/admin/metrics params={prefix=CONTAINER.fs.usableSpace,CONTAINER.fs.totalSpace,CORE.coreName&wt=javabin&version=2&group=solr.node,solr.core} status=0 QTime=26
[junit4] 2> 1322928 INFO (OverseerStateUpdate-73631017107193860-127.0.0.1:35477_solr-n_0000000000) [n:127.0.0.1:35477_solr ] o.a.s.c.o.SliceMutator createReplica() {
[junit4] 2> "operation":"ADDREPLICA",
[junit4] 2> "collection":"collection2meta",
[junit4] 2> "shard":"shard1",
[junit4] 2> "core":"collection2meta_shard1_replica_n1",
[junit4] 2> "state":"down",
[junit4] 2> "base_url":"https://127.0.0.1:43790/solr",
[junit4] 2> "type":"NRT",
[junit4] 2> "waitForFinalState":"false"}
[junit4] 2> 1323179 INFO (qtp1208933906-6243) [n:127.0.0.1:43790_solr x:collection2meta_shard1_replica_n1] o.a.s.h.a.CoreAdminOperation core create command qt=/admin/cores&coreNodeName=core_node2&collection.configName=conf&newCollection=true&name=collection2meta_shard1_replica_n1&action=CREATE&numShards=1&collection=collection2meta&shard=shard1&wt=javabin&version=2&replicaType=NRT
[junit4] 2> 1324288 INFO (qtp1208933906-6243) [n:127.0.0.1:43790_solr c:collection2meta s:shard1 r:core_node2 x:collection2meta_shard1_replica_n1] o.a.s.c.SolrConfig Using Lucene MatchVersion: 7.6.0
[junit4] 2> 1324361 INFO (qtp1208933906-6243) [n:127.0.0.1:43790_solr c:collection2meta s:shard1 r:core_node2 x:collection2meta_shard1_replica_n1] o.a.s.s.IndexSchema [collection2meta_shard1_replica_n1] Schema name=minimal
[junit4] 2> 1324416 INFO (qtp1208933906-6243) [n:127.0.0.1:43790_solr c:collection2meta s:shard1 r:core_node2 x:collection2meta_shard1_replica_n1] o.a.s.s.IndexSchema Loaded schema minimal/1.1 with uniqueid field id
[junit4] 2> 1324416 INFO (qtp1208933906-6243) [n:127.0.0.1:43790_solr c:collection2meta s:shard1 r:core_node2 x:collection2meta_shard1_replica_n1] o.a.s.c.CoreContainer Creating SolrCore 'collection2meta_shard1_replica_n1' using configuration from collection collection2meta, trusted=true
[junit4] 2> 1324417 INFO (qtp1208933906-6243) [n:127.0.0.1:43790_solr c:collection2meta s:shard1 r:core_node2 x:collection2meta_shard1_replica_n1] o.a.s.m.r.SolrJmxReporter JMX monitoring for 'solr_43790.solr.core.collection2meta.shard1.replica_n1' (registry 'solr.core.collection2meta.shard1.replica_n1') enabled at server: com.sun.jmx.mbeanserver.JmxMBeanServer@573dceeb
[junit4] 2> 1324417 INFO (qtp1208933906-6243) [n:127.0.0.1:43790_solr c:collection2meta s:shard1 r:core_node2 x:collection2meta_shard1_replica_n1] o.a.s.c.SolrCore [[collection2meta_shard1_replica_n1] ] Opening new SolrCore at [/home/jenkins/jenkins-slave/workspace/Lucene-Solr-Tests-7.x/solr/build/solr-core/test/J0/temp/solr.cloud.AliasIntegrationTest_7B98F69C00DA112-001/tempDir-001/node1/collection2meta_shard1_replica_n1], dataDir=[/home/jenkins/jenkins-slave/workspace/Lucene-Solr-Tests-7.x/solr/build/solr-core/test/J0/temp/solr.cloud.AliasIntegrationTest_7B98F69C00DA112-001/tempDir-001/node1/./collection2meta_shard1_replica_n1/data/]
[junit4] 2> 1324906 INFO (qtp1208933906-6243) [n:127.0.0.1:43790_solr c:collection2meta s:shard1 r:core_node2 x:collection2meta_shard1_replica_n1] o.a.s.u.UpdateHandler Using UpdateLog implementation: org.apache.solr.update.UpdateLog
[junit4] 2> 1324906 INFO (qtp1208933906-6243) [n:127.0.0.1:43790_solr c:collection2meta s:shard1 r:core_node2 x:collection2meta_shard1_replica_n1] o.a.s.u.UpdateLog Initializing UpdateLog: dataDir=null defaultSyncLevel=FLUSH numRecordsToKeep=100 maxNumLogsToKeep=10 numVersionBuckets=65536
[junit4] 2> 1324922 INFO (qtp1208933906-6243) [n:127.0.0.1:43790_solr c:collection2meta s:shard1 r:core_node2 x:collection2meta_shard1_replica_n1] o.a.s.u.CommitTracker Hard AutoCommit: disabled
[junit4] 2> 1324922 INFO (qtp1208933906-6243) [n:127.0.0.1:43790_solr c:collection2meta s:shard1 r:core_node2 x:collection2meta_shard1_replica_n1] o.a.s.u.CommitTracker Soft AutoCommit: disabled
[junit4] 2> 1324941 INFO (qtp1208933906-6243) [n:127.0.0.1:43790_solr c:collection2meta s:shard1 r:core_node2 x:collection2meta_shard1_replica_n1] o.a.s.s.SolrIndexSearcher Opening [Searcher@70e8d373[collection2meta_shard1_replica_n1] main]
[junit4] 2> 1324949 INFO (qtp1208933906-6243) [n:127.0.0.1:43790_solr c:collection2meta s:shard1 r:core_node2 x:collection2meta_shard1_replica_n1] o.a.s.r.ManagedResourceStorage Configured ZooKeeperStorageIO with znodeBase: /configs/conf
[junit4] 2> 1324949 INFO (qtp1208933906-6243) [n:127.0.0.1:43790_solr c:collection2meta s:shard1 r:core_node2 x:collection2meta_shard1_replica_n1] o.a.s.r.ManagedResourceStorage Loaded null at path _rest_managed.json using ZooKeeperStorageIO:path=/configs/conf
[junit4] 2> 1324949 INFO (qtp1208933906-6243) [n:127.0.0.1:43790_solr c:collection2meta s:shard1 r:core_node2 x:collection2meta_shard1_replica_n1] o.a.s.h.ReplicationHandler Commits will be reserved for 10000ms.
[junit4] 2> 1324977 INFO (searcherExecutor-2495-thread-1-processing-n:127.0.0.1:43790_solr x:collection2meta_shard1_replica_n1 c:collection2meta s:shard1 r:core_node2) [n:127.0.0.1:43790_solr c:collection2meta s:shard1 r:core_node2 x:collection2meta_shard1_replica_n1] o.a.s.c.SolrCore [collection2meta_shard1_replica_n1] Registered new searcher Searcher@70e8d373[collection2meta_shard1_replica_n1] main{ExitableDirectoryReader(UninvertingDirectoryReader())}
[junit4] 2> 1324979 INFO (qtp1208933906-6243) [n:127.0.0.1:43790_solr c:collection2meta s:shard1 r:core_node2 x:collection2meta_shard1_replica_n1] o.a.s.u.UpdateLog Could not find max version in index or recent updates, using new clock 1616559357921591296
[junit4] 2> 1325036 INFO (qtp1208933906-6243) [n:127.0.0.1:43790_solr c:collection2meta s:shard1 r:core_node2 x:collection2meta_shard1_replica_n1] o.a.s.c.ZkShardTerms Successful update of terms at /collections/collection2meta/terms/shard1 to Terms{values={core_node2=0}, version=0}
[junit4] 2> 1325080 INFO (qtp1208933906-6243) [n:127.0.0.1:43790_solr c:collection2meta s:shard1 r:core_node2 x:collection2meta_shard1_replica_n1] o.a.s.c.ShardLeaderElectionContext Enough replicas found to continue.
[junit4] 2> 1325080 INFO (qtp1208933906-6243) [n:127.0.0.1:43790_solr c:collection2meta s:shard1 r:core_node2 x:collection2meta_shard1_replica_n1] o.a.s.c.ShardLeaderElectionContext I may be the new leader - try and sync
[junit4] 2> 1325080 INFO (qtp1208933906-6243) [n:127.0.0.1:43790_solr c:collection2meta s:shard1 r:core_node2 x:collection2meta_shard1_replica_n1] o.a.s.c.SyncStrategy Sync replicas to https://127.0.0.1:43790/solr/collection2meta_shard1_replica_n1/
[junit4] 2> 1325080 INFO (qtp1208933906-6243) [n:127.0.0.1:43790_solr c:collection2meta s:shard1 r:core_node2 x:collection2meta_shard1_replica_n1] o.a.s.c.SyncStrategy Sync Success - now sync replicas to me
[junit4] 2> 1325080 INFO (qtp1208933906-6243) [n:127.0.0.1:43790_solr c:collection2meta s:shard1 r:core_node2 x:collection2meta_shard1_replica_n1] o.a.s.c.SyncStrategy https://127.0.0.1:43790/solr/collection2meta_shard1_replica_n1/ has no replicas
[junit4] 2> 1325080 INFO (qtp1208933906-6243) [n:127.0.0.1:43790_solr c:collection2meta s:shard1 r:core_node2 x:collection2meta_shard1_replica_n1] o.a.s.c.ShardLeaderElectionContext Found all replicas participating in election, clear LIR
[junit4] 2> 1325145 INFO (qtp1208933906-6243) [n:127.0.0.1:43790_solr c:collection2meta s:shard1 r:core_node2 x:collection2meta_shard1_replica_n1] o.a.s.c.ShardLeaderElectionContext I am the new leader: https://127.0.0.1:43790/solr/collection2meta_shard1_replica_n1/ shard1
[junit4] 2> 1325306 INFO (qtp1208933906-6243) [n:127.0.0.1:43790_solr c:collection2meta s:shard1 r:core_node2 x:collection2meta_shard1_replica_n1] o.a.s.c.ZkController I am the leader, no recovery necessary
[junit4] 2> 1325308 INFO (qtp1208933906-6243) [n:127.0.0.1:43790_solr c:collection2meta s:shard1 r:core_node2 x:collection2meta_shard1_replica_n1] o.a.s.s.HttpSolrCall [admin] webapp=null path=/admin/cores params={qt=/admin/cores&coreNodeName=core_node2&collection.configName=conf&newCollection=true&name=collection2meta_shard1_replica_n1&action=CREATE&numShards=1&collection=collection2meta&shard=shard1&wt=javabin&version=2&replicaType=NRT} status=0 QTime=2129
[junit4] 2> 1325354 INFO (qtp1203029794-6233) [n:127.0.0.1:35477_solr ] o.a.s.h.a.CollectionsHandler Wait for new collection to be active for at most 30 seconds. Check all shard replicas
[junit4] 2> 1325464 INFO (zkCallback-1806-thread-1) [ ] o.a.s.c.c.ZkStateReader A cluster state change: [WatchedEvent state:SyncConnected type:NodeDataChanged path:/collections/collection2meta/state.json] for collection [collection2meta] has occurred - updating... (live nodes size: [2])
[junit4] 2> 1326370 INFO (qtp1203029794-6233) [n:127.0.0.1:35477_solr ] o.a.s.s.HttpSolrCall [admin] webapp=null path=/admin/collections params={collection.configName=conf&name=collection2meta&nrtReplicas=1&action=CREATE&numShards=1&wt=javabin&version=2} status=0 QTime=3877
[junit4] 2> 1326445 INFO (qtp1203029794-6234) [n:127.0.0.1:35477_solr ] o.a.s.h.a.CollectionsHandler Invoked Collection Action :aliasprop with params name=testModifyPropertiesCAR&action=ALIASPROP&property.foo=baz&property.bar=bam&wt=javabin&version=2 and sendToOCPQueue=true
[junit4] 2> 1326481 INFO (OverseerCollectionConfigSetProcessor-73631017107193860-127.0.0.1:35477_solr-n_0000000000) [n:127.0.0.1:35477_solr ] o.a.s.c.OverseerTaskQueue Response ZK path: /overseer/collection-queue-work/qnr-0000000002 doesn't exist. Requestor may have disconnected from ZooKeeper
[junit4] 2> 1326536 INFO (qtp1203029794-6234) [n:127.0.0.1:35477_solr ] o.a.s.s.HttpSolrCall [admin] webapp=null path=/admin/collections params={name=testModifyPropertiesCAR&action=ALIASPROP&property.foo=baz&property.bar=bam&wt=javabin&version=2} status=0 QTime=90
[junit4] 2> 1326553 INFO (qtp1203029794-6233) [n:127.0.0.1:35477_solr ] o.a.s.h.a.CollectionsHandler Invoked Collection Action :aliasprop with params name=testModifyPropertiesCAR&action=ALIASPROP&property.foo=&wt=javabin&version=2 and sendToOCPQueue=true
[junit4] 2> 1326629 INFO (OverseerCollectionConfigSetProcessor-73631017107193860-127.0.0.1:35477_solr-n_0000000000) [n:127.0.0.1:35477_solr ] o.a.s.c.OverseerTaskQueue Response ZK path: /overseer/collection-queue-work/qnr-0000000004 doesn't exist. Requestor may have disconnected from ZooKeeper
[junit4] 2> 1326700 INFO (qtp1203029794-6233) [n:127.0.0.1:35477_solr ] o.a.s.s.HttpSolrCall [admin] webapp=null path=/admin/collections params={name=testModifyPropertiesCAR&action=ALIASPROP&property.foo=&wt=javabin&version=2} status=0 QTime=146
[junit4] 2> 1326700 INFO (qtp1203029794-6234) [n:127.0.0.1:35477_solr ] o.a.s.h.a.CollectionsHandler Invoked Collection Action :aliasprop with params name=testModifyPropertiesCAR&action=ALIASPROP&wt=javabin&version=2 and sendToOCPQueue=true
[junit4] 2> 1326716 INFO (OverseerCollectionConfigSetProcessor-73631017107193860-127.0.0.1:35477_solr-n_0000000000) [n:127.0.0.1:35477_solr ] o.a.s.c.OverseerTaskQueue Response ZK path: /overseer/collection-queue-work/qnr-0000000006 doesn't exist. Requestor may have disconnected from ZooKeeper
[junit4] 2> 1326736 INFO (qtp1203029794-6234) [n:127.0.0.1:35477_solr ] o.a.s.s.HttpSolrCall [admin] webapp=null path=/admin/collections params={name=testModifyPropertiesCAR&action=ALIASPROP&wt=javabin&version=2} status=0 QTime=35
[junit4] 2> 1326737 INFO (qtp1203029794-6233) [n:127.0.0.1:35477_solr ] o.a.s.h.a.CollectionsHandler Invoked Collection Action :aliasprop with params name=testModifyPropertiesCAR&action=ALIASPROP&property.foo=+&wt=javabin&version=2 and sendToOCPQueue=true
[junit4] 2> 1326739 INFO (OverseerCollectionConfigSetProcessor-73631017107193860-127.0.0.1:35477_solr-n_0000000000) [n:127.0.0.1:35477_solr ] o.a.s.c.OverseerTaskQueue Response ZK path: /overseer/collection-queue-work/qnr-0000000008 doesn't exist. Requestor may have disconnected from ZooKeeper
[junit4] 2> 1326959 INFO (qtp1203029794-6233) [n:127.0.0.1:35477_solr ] o.a.s.s.HttpSolrCall [admin] webapp=null path=/admin/collections params={name=testModifyPropertiesCAR&action=ALIASPROP&property.foo=+&wt=javabin&version=2} status=0 QTime=222
[junit4] 2> 1326959 INFO (TEST-AliasIntegrationTest.testModifyPropertiesCAR-seed#[7B98F69C00DA112]) [ ] o.a.s.SolrTestCaseJ4 ###Ending testModifyPropertiesCAR
[junit4] 2> 1326960 INFO (TEST-AliasIntegrationTest.testModifyPropertiesCAR-seed#[7B98F69C00DA112]) [ ] o.a.s.c.c.ZkStateReader Updated live nodes from ZooKeeper... (0) -> (2)
[junit4] 2> 1326962 INFO (qtp1203029794-6234) [n:127.0.0.1:35477_solr ] o.a.s.h.a.CollectionsHandler Invoked Collection Action :delete with params name=collection2meta&action=DELETE&wt=javabin&version=2 and sendToOCPQueue=true
[junit4] 2> 1326985 INFO (OverseerCollectionConfigSetProcessor-73631017107193860-127.0.0.1:35477_solr-n_0000000000) [n:127.0.0.1:35477_solr ] o.a.s.c.OverseerTaskQueue Response ZK path: /overseer/collection-queue-work/qnr-0000000010 doesn't exist. Requestor may have disconnected from ZooKeeper
[junit4] 2> 1326986 INFO (OverseerThreadFactory-2476-thread-5-processing-n:127.0.0.1:35477_solr) [n:127.0.0.1:35477_solr ] o.a.s.c.a.c.OverseerCollectionMessageHandler Executing Collection Cmd=action=UNLOAD&deleteInstanceDir=true&deleteDataDir=true&deleteMetricsHistory=true, asyncId=null
[junit4] 2> 1327000 INFO (qtp1208933906-6246) [n:127.0.0.1:43790_solr x:collection2meta_shard1_replica_n1] o.a.s.m.SolrMetricManager Closing metric reporters for registry=solr.core.collection2meta.shard1.replica_n1, tag=null
[junit4] 2> 1327000 INFO (qtp1208933906-6246) [n:127.0.0.1:43790_solr x:collection2meta_shard1_replica_n1] o.a.s.m.r.SolrJmxReporter Closing reporter [org.apache.solr.metrics.reporters.SolrJmxReporter@52f8d083: rootName = solr_43790, domain = solr.core.collection2meta.shard1.replica_n1, service url = null, agent id = null] for registry solr.core.collection2meta.shard1.replica_n1 / com.codahale.metrics.MetricRegistry@19b88c39
[junit4] 2> 1327112 INFO (qtp1208933906-6246) [n:127.0.0.1:43790_solr x:collection2meta_shard1_replica_n1] o.a.s.c.SolrCore [collection2meta_shard1_replica_n1] CLOSING SolrCore org.apache.solr.core.SolrCore@26538f64
[junit4] 2> 1327112 INFO (qtp1208933906-6246) [n:127.0.0.1:43790_solr x:collection2meta_shard1_replica_n1] o.a.s.m.SolrMetricManager Closing metric reporters for registry=solr.core.collection2meta.shard1.replica_n1, tag=26538f64
[junit4] 2> 1327112 INFO (qtp1208933906-6246) [n:127.0.0.1:43790_solr x:collection2meta_shard1_replica_n1] o.a.s.m.SolrMetricManager Closing metric reporters for registry=solr.collection.collection2meta.shard1.leader, tag=26538f64
[junit4] 2> 1327149 INFO (qtp1208933906-6246) [n:127.0.0.1:43790_solr x:collection2meta_shard1_replica_n1] o.a.s.c.ZkShardTerms Successful update of terms at /collections/collection2meta/terms/shard1 to Terms{values={}, version=1}
[junit4] 2> 1327165 INFO (qtp1208933906-6246) [n:127.0.0.1:43790_solr x:collection2meta_shard1_replica_n1] o.a.s.s.HttpSolrCall [admin] webapp=null path=/admin/cores params={deleteInstanceDir=true&deleteMetricsHistory=true&core=collection2meta_shard1_replica_n1&qt=/admin/cores&deleteDataDir=true&action=UNLOAD&wt=javabin&version=2} status=0 QTime=165
[junit4] 2> 1327313 INFO (zkCallback-1806-thread-1) [ ] o.a.s.c.c.ZkStateReader A cluster state change: [WatchedEvent state:SyncConnected type:NodeDeleted path:/collections/collection2meta/state.json] for collection [collection2meta] has occurred - updating... (live nodes size: [2])
[junit4] 2> 1328007 INFO (qtp1203029794-6234) [n:127.0.0.1:35477_solr ] o.a.s.s.HttpSolrCall [admin] webapp=null path=/admin/collections params={name=collection2meta&action=DELETE&wt=javabin&version=2} status=0 QTime=1045
[junit4] 2> 1328008 INFO (qtp1203029794-6233) [n:127.0.0.1:35477_solr ] o.a.s.h.a.CollectionsHandler Invoked Collection Action :delete with params name=collection1meta&action=DELETE&wt=javabin&version=2 and sendToOCPQueue=true
[junit4] 2> 1328028 INFO (OverseerCollectionConfigSetProcessor-73631017107193860-127.0.0.1:35477_solr-n_0000000000) [n:127.0.0.1:35477_solr ] o.a.s.c.OverseerTaskQueue Response ZK path: /overseer/collection-queue-work/qnr-0000000012 doesn't exist. Requestor may have disconnected from ZooKeeper
[junit4] 2> 1328029 INFO (OverseerThreadFactory-2476-thread-5-processing-n:127.0.0.1:35477_solr) [n:127.0.0.1:35477_solr ] o.a.s.c.a.c.OverseerCollectionMessageHandler Executing Collection Cmd=action=UNLOAD&deleteInstanceDir=true&deleteDataDir=true&deleteMetricsHistory=true, asyncId=null
[junit4] 2> 1328030 INFO (qtp1208933906-6243) [n:127.0.0.1:43790_solr x:collection1meta_shard1_replica_n1] o.a.s.m.SolrMetricManager Closing metric reporters for registry=solr.core.collection1meta.shard1.replica_n1, tag=null
[junit4] 2> 1328030 INFO (qtp1208933906-6243) [n:127.0.0.1:43790_solr x:collection1meta_shard1_replica_n1] o.a.s.m.r.SolrJmxReporter Closing reporter [org.apache.solr.metrics.reporters.SolrJmxReporter@2dff87ea: rootName = solr_43790, domain = solr.core.collection1meta.shard1.replica_n1, service url = null, agent id = null] for registry solr.core.collection1meta.shard1.replica_n1 / com.codahale.metrics.MetricRegistry@4a8e7994
[junit4] 2> 1328173 INFO (qtp1203029794-6234) [n:127.0.0.1:35477_solr x:collection1meta_shard2_replica_n2] o.a.s.m.SolrMetricManager Closing metric reporters for registry=solr.core.collection1meta.shard2.replica_n2, tag=null
[junit4] 2> 1328173 INFO (qtp1203029794-6234) [n:127.0.0.1:35477_solr x:collection1meta_shard2_replica_n2] o.a.s.m.r.SolrJmxReporter Closing reporter [org.apache.solr.metrics.reporters.SolrJmxReporter@2c515903: rootName = solr_35477, domain = solr.core.collection1meta.shard2.replica_n2, service url = null, agent id = null] for registry solr.core.collection1meta.shard2.replica_n2 / com.codahale.metrics.MetricRegistry@6541d8dd
[junit4] 2> 1328175 INFO (qtp1208933906-6243) [n:127.0.0.1:43790_solr x:collection1meta_shard1_replica_n1] o.a.s.c.SolrCore [collection1meta_shard1_replica_n1] CLOSING SolrCore org.apache.solr.core.SolrCore@1bc97a70
[junit4] 2> 1328176 INFO (qtp1208933906-6243) [n:127.0.0.1:43790_solr x:collection1meta_shard1_replica_n1] o.a.s.m.SolrMetricManager Closing metric reporters for registry=solr.core.collection1meta.shard1.replica_n1, tag=1bc97a70
[junit4] 2> 1328176 INFO (qtp1208933906-6243) [n:127.0.0.1:43790_solr x:collection1meta_shard1_replica_n1] o.a.s.m.SolrMetricManager Closing metric reporters for registry=solr.collection.collection1meta.shard1.leader, tag=1bc97a70
[junit4] 2> 1328281 INFO (qtp1203029794-6234) [n:127.0.0.1:35477_solr x:collection1meta_shard2_replica_n2] o.a.s.c.SolrCore [collection1meta_shard2_replica_n2] CLOSING SolrCore org.apache.solr.core.SolrCore@6d48c24e
[junit4] 2> 1328281 INFO (qtp1203029794-6234) [n:127.0.0.1:35477_solr x:collection1meta_shard2_replica_n2] o.a.s.m.SolrMetricManager Closing metric reporters for registry=solr.core.collection1meta.shard2.replica_n2, tag=6d48c24e
[junit4] 2> 1328281 INFO (qtp1203029794-6234) [n:127.0.0.1:35477_solr x:collection1meta_shard2_replica_n2] o.a.s.m.SolrMetricManager Closing metric reporters for registry=solr.collection.collection1meta.shard2.leader, tag=6d48c24e
[junit4] 2> 1328392 INFO (qtp1208933906-6243) [n:127.0.0.1:43790_solr x:collection1meta_shard1_replica_n1] o.a.s.c.ZkShardTerms Successful update of terms at /collections/collection1meta/terms/shard1 to Terms{values={}, version=1}
[junit4] 2> 1328394 INFO (qtp1208933906-6243) [n:127.0.0.1:43790_solr x:collection1meta_shard1_replica_n1] o.a.s.s.HttpSolrCall [admin] webapp=null path=/admin/cores params={deleteInstanceDir=true&deleteMetricsHistory=true&core=collection1meta_shard1_replica_n1&qt=/admin/cores&deleteDataDir=true&action=UNLOAD&wt=javabin&version=2} status=0 QTime=364
[junit4] 2> 1328405 INFO (qtp1203029794-6234) [n:127.0.0.1:35477_solr x:collection1meta_shard2_replica_n2] o.a.s.c.ZkShardTerms Successful update of terms at /collections/collection1meta/terms/shard2 to Terms{values={}, version=1}
[junit4] 2> 1328430 INFO (qtp1203029794-6234) [n:127.0.0.1:35477_solr x:collection1meta_shard2_replica_n2] o.a.s.s.HttpSolrCall [admin] webapp=null path=/admin/cores params={deleteInstanceDir=true&deleteMetricsHistory=true&core=collection1meta_shard2_replica_n2&qt=/admin/cores&deleteDataDir=true&action=UNLOAD&wt=javabin&version=2} status=0 QTime=276
[junit4] 2> 1328629 INFO (zkCallback-1806-thread-1) [ ] o.a.s.c.c.ZkStateReader A cluster state change: [WatchedEvent state:SyncConnected type:NodeDeleted path:/collections/collection1meta/state.json] for collection [collection1meta] has occurred - updating... (live nodes size: [2])
[junit4] 2> 1328629 INFO (zkCallback-1793-thread-2) [ ] o.a.s.c.c.ZkStateReader A cluster state change: [WatchedEvent state:SyncConnected type:NodeDeleted path:/collections/collection1meta/state.json] for collection [collection1meta] has occurred - updating... (live nodes size: [2])
[junit4] 2> 1329433 INFO (qtp1203029794-6233) [n:127.0.0.1:35477_solr ] o.a.s.s.HttpSolrCall [admin] webapp=null path=/admin/collections params={name=collection1meta&action=DELETE&wt=javabin&version=2} status=0 QTime=1425
[junit4] 2> 1329574 INFO (TEST-AliasIntegrationTest.testDeleteOneOfTwoCollectionsAliased-seed#[7B98F69C00DA112]) [ ] o.a.s.SolrTestCaseJ4 ###Starting testDeleteOneOfTwoCollectionsAliased
[junit4] 2> 1329639 INFO (qtp1203029794-6235) [n:127.0.0.1:35477_solr ] o.a.s.h.a.CollectionsHandler Invoked Collection Action :clusterstatus with params action=CLUSTERSTATUS&wt=javabin&version=2 and sendToOCPQueue=true
[junit4] 2> 1329713 INFO (qtp1203029794-6235) [n:127.0.0.1:35477_solr ] o.a.s.s.HttpSolrCall [admin] webapp=null path=/admin/collections params={action=CLUSTERSTATUS&wt=javabin&version=2} status=0 QTime=74
[junit4] 2> 1329771 INFO (qtp1203029794-6237) [n:127.0.0.1:35477_solr ] o.a.s.h.a.CollectionsHandler Invoked Collection Action :create with params collection.configName=conf&name=collection_one&nrtReplicas=1&action=CREATE&numShards=2&wt=javabin&version=2 and sendToOCPQueue=true
[junit4] 2> 1329820 INFO (OverseerCollectionConfigSetProcessor-73631017107193860-127.0.0.1:35477_solr-n_0000000000) [n:127.0.0.1:35477_solr ] o.a.s.c.OverseerTaskQueue Response ZK path: /overseer/collection-queue-work/qnr-0000000014 doesn't exist. Requestor may have disconnected from ZooKeeper
[junit4] 2> 1329831 INFO (OverseerThreadFactory-2476-thread-5-processing-n:127.0.0.1:35477_solr) [n:127.0.0.1:35477_solr ] o.a.s.c.a.c.CreateCollectionCmd Create collection collection_one
[junit4] 2> 1330080 INFO (qtp1203029794-6235) [n:127.0.0.1:35477_solr ] o.a.s.s.HttpSolrCall [admin] webapp=null path=/admin/metrics params={prefix=CONTAINER.fs.usableSpace,CONTAINER.fs.totalSpace,CORE.coreName&wt=javabin&version=2&group=solr.node,solr.core} status=0 QTime=0
[junit4] 2> 1330100 INFO (qtp1208933906-6245) [n:127.0.0.1:43790_solr ] o.a.s.s.HttpSolrCall [admin] webapp=null path=/admin/metrics params={prefix=CONTAINER.fs.usableSpace,CONTAINER.fs.totalSpace,CORE.coreName&wt=javabin&version=2&group=solr.node,solr.core} status=0 QTime=0
[junit4] 2> 1330161 INFO (OverseerStateUpdate-73631017107193860-127.0.0.1:35477_solr-n_0000000000) [n:127.0.0.1:35477_solr ] o.a.s.c.o.SliceMutator createReplica() {
[junit4] 2> "operation":"ADDREPLICA",
[junit4] 2> "collection":"collection_one",
[junit4] 2> "shard":"shard1",
[junit4] 2> "core":"collection_one_shard1_replica_n1",
[junit4] 2> "state":"down",
[junit4] 2> "base_url":"https://127.0.0.1:43790/solr",
[junit4] 2> "type":"NRT",
[junit4] 2> "waitForFinalState":"false"}
[junit4] 2> 1330161 INFO (OverseerStateUpdate-73631017107193860-127.0.0.1:35477_solr-n_0000000000) [n:127.0.0.1:35477_solr ] o.a.s.c.o.SliceMutator createReplica() {
[junit4] 2> "operation":"ADDREPLICA",
[junit4] 2> "collection":"collection_one",
[junit4] 2> "shard":"shard2",
[junit4] 2> "core":"collection_one_shard2_replica_n2",
[junit4] 2> "state":"down",
[junit4] 2> "base_url":"https://127.0.0.1:35477/solr",
[junit4] 2> "type":"NRT",
[junit4] 2> "waitForFinalState":"false"}
[junit4] 2> 1330360 INFO (qtp1203029794-6234) [n:127.0.0.1:35477_solr x:collection_one_shard2_replica_n2] o.a.s.h.a.CoreAdminOperation core create command qt=/admin/cores&coreNodeName=core_node4&collection.configName=conf&newCollection=true&name=collection_one_shard2_replica_n2&action=CREATE&numShards=2&collection=collection_one&shard=shard2&wt=javabin&version=2&replicaType=NRT
[junit4] 2> 1330360 INFO (qtp1208933906-6246) [n:127.0.0.1:43790_solr x:collection_one_shard1_replica_n1] o.a.s.h.a.CoreAdminOperation core create command qt=/admin/cores&coreNodeName=core_node3&collection.configName=conf&newCollection=true&name=collection_one_shard1_replica_n1&action=CREATE&numShards=2&collection=collection_one&shard=shard1&wt=javabin&version=2&replicaType=NRT
[junit4] 2> 1331432 INFO (qtp1208933906-6246) [n:127.0.0.1:43790_solr c:collection_one s:shard1 r:core_node3 x:collection_one_shard1_replica_n1] o.a.s.c.SolrConfig Using Lucene MatchVersion: 7.6.0
[junit4] 2> 1331450 INFO (qtp1203029794-6234) [n:127.0.0.1:35477_solr c:collection_one s:shard2 r:core_node4 x:collection_one_shard2_replica_n2] o.a.s.c.SolrConfig Using Lucene MatchVersion: 7.6.0
[junit4] 2> 1331507 INFO (qtp1208933906-6246) [n:127.0.0.1:43790_solr c:collection_one s:shard1 r:core_node3 x:collection_one_shard1_replica_n1] o.a.s.s.IndexSchema [collection_one_shard1_replica_n1] Schema name=minimal
[junit4] 2> 1331522 INFO (qtp1208933906-6246) [n:127.0.0.1:43790_solr c:collection_one s:shard1 r:core_node3 x:collection_one_shard1_replica_n1] o.a.s.s.IndexSchema Loaded schema minimal/1.1 with uniqueid field id
[junit4] 2> 1331523 INFO (qtp1208933906-6246) [n:127.0.0.1:43790_solr c:collection_one s:shard1 r:core_node3 x:collection_one_shard1_replica_n1] o.a.s.c.CoreContainer Creating SolrCore 'collection_one_shard1_replica_n1' using configuration from collection collection_one, trusted=true
[junit4] 2> 1331523 INFO (qtp1208933906-6246) [n:127.0.0.1:43790_solr c:collection_one s:shard1 r:core_node3 x:collection_one_shard1_replica_n1] o.a.s.m.r.SolrJmxReporter JMX monitoring for 'solr_43790.solr.core.collection_one.shard1.replica_n1' (registry 'solr.core.collection_one.shard1.replica_n1') enabled at server: com.sun.jmx.mbeanserver.JmxMBeanServer@573dceeb
[junit4] 2> 1331523 INFO (qtp1208933906-6246) [n:127.0.0.1:43790_solr c:collection_one s:shard1 r:core_node3 x:collection_one_shard1_replica_n1] o.a.s.c.SolrCore [[collection_one_shard1_replica_n1] ] Opening new SolrCore at [/home/jenkins/jenkins-slave/workspace/Lucene-Solr-Tests-7.x/solr/build/solr-core/test/J0/temp/solr.cloud.AliasIntegrationTest_7B98F69C00DA112-001/tempDir-001/node1/collection_one_shard1_replica_n1], dataDir=[/home/jenkins/jenkins-slave/workspace/Lucene-Solr-Tests-7.x/solr/build/solr-core/test/J0/temp/solr.cloud.AliasIntegrationTest_7B98F69C00DA112-001/tempDir-001/node1/./collection_one_shard1_replica_n1/data/]
[junit4] 2> 1331543 INFO (qtp1203029794-6234) [n:127.0.0.1:35477_solr c:collection_one s:shard2 r:core_node4 x:collection_one_shard2_replica_n2] o.a.s.s.IndexSchema [collection_one_shard2_replica_n2] Schema name=minimal
[junit4] 2> 1331559 INFO (qtp1203029794-6234) [n:127.0.0.1:35477_solr c:collection_one s:shard2 r:core_node4 x:collection_one_shard2_replica_n2] o.a.s.s.IndexSchema Loaded schema minimal/1.1 with uniqueid field id
[junit4] 2> 1331559 INFO (qtp1203029794-6234) [n:127.0.0.1:35477_solr c:collection_one s:shard2 r:core_node4 x:collection_one_shard2_replica_n2] o.a.s.c.CoreContainer Creating SolrCore 'collection_one_shard2_replica_n2' using configuration from collection collection_one, trusted=true
[junit4] 2> 1331559 INFO (qtp1203029794-6234) [n:127.0.0.1:35477_solr c:collection_one s:shard2 r:core_node4 x:collection_one_shard2_replica_n2] o.a.s.m.r.SolrJmxReporter JMX monitoring for 'solr_35477.solr.core.collection_one.shard2.replica_n2' (registry 'solr.core.collection_one.shard2.replica_n2') enabled at server: com.sun.jmx.mbeanserver.JmxMBeanServer@573dceeb
[junit4] 2> 1331560 INFO (qtp1203029794-6234) [n:127.0.0.1:35477_solr c:collection_one s:shard2 r:core_node4 x:collection_one_shard2_replica_n2] o.a.s.c.SolrCore [[collection_one_shard2_replica_n2] ] Opening new SolrCore at [/home/jenkins/jenkins-slave/workspace/Lucene-Solr-Tests-7.x/solr/build/solr-core/test/J0/temp/solr.cloud.AliasIntegrationTest_7B98F69C00DA112-001/tempDir-001/node2/collection_one_shard2_replica_n2], dataDir=[/home/jenkins/jenkins-slave/workspace/Lucene-Solr-Tests-7.x/solr/build/solr-core/test/J0/temp/solr.cloud.AliasIntegrationTest_7B98F69C00DA112-001/tempDir-001/node2/./collection_one_shard2_replica_n2/data/]
[junit4] 2> 1331956 INFO (qtp1208933906-6246) [n:127.0.0.1:43790_solr c:collection_one s:shard1 r:core_node3 x:collection_one_shard1_replica_n1] o.a.s.u.UpdateHandler Using UpdateLog implementation: org.apache.solr.update.UpdateLog
[junit4] 2> 1331956 INFO (qtp1208933906-6246) [n:127.0.0.1:43790_solr c:collection_one s:shard1 r:core_node3 x:collection_one_shard1_replica_n1] o.a.s.u.UpdateLog Initializing UpdateLog: dataDir=null defaultSyncLevel=FLUSH numRecordsToKeep=100 maxNumLogsToKeep=10 numVersionBuckets=65536
[junit4] 2> 1331957 INFO (qtp1208933906-6246) [n:127.0.0.1:43790_solr c:collection_one s:shard1 r:core_node3 x:collection_one_shard1_replica_n1] o.a.s.u.CommitTracker Hard AutoCommit: disabled
[junit4] 2> 1331957 INFO (qtp1208933906-6246) [n:127.0.0.1:43790_solr c:collection_one s:shard1 r:core_node3 x:collection_one_shard1_replica_n1] o.a.s.u.CommitTracker Soft AutoCommit: disabled
[junit4] 2> 1331959 INFO (qtp1208933906-6246) [n:127.0.0.1:43790_solr c:collection_one s:shard1 r:core_node3 x:collection_one_shard1_replica_n1] o.a.s.s.SolrIndexSearcher Opening [Searcher@6bc2db34[collection_one_shard1_replica_n1] main]
[junit4] 2> 1331977 INFO (qtp1208933906-6246) [n:127.0.0.1:43790_solr c:collection_one s:shard1 r:core_node3 x:collection_one_shard1_replica_n1] o.a.s.r.ManagedResourceStorage Configured ZooKeeperStorageIO with znodeBase: /configs/conf
[junit4] 2> 1331978 INFO (qtp1208933906-6246) [n:127.0.0.1:43790_solr c:collection_one s:shard1 r:core_node3 x:collection_one_shard1_replica_n1] o.a.s.r.ManagedResourceStorage Loaded null at path _rest_managed.json using ZooKeeperStorageIO:path=/configs/conf
[junit4] 2> 1331978 INFO (qtp1208933906-6246) [n:127.0.0.1:43790_solr c:collection_one s:shard1 r:core_node3 x:collection_one_shard1_replica_n1] o.a.s.h.ReplicationHandler Commits will be reserved for 10000ms.
[junit4] 2> 1331978 INFO (qtp1208933906-6246) [n:127.0.0.1:43790_solr c:collection_one s:shard1 r:core_node3 x:collection_one_shard1_replica_n1] o.a.s.u.UpdateLog Could not find max version in index or recent updates, using new clock 1616559365260574720
[junit4] 2> 1332017 INFO (qtp1203029794-6234) [n:127.0.0.1:35477_solr c:collection_one s:shard2 r:core_node4 x:collection_one_shard2_replica_n2] o.a.s.u.UpdateHandler Using UpdateLog implementation: org.apache.solr.update.UpdateLog
[junit4] 2> 1332017 INFO (qtp1203029794-6234) [n:127.0.0.1:35477_solr c:collection_one s:shard2 r:core_node4 x:collection_one_shard2_replica_n2] o.a.s.u.UpdateLog Initializing UpdateLog: dataDir=null defaultSyncLevel=FLUSH numRecordsToKeep=100 maxNumLogsToKeep=10 numVersionBuckets=65536
[junit4] 2> 1332018 INFO (qtp1203029794-6234) [n:127.0.0.1:35477_solr c:collection_one s:shard2 r:core_node4 x:collection_one_shard2_replica_n2] o.a.s.u.CommitTracker Hard AutoCommit: disabled
[junit4] 2> 1332018 INFO (qtp1203029794-6234) [n:127.0.0.1:35477_solr c:collection_one s:shard2 r:core_node4 x:collection_one_shard2_replica_n2] o.a.s.u.CommitTracker Soft AutoCommit: disabled
[junit4] 2> 1332033 INFO (qtp1203029794-6234) [n:127.0.0.1:35477_solr c:collection_one s:shard2 r:core_node4 x:collection_one_shard2_replica_n2] o.a.s.s.SolrIndexSearcher Opening [Searcher@25b3d815[collection_one_shard2_replica_n2] main]
[junit4] 2> 1332034 INFO (qtp1203029794-6234) [n:127.0.0.1:35477_solr c:collection_one s:shard2 r:core_node4 x:collection_one_shard2_replica_n2] o.a.s.r.ManagedResourceStorage Configured ZooKeeperStorageIO with znodeBase: /configs/conf
[junit4] 2> 1332053 INFO (qtp1203029794-6234) [n:127.0.0.1:35477_solr c:collection_one s:shard2 r:core_node4 x:collection_one_shard2_replica_n2] o.a.s.r.ManagedResourceStorage Loaded null at path _rest_managed.json using ZooKeeperStorageIO:path=/configs/conf
[junit4] 2> 1332054 INFO (qtp1203029794-6234) [n:127.0.0.1:35477_solr c:collection_one s:shard2 r:core_node4 x:collection_one_shard2_replica_n2] o.a.s.h.ReplicationHandler Commits will be reserved for 10000ms.
[junit4] 2> 1332054 INFO (qtp1203029794-6234) [n:127.0.0.1:35477_solr c:collection_one s:shard2 r:core_node4 x:collection_one_shard2_replica_n2] o.a.s.u.UpdateLog Could not find max version in index or recent updates, using new clock 1616559365340266496
[junit4] 2> 1332074 INFO (searcherExecutor-2500-thread-1-processing-n:127.0.0.1:43790_solr x:collection_one_shard1_replica_n1 c:collection_one s:shard1 r:core_node3) [n:127.0.0.1:43790_solr c:collection_one s:shard1 r:core_node3 x:collection_one_shard1_replica_n1] o.a.s.c.SolrCore [collection_one_shard1_replica_n1] Registered new searcher Searcher@6bc2db34[collection_one_shard1_replica_n1] main{ExitableDirectoryReader(UninvertingDirectoryReader())}
[junit4] 2> 1332074 INFO (searcherExecutor-2501-thread-1-processing-n:127.0.0.1:35477_solr x:collection_one_shard2_replica_n2 c:collection_one s:shard2 r:core_node4) [n:127.0.0.1:35477_solr c:collection_one s:shard2 r:core_node4 x:collection_one_shard2_replica_n2] o.a.s.c.SolrCore [collection_one_shard2_replica_n2] Registered new searcher Searcher@25b3d815[collection_one_shard2_replica_n2] main{ExitableDirectoryReader(UninvertingDirectoryReader())}
[junit4] 2> 1332091 INFO (qtp1203029794-6234) [n:127.0.0.1:35477_solr c:collection_one s:shard2 r:core_node4 x:collection_one_shard2_replica_n2] o.a.s.c.ZkShardTerms Successful update of terms at /collections/collection_one/terms/shard2 to Terms{values={core_node4=0}, version=0}
[junit4] 2> 1332093 INFO (qtp1203029794-6234) [n:127.0.0.1:35477_solr c:collection_one s:shard2 r:core_node4 x:collection_one_shard2_replica_n2] o.a.s.c.ShardLeaderElectionContext Enough replicas found to continue.
[junit4] 2> 1332106 INFO (qtp1203029794-6234) [n:127.0.0.1:35477_solr c:collection_one s:shard2 r:core_node4 x:collection_one_shard2_replica_n2] o.a.s.c.ShardLeaderElectionContext I may be the new leader - try and sync
[junit4] 2> 1332106 INFO (qtp1203029794-6234) [n:127.0.0.1:35477_solr c:collection_one s:shard2 r:core_node4 x:collection_one_shard2_replica_n2] o.a.s.c.SyncStrategy Sync replicas to https://127.0.0.1:35477/solr/collection_one_shard2_replica_n2/
[junit4] 2> 1332106 INFO (qtp1203029794-6234) [n:127.0.0.1:35477_solr c:collection_one s:shard2 r:core_node4 x:collection_one_shard2_replica_n2] o.a.s.c.SyncStrategy Sync Success - now sync replicas to me
[junit4] 2> 1332107 INFO (qtp1203029794-6234) [n:127.0.0.1:35477_solr c:collection_one s:shard2 r:core_node4 x:collection_one_shard2_replica_n2] o.a.s.c.SyncStrategy https://127.0.0.1:35477/solr/collection_one_shard2_replica_n2/ has no replicas
[junit4] 2> 1332110 INFO (qtp1203029794-6234) [n:127.0.0.1:35477_solr c:collection_one s:shard2 r:core_node4 x:collection_one_shard2_replica_n2] o.a.s.c.ShardLeaderElectionContext Found all replicas participating in election, clear LIR
[junit4] 2> 1332125 INFO (qtp1203029794-6234) [n:127.0.0.1:35477_solr c:collection_one s:shard2 r:core_node4 x:collection_one_shard2_replica_n2] o.a.s.c.ShardLeaderElectionContext I am the new leader: https://127.0.0.1:35477/solr/collection_one_shard2_replica_n2/ shard2
[junit4] 2> 1332142 INFO (qtp1208933906-6246) [n:127.0.0.1:43790_solr c:collection_one s:shard1 r:core_node3 x:collection_one_shard1_replica_n1] o.a.s.c.ZkShardTerms Successful update of terms at /collections/collection_one/terms/shard1 to Terms{values={core_node3=0}, version=0}
[junit4] 2> 1332144 INFO (qtp1208933906-6246) [n:127.0.0.1:43790_solr c:collection_one s:shard1 r:core_node3 x:collection_one_shard1_replica_n1] o.a.s.c.ShardLeaderElectionContext Enough replicas found to continue.
[junit4] 2> 1332144 INFO (qtp1208933906-6246) [n:127.0.0.1:43790_solr c:collection_one s:shard1 r:core_node3 x:collection_one_shard1_replica_n1] o.a.s.c.ShardLeaderElectionContext I may be the new leader - try and sync
[junit4] 2> 1332144 INFO (qtp1208933906-6246) [n:127.0.0.1:43790_solr c:collection_one s:shard1 r:core_node3 x:collection_one_shard1_replica_n1] o.a.s.c.SyncStrategy Sync replicas to https://127.0.0.1:43790/solr/collection_one_shard1_replica_n1/
[junit4] 2> 1332145 INFO (qtp1208933906-6246) [n:127.0.0.1:43790_solr c:collection_one s:shard1 r:core_node3 x:collection_one_shard1_replica_n1] o.a.s.c.SyncStrategy Sync Success - now sync replicas to me
[junit4] 2> 1332145 INFO (qtp1208933906-6246) [n:127.0.0.1:43790_solr c:collection_one s:shard1 r:core_node3 x:collection_one_shard1_replica_n1] o.a.s.c.SyncStrategy https://127.0.0.1:43790/solr/collection_one_shard1_replica_n1/ has no replicas
[junit4] 2> 1332145 INFO (qtp1208933906-6246) [n:127.0.0.1:43790_solr c:collection_one s:shard1 r:core_node3 x:collection_one_shard1_replica_n1] o.a.s.c.ShardLeaderElectionContext Found all replicas participating in election, clear LIR
[junit4] 2> 1332160 INFO (qtp1208933906-6246) [n:127.0.0.1:43790_solr c:collection_one s:shard1 r:core_node3 x:collection_one_shard1_replica_n1] o.a.s.c.ShardLeaderElectionContext I am the new leader: https://127.0.0.1:43790/solr/collection_one_shard1_replica_n1/ shard1
[junit4] 2> 1332283 INFO (qtp1203029794-6234) [n:127.0.0.1:35477_solr c:collection_one s:shard2 r:core_node4 x:collection_one_shard2_replica_n2] o.a.s.c.ZkController I am the leader, no recovery necessary
[junit4] 2> 1332285 INFO (qtp1203029794-6234) [n:127.0.0.1:35477_solr c:collection_one s:shard2 r:core_node4 x:collection_one_shard2_replica_n2] o.a.s.s.HttpSolrCall [admin] webapp=null path=/admin/cores params={qt=/admin/cores&coreNodeName=core_node4&collection.configName=conf&newCollection=true&name=collection_one_shard2_replica_n2&action=CREATE&numShards=2&collection=collection_one&shard=shard2&wt=javabin&version=2&replicaType=NRT} status=0 QTime=1925
[junit4] 2> 1332319 INFO (qtp1208933906-6246) [n:127.0.0.1:43790_solr c:collection_one s:shard1 r:core_node3 x:collection_one_shard1_replica_n1] o.a.s.c.ZkController I am the leader, no recovery necessary
[junit4] 2> 1332322 INFO (qtp1208933906-6246) [n:127.0.0.1:43790_solr c:collection_one s:shard1 r:core_node3 x:collection_one_shard1_replica_n1] o.a.s.s.HttpSolrCall [admin] webapp=null path=/admin/cores params={qt=/admin/cores&coreNodeName=core_node3&collection.configName=conf&newCollection=true&name=collection_one_shard1_replica_n1&action=CREATE&numShards=2&collection=collection_one&shard=shard1&wt=javabin&version=2&replicaType=NRT} status=0 QTime=1961
[junit4] 2> 1332371 INFO (qtp1203029794-6237) [n:127.0.0.1:35477_solr ] o.a.s.h.a.CollectionsHandler Wait for new collection to be active for at most 30 seconds. Check all shard replicas
[junit4] 2> 1332422 INFO (zkCallback-1806-thread-1) [ ] o.a.s.c.c.ZkStateReader A cluster state change: [WatchedEvent state:SyncConnected type:NodeDataChanged path:/collections/collection_one/state.json] for collection [collection_one] has occurred - updating... (live nodes size: [2])
[junit4] 2> 1332422 INFO (zkCallback-1793-thread-2) [ ] o.a.s.c.c.ZkStateReader A cluster state change: [WatchedEvent state:SyncConnected type:NodeDataChanged path:/collections/collection_one/state.json] for collection [collection_one] has occurred - updating... (live nodes size: [2])
[junit4] 2> 1333377 INFO (qtp1203029794-6237) [n:127.0.0.1:35477_solr ] o.a.s.s.HttpSolrCall [admin] webapp=null path=/admin/collections params={collection.configName=conf&name=collection_one&nrtReplicas=1&action=CREATE&numShards=2&wt=javabin&version=2} status=0 QTime=3606
[junit4] 2> 1333382 INFO (qtp1203029794-6233) [n:127.0.0.1:35477_solr ] o.a.s.h.a.CollectionsHandler Invoked Collection Action :create with params collection.configName=conf&name=collection_two&nrtReplicas=1&action=CREATE&numShards=1&wt=javabin&version=2 and sendToOCPQueue=true
[junit4] 2> 1333471 INFO (OverseerThreadFactory-2476-thread-5-processing-n:127.0.0.1:35477_solr) [n:127.0.0.1:35477_solr ] o.a.s.c.a.c.CreateCollectionCmd Create collection collection_two
[junit4] 2> 1333473 INFO (OverseerCollectionConfigSetProcessor-73631017107193860-127.0.0.1:35477_solr-n_0000000000) [n:127.0.0.1:35477_solr ] o.a.s.c.OverseerTaskQueue Response ZK path: /overseer/collection-queue-work/qnr-0000000016 doesn't exist. Requestor may have disconnected from ZooKeeper
[junit4] 2> 1333645 INFO (qtp1203029794-6235) [n:127.0.0.1:35477_solr ] o.a.s.s.HttpSolrCall [admin] webapp=null path=/admin/metrics params={wt=javabin&version=2&key=solr.core.collection_one.shard2.replica_n2:INDEX.sizeInBytes} status=0 QTime=9
[junit4] 2> 1333647 INFO (qtp1203029794-6234) [n:127.0.0.1:35477_solr ] o.a.s.s.HttpSolrCall [admin] webapp=null path=/admin/metrics params={prefix=CONTAINER.fs.usableSpace,CONTAINER.fs.totalSpace,CORE.coreName&wt=javabin&version=2&group=solr.node,solr.core} status=0 QTime=0
[junit4] 2> 1333719 INFO (qtp1208933906-6245) [n:127.0.0.1:43790_solr ] o.a.s.s.HttpSolrCall [admin] webapp=null path=/admin/metrics params={wt=javabin&version=2&key=solr.core.collection_one.shard1.replica_n1:INDEX.sizeInBytes} status=0 QTime=41
[junit4] 2> 1333721 INFO (qtp1208933906-6246) [n:127.0.0.1:43790_solr ] o.a.s.s.HttpSolrCall [admin] webapp=null path=/admin/metrics params={prefix=CONTAINER.fs.usableSpace,CONTAINER.fs.totalSpace,CORE.coreName&wt=javabin&version=2&group=solr.node,solr.core} status=0 QTime=0
[junit4] 2> 1333758 INFO (OverseerStateUpdate-73631017107193860-127.0.0.1:35477_solr-n_0000000000) [n:127.0.0.1:35477_solr ] o.a.s.c.o.SliceMutator createReplica() {
[junit4] 2> "operation":"ADDREPLICA",
[junit4] 2> "collection":"collection_two",
[junit4] 2> "shard":"shard1",
[junit4] 2> "core":"collection_two_shard1_replica_n1",
[junit4] 2> "state":"down",
[junit4] 2> "base_url":"https://127.0.0.1:43790/solr",
[junit4] 2> "type":"NRT",
[junit4] 2> "waitForFinalState":"false"}
[junit4] 2> 1334015 INFO (qtp1208933906-6243) [n:127.0.0.1:43790_solr x:collection_two_shard1_replica_n1] o.a.s.h.a.CoreAdminOperation core create command qt=/admin/cores&coreNodeName=core_node2&collection.configName=conf&newCollection=true&name=collection_two_shard1_replica_n1&action=CREATE&numShards=1&collection=collection_two&shard=shard1&wt=javabin&version=2&replicaType=NRT
[junit4] 2> 1335113 INFO (qtp1208933906-6243) [n:127.0.0.1:43790_solr c:collection_two s:shard1 r:core_node2 x:collection_two_shard1_replica_n1] o.a.s.c.SolrConfig Using Lucene MatchVersion: 7.6.0
[junit4] 2> 1335169 INFO (qtp1208933906-6243) [n:127.0.0.1:43790_solr c:collection_two s:shard1 r:core_node2 x:collection_two_shard1_replica_n1] o.a.s.s.IndexSchema [collection_two_shard1_replica_n1] Schema name=minimal
[junit4] 2> 1335373 INFO (qtp1208933906-6243) [n:127.0.0.1:43790_solr c:collection_two s:shard1 r:core_node2 x:collection_two_shard1_replica_n1] o.a.s.s.IndexSchema Loaded schema minimal/1.1 with uniqueid field id
[junit4] 2> 1335373 INFO (qtp1208933906-6243) [n:127.0.0.1:43790_solr c:collection_two s:shard1 r:core_node2 x:collection_two_shard1_replica_n1] o.a.s.c.CoreContainer Creating SolrCore 'collection_two_shard1_replica_n1' using configuration from collection collection_two, trusted=true
[junit4] 2> 1335374 INFO (qtp1208933906-6243) [n:127.0.0.1:43790_solr c:collection_two s:shard1 r:core_node2 x:collection_two_shard1_replica_n1] o.a.s.m.r.SolrJmxReporter JMX monitoring for 'solr_43790.solr.core.collection_two.shard1.replica_n1' (registry 'solr.core.collection_two.shard1.replica_n1') enabled at server: com.sun.jmx.mbeanserver.JmxMBeanServer@573dceeb
[junit4] 2> 1335374 INFO (qtp1208933906-6243) [n:127.0.0.1:43790_solr c:collection_two s:shard1 r:core_node2 x:collection_two_shard1_replica_n1] o.a.s.c.SolrCore [[collection_two_shard1_replica_n1] ] Opening new SolrCore at [/home/jenkins/jenkins-slave/workspace/Lucene-Solr-Tests-7.x/solr/build/solr-core/test/J0/temp/solr.cloud.AliasIntegrationTest_7B98F69C00DA112-001/tempDir-001/node1/collection_two_shard1_replica_n1], dataDir=[/home/jenkins/jenkins-slave/workspace/Lucene-Solr-Tests-7.x/solr/build/solr-core/test/J0/temp/solr.cloud.AliasIntegrationTest_7B98F69C00DA112-001/tempDir-001/node1/./collection_two_shard1_replica_n1/data/]
[junit4] 2> 1335629 INFO (qtp1208933906-6243) [n:127.0.0.1:43790_so
[...truncated too long message...]
erty disallowed.ivy.jars.list as its length is 0.
-ivy-fail-disallowed-ivy-version:
ivy-fail:
ivy-fail:
ivy-configure:
[ivy:configure] :: loading settings :: file = /home/jenkins/jenkins-slave/workspace/Lucene-Solr-Tests-7.x/lucene/top-level-ivy-settings.xml
resolve:
ivy-availability-check:
[loadresource] Do not set property disallowed.ivy.jars.list as its length is 0.
-ivy-fail-disallowed-ivy-version:
ivy-fail:
ivy-configure:
[ivy:configure] :: loading settings :: file = /home/jenkins/jenkins-slave/workspace/Lucene-Solr-Tests-7.x/lucene/top-level-ivy-settings.xml
resolve:
ivy-availability-check:
[loadresource] Do not set property disallowed.ivy.jars.list as its length is 0.
-ivy-fail-disallowed-ivy-version:
ivy-fail:
ivy-fail:
ivy-configure:
[ivy:configure] :: loading settings :: file = /home/jenkins/jenkins-slave/workspace/Lucene-Solr-Tests-7.x/lucene/top-level-ivy-settings.xml
resolve:
ivy-availability-check:
[loadresource] Do not set property disallowed.ivy.jars.list as its length is 0.
-ivy-fail-disallowed-ivy-version:
ivy-fail:
ivy-configure:
[ivy:configure] :: loading settings :: file = /home/jenkins/jenkins-slave/workspace/Lucene-Solr-Tests-7.x/lucene/top-level-ivy-settings.xml
resolve:
ivy-availability-check:
[loadresource] Do not set property disallowed.ivy.jars.list as its length is 0.
-ivy-fail-disallowed-ivy-version:
ivy-fail:
ivy-fail:
ivy-configure:
[ivy:configure] :: loading settings :: file = /home/jenkins/jenkins-slave/workspace/Lucene-Solr-Tests-7.x/lucene/top-level-ivy-settings.xml
resolve:
ivy-availability-check:
[loadresource] Do not set property disallowed.ivy.jars.list as its length is 0.
-ivy-fail-disallowed-ivy-version:
ivy-fail:
ivy-fail:
ivy-configure:
[ivy:configure] :: loading settings :: file = /home/jenkins/jenkins-slave/workspace/Lucene-Solr-Tests-7.x/lucene/top-level-ivy-settings.xml
resolve:
ivy-availability-check:
[loadresource] Do not set property disallowed.ivy.jars.list as its length is 0.
-ivy-fail-disallowed-ivy-version:
ivy-fail:
ivy-fail:
ivy-configure:
[ivy:configure] :: loading settings :: file = /home/jenkins/jenkins-slave/workspace/Lucene-Solr-Tests-7.x/lucene/top-level-ivy-settings.xml
resolve:
ivy-availability-check:
[loadresource] Do not set property disallowed.ivy.jars.list as its length is 0.
-ivy-fail-disallowed-ivy-version:
ivy-fail:
ivy-fail:
ivy-configure:
[ivy:configure] :: loading settings :: file = /home/jenkins/jenkins-slave/workspace/Lucene-Solr-Tests-7.x/lucene/top-level-ivy-settings.xml
resolve:
ivy-availability-check:
[loadresource] Do not set property disallowed.ivy.jars.list as its length is 0.
-ivy-fail-disallowed-ivy-version:
ivy-fail:
ivy-fail:
ivy-configure:
[ivy:configure] :: loading settings :: file = /home/jenkins/jenkins-slave/workspace/Lucene-Solr-Tests-7.x/lucene/top-level-ivy-settings.xml
resolve:
ivy-availability-check:
[loadresource] Do not set property disallowed.ivy.jars.list as its length is 0.
-ivy-fail-disallowed-ivy-version:
ivy-fail:
ivy-fail:
ivy-configure:
[ivy:configure] :: loading settings :: file = /home/jenkins/jenkins-slave/workspace/Lucene-Solr-Tests-7.x/lucene/top-level-ivy-settings.xml
resolve:
ivy-availability-check:
[loadresource] Do not set property disallowed.ivy.jars.list as its length is 0.
-ivy-fail-disallowed-ivy-version:
ivy-fail:
ivy-fail:
ivy-configure:
[ivy:configure] :: loading settings :: file = /home/jenkins/jenkins-slave/workspace/Lucene-Solr-Tests-7.x/lucene/top-level-ivy-settings.xml
resolve:
ivy-availability-check:
[loadresource] Do not set property disallowed.ivy.jars.list as its length is 0.
-ivy-fail-disallowed-ivy-version:
ivy-fail:
ivy-fail:
ivy-configure:
[ivy:configure] :: loading settings :: file = /home/jenkins/jenkins-slave/workspace/Lucene-Solr-Tests-7.x/lucene/top-level-ivy-settings.xml
resolve:
ivy-availability-check:
[loadresource] Do not set property disallowed.ivy.jars.list as its length is 0.
-ivy-fail-disallowed-ivy-version:
ivy-fail:
ivy-fail:
ivy-configure:
[ivy:configure] :: loading settings :: file = /home/jenkins/jenkins-slave/workspace/Lucene-Solr-Tests-7.x/lucene/top-level-ivy-settings.xml
resolve:
ivy-availability-check:
[loadresource] Do not set property disallowed.ivy.jars.list as its length is 0.
-ivy-fail-disallowed-ivy-version:
ivy-fail:
ivy-fail:
ivy-configure:
[ivy:configure] :: loading settings :: file = /home/jenkins/jenkins-slave/workspace/Lucene-Solr-Tests-7.x/lucene/top-level-ivy-settings.xml
resolve:
jar-checksums:
[mkdir] Created dir: /home/jenkins/jenkins-slave/workspace/Lucene-Solr-Tests-7.x/solr/null2122919043
[copy] Copying 241 files to /home/jenkins/jenkins-slave/workspace/Lucene-Solr-Tests-7.x/solr/null2122919043
[delete] Deleting directory /home/jenkins/jenkins-slave/workspace/Lucene-Solr-Tests-7.x/solr/null2122919043
check-working-copy:
[ivy:cachepath] :: resolving dependencies :: org.eclipse.jgit#org.eclipse.jgit-caller;working
[ivy:cachepath] confs: [default]
[ivy:cachepath] found org.eclipse.jgit#org.eclipse.jgit;4.6.0.201612231935-r in public
[ivy:cachepath] found com.jcraft#jsch;0.1.53 in public
[ivy:cachepath] found com.googlecode.javaewah#JavaEWAH;1.1.6 in public
[ivy:cachepath] found org.apache.httpcomponents#httpclient;4.3.6 in public
[ivy:cachepath] found org.apache.httpcomponents#httpcore;4.3.3 in public
[ivy:cachepath] found commons-logging#commons-logging;1.1.3 in public
[ivy:cachepath] found commons-codec#commons-codec;1.6 in public
[ivy:cachepath] found org.slf4j#slf4j-api;1.7.2 in public
[ivy:cachepath] :: resolution report :: resolve 75ms :: artifacts dl 1ms
---------------------------------------------------------------------
| | modules || artifacts |
| conf | number| search|dwnlded|evicted|| number|dwnlded|
---------------------------------------------------------------------
| default | 8 | 0 | 0 | 0 || 8 | 0 |
---------------------------------------------------------------------
[wc-checker] Initializing working copy...
[wc-checker] SLF4J: Failed to load class "org.slf4j.impl.StaticLoggerBinder".
[wc-checker] SLF4J: Defaulting to no-operation (NOP) logger implementation
[wc-checker] SLF4J: See http://www.slf4j.org/codes.html#StaticLoggerBinder for further details.
[wc-checker] Checking working copy status...
-jenkins-base:
BUILD SUCCESSFUL
Total time: 201 minutes 3 seconds
Archiving artifacts
java.lang.InterruptedException: no matches found within 10000
at hudson.FilePath$34.hasMatch(FilePath.java:2678)
at hudson.FilePath$34.invoke(FilePath.java:2557)
at hudson.FilePath$34.invoke(FilePath.java:2547)
at hudson.FilePath$FileCallableWrapper.call(FilePath.java:2918)
Also: hudson.remoting.Channel$CallSiteStackTrace: Remote call to lucene2
at hudson.remoting.Channel.attachCallSiteStackTrace(Channel.java:1741)
at hudson.remoting.UserRequest$ExceptionResponse.retrieve(UserRequest.java:357)
at hudson.remoting.Channel.call(Channel.java:955)
at hudson.FilePath.act(FilePath.java:1036)
at hudson.FilePath.act(FilePath.java:1025)
at hudson.FilePath.validateAntFileMask(FilePath.java:2547)
at hudson.tasks.ArtifactArchiver.perform(ArtifactArchiver.java:243)
at hudson.tasks.BuildStepCompatibilityLayer.perform(BuildStepCompatibilityLayer.java:81)
at hudson.tasks.BuildStepMonitor$1.perform(BuildStepMonitor.java:20)
at hudson.model.AbstractBuild$AbstractBuildExecution.perform(AbstractBuild.java:744)
at hudson.model.AbstractBuild$AbstractBuildExecution.performAllBuildSteps(AbstractBuild.java:690)
at hudson.model.Build$BuildExecution.post2(Build.java:186)
at hudson.model.AbstractBuild$AbstractBuildExecution.post(AbstractBuild.java:635)
at hudson.model.Run.execute(Run.java:1819)
at hudson.model.FreeStyleBuild.run(FreeStyleBuild.java:43)
at hudson.model.ResourceController.execute(ResourceController.java:97)
at hudson.model.Executor.run(Executor.java:429)
Caused: hudson.FilePath$TunneledInterruptedException
at hudson.FilePath$FileCallableWrapper.call(FilePath.java:2920)
at hudson.remoting.UserRequest.perform(UserRequest.java:212)
at hudson.remoting.UserRequest.perform(UserRequest.java:54)
at hudson.remoting.Request$2.run(Request.java:369)
at hudson.remoting.InterceptingExecutorService$1.call(InterceptingExecutorService.java:72)
at java.util.concurrent.FutureTask.run(FutureTask.java:266)
at java.util.concurrent.ThreadPoolExecutor.runWorker(ThreadPoolExecutor.java:1142)
at java.util.concurrent.ThreadPoolExecutor$Worker.run(ThreadPoolExecutor.java:617)
at java.lang.Thread.run(Thread.java:748)
Caused: java.lang.InterruptedException: java.lang.InterruptedException: no matches found within 10000
at hudson.FilePath.act(FilePath.java:1038)
at hudson.FilePath.act(FilePath.java:1025)
at hudson.FilePath.validateAntFileMask(FilePath.java:2547)
at hudson.tasks.ArtifactArchiver.perform(ArtifactArchiver.java:243)
at hudson.tasks.BuildStepCompatibilityLayer.perform(BuildStepCompatibilityLayer.java:81)
at hudson.tasks.BuildStepMonitor$1.perform(BuildStepMonitor.java:20)
at hudson.model.AbstractBuild$AbstractBuildExecution.perform(AbstractBuild.java:744)
at hudson.model.AbstractBuild$AbstractBuildExecution.performAllBuildSteps(AbstractBuild.java:690)
at hudson.model.Build$BuildExecution.post2(Build.java:186)
at hudson.model.AbstractBuild$AbstractBuildExecution.post(AbstractBuild.java:635)
at hudson.model.Run.execute(Run.java:1819)
at hudson.model.FreeStyleBuild.run(FreeStyleBuild.java:43)
at hudson.model.ResourceController.execute(ResourceController.java:97)
at hudson.model.Executor.run(Executor.java:429)
No artifacts found that match the file pattern "**/*.events,heapdumps/**,**/hs_err_pid*". Configuration error?
Recording test results
Build step 'Publish JUnit test result report' changed build result to UNSTABLE
Email was triggered for: Unstable (Test Failures)
Sending email for trigger: Unstable (Test Failures)
[JENKINS] Lucene-Solr-Tests-7.x - Build # 1014 - Still Unstable
Posted by Apache Jenkins Server <je...@builds.apache.org>.
Build: https://builds.apache.org/job/Lucene-Solr-Tests-7.x/1014/
1 tests failed.
FAILED: org.apache.solr.client.solrj.impl.CloudSolrClientTest.testCollectionDoesntExist
Error Message:
Tried fetching cluster state using the node names we knew of, i.e. [127.0.0.1:35627_solr, 127.0.0.1:44242_solr, 127.0.0.1:42632_solr]. However, succeeded in obtaining the cluster state from none of them.If you think your Solr cluster is up and is accessible, you could try re-creating a new CloudSolrClient using working solrUrl(s) or zkHost(s).
Stack Trace:
java.lang.RuntimeException: Tried fetching cluster state using the node names we knew of, i.e. [127.0.0.1:35627_solr, 127.0.0.1:44242_solr, 127.0.0.1:42632_solr]. However, succeeded in obtaining the cluster state from none of them.If you think your Solr cluster is up and is accessible, you could try re-creating a new CloudSolrClient using working solrUrl(s) or zkHost(s).
at __randomizedtesting.SeedInfo.seed([11BA2941AAF9C91F:731937EFA87BAD0F]:0)
at org.apache.solr.client.solrj.impl.HttpClusterStateProvider.getState(HttpClusterStateProvider.java:108)
at org.apache.solr.client.solrj.impl.CloudSolrClient.resolveAliases(CloudSolrClient.java:1115)
at org.apache.solr.client.solrj.impl.CloudSolrClient.requestWithRetryOnStaleState(CloudSolrClient.java:844)
at org.apache.solr.client.solrj.impl.CloudSolrClient.request(CloudSolrClient.java:817)
at org.apache.solr.client.solrj.SolrRequest.process(SolrRequest.java:194)
at org.apache.solr.client.solrj.SolrClient.add(SolrClient.java:177)
at org.apache.solr.client.solrj.SolrClient.add(SolrClient.java:138)
at org.apache.solr.client.solrj.impl.CloudSolrClientTest.testCollectionDoesntExist(CloudSolrClientTest.java:779)
at sun.reflect.NativeMethodAccessorImpl.invoke0(Native Method)
at sun.reflect.NativeMethodAccessorImpl.invoke(NativeMethodAccessorImpl.java:62)
at sun.reflect.DelegatingMethodAccessorImpl.invoke(DelegatingMethodAccessorImpl.java:43)
at java.lang.reflect.Method.invoke(Method.java:498)
at com.carrotsearch.randomizedtesting.RandomizedRunner.invoke(RandomizedRunner.java:1742)
at com.carrotsearch.randomizedtesting.RandomizedRunner$8.evaluate(RandomizedRunner.java:935)
at com.carrotsearch.randomizedtesting.RandomizedRunner$9.evaluate(RandomizedRunner.java:971)
at com.carrotsearch.randomizedtesting.RandomizedRunner$10.evaluate(RandomizedRunner.java:985)
at org.junit.rules.ExpectedException$ExpectedExceptionStatement.evaluate(ExpectedException.java:110)
at com.carrotsearch.randomizedtesting.rules.SystemPropertiesRestoreRule$1.evaluate(SystemPropertiesRestoreRule.java:57)
at org.apache.lucene.util.TestRuleSetupTeardownChained$1.evaluate(TestRuleSetupTeardownChained.java:49)
at org.apache.lucene.util.AbstractBeforeAfterRule$1.evaluate(AbstractBeforeAfterRule.java:45)
at org.apache.lucene.util.TestRuleThreadAndTestName$1.evaluate(TestRuleThreadAndTestName.java:48)
at org.apache.lucene.util.TestRuleIgnoreAfterMaxFailures$1.evaluate(TestRuleIgnoreAfterMaxFailures.java:64)
at org.apache.lucene.util.TestRuleMarkFailure$1.evaluate(TestRuleMarkFailure.java:47)
at com.carrotsearch.randomizedtesting.rules.StatementAdapter.evaluate(StatementAdapter.java:36)
at com.carrotsearch.randomizedtesting.ThreadLeakControl$StatementRunner.run(ThreadLeakControl.java:368)
at com.carrotsearch.randomizedtesting.ThreadLeakControl.forkTimeoutingTask(ThreadLeakControl.java:817)
at com.carrotsearch.randomizedtesting.ThreadLeakControl$3.evaluate(ThreadLeakControl.java:468)
at com.carrotsearch.randomizedtesting.RandomizedRunner.runSingleTest(RandomizedRunner.java:944)
at com.carrotsearch.randomizedtesting.RandomizedRunner$5.evaluate(RandomizedRunner.java:830)
at com.carrotsearch.randomizedtesting.RandomizedRunner$6.evaluate(RandomizedRunner.java:880)
at com.carrotsearch.randomizedtesting.RandomizedRunner$7.evaluate(RandomizedRunner.java:891)
at com.carrotsearch.randomizedtesting.rules.StatementAdapter.evaluate(StatementAdapter.java:36)
at com.carrotsearch.randomizedtesting.rules.SystemPropertiesRestoreRule$1.evaluate(SystemPropertiesRestoreRule.java:57)
at org.apache.lucene.util.AbstractBeforeAfterRule$1.evaluate(AbstractBeforeAfterRule.java:45)
at com.carrotsearch.randomizedtesting.rules.StatementAdapter.evaluate(StatementAdapter.java:36)
at org.apache.lucene.util.TestRuleStoreClassName$1.evaluate(TestRuleStoreClassName.java:41)
at com.carrotsearch.randomizedtesting.rules.NoShadowingOrOverridesOnMethodsRule$1.evaluate(NoShadowingOrOverridesOnMethodsRule.java:40)
at com.carrotsearch.randomizedtesting.rules.NoShadowingOrOverridesOnMethodsRule$1.evaluate(NoShadowingOrOverridesOnMethodsRule.java:40)
at com.carrotsearch.randomizedtesting.rules.StatementAdapter.evaluate(StatementAdapter.java:36)
at com.carrotsearch.randomizedtesting.rules.StatementAdapter.evaluate(StatementAdapter.java:36)
at com.carrotsearch.randomizedtesting.rules.StatementAdapter.evaluate(StatementAdapter.java:36)
at org.apache.lucene.util.TestRuleAssertionsRequired$1.evaluate(TestRuleAssertionsRequired.java:53)
at org.apache.lucene.util.TestRuleMarkFailure$1.evaluate(TestRuleMarkFailure.java:47)
at org.apache.lucene.util.TestRuleIgnoreAfterMaxFailures$1.evaluate(TestRuleIgnoreAfterMaxFailures.java:64)
at org.apache.lucene.util.TestRuleIgnoreTestSuites$1.evaluate(TestRuleIgnoreTestSuites.java:54)
at com.carrotsearch.randomizedtesting.rules.StatementAdapter.evaluate(StatementAdapter.java:36)
at com.carrotsearch.randomizedtesting.ThreadLeakControl$StatementRunner.run(ThreadLeakControl.java:368)
at java.lang.Thread.run(Thread.java:748)
Build Log:
[...truncated 16392 lines...]
[junit4] Suite: org.apache.solr.client.solrj.impl.CloudSolrClientTest
[junit4] 2> Creating dataDir: /x1/jenkins/jenkins-slave/workspace/Lucene-Solr-Tests-7.x/solr/build/solr-solrj/test/J2/temp/solr.client.solrj.impl.CloudSolrClientTest_11BA2941AAF9C91F-001/init-core-data-001
[junit4] 1> 23:43:30.658 [Thread-67] ERROR org.apache.zookeeper.server.ZooKeeperServer - ZKShutdownHandler is not registered, so ZooKeeper server won't take any action on ERROR or SHUTDOWN server state changes
[junit4] 1> 23:43:30.775 [jetty-launcher-106-thread-3] ERROR org.apache.solr.util.StartupLoggingUtils - Missing Java Option solr.log.dir. Logging may be missing or incomplete.
[junit4] 1> 23:43:30.776 [jetty-launcher-106-thread-1] ERROR org.apache.solr.util.StartupLoggingUtils - Missing Java Option solr.log.dir. Logging may be missing or incomplete.
[junit4] 1> 23:43:30.791 [jetty-launcher-106-thread-2] ERROR org.apache.solr.util.StartupLoggingUtils - Missing Java Option solr.log.dir. Logging may be missing or incomplete.
[junit4] 1> 23:43:31.691 [TEST-CloudSolrClientTest.testShutdown-seed#[11BA2941AAF9C91F]-SendThread(ff01::114:33332)] ERROR org.apache.zookeeper.ClientCnxnSocketNIO - Unable to open socket to ff01::114/ff01:0:0:0:0:0:0:114:33332
[junit4] 1> 23:43:32.828 [TEST-CloudSolrClientTest.testShutdown-seed#[11BA2941AAF9C91F]-SendThread(ff01::114:33332)] ERROR org.apache.zookeeper.ClientCnxnSocketNIO - Unable to open socket to ff01::114/ff01:0:0:0:0:0:0:114:33332
[junit4] 1> -
[junit4] 1> replica:core_node2 rstate:active live:true
[junit4] 1> replica:core_node4 rstate:active live:true
[junit4] 1> replica:core_node6 rstate:active live:true
[junit4] 1> no one is recoverying
[junit4] 1> 23:44:09.401 [qtp1530363196-500] ERROR org.apache.solr.handler.RequestHandlerBase - org.apache.solr.common.SolrException: Unknown action: foobar
[junit4] 1> at org.apache.solr.handler.admin.ConfigSetsHandler.handleRequestBody(ConfigSetsHandler.java:109)
[junit4] 1> at org.apache.solr.handler.RequestHandlerBase.handleRequest(RequestHandlerBase.java:199)
[junit4] 1> at org.apache.solr.servlet.HttpSolrCall.handleAdmin(HttpSolrCall.java:734)
[junit4] 1> at org.apache.solr.servlet.HttpSolrCall.handleAdminRequest(HttpSolrCall.java:715)
[junit4] 1> at org.apache.solr.servlet.HttpSolrCall.call(HttpSolrCall.java:496)
[junit4] 1> at org.apache.solr.servlet.SolrDispatchFilter.doFilter(SolrDispatchFilter.java:377)
[junit4] 1> at org.apache.solr.servlet.SolrDispatchFilter.doFilter(SolrDispatchFilter.java:323)
[junit4] 1> at org.eclipse.jetty.servlet.ServletHandler$CachedChain.doFilter(ServletHandler.java:1642)
[junit4] 1> at org.apache.solr.client.solrj.embedded.JettySolrRunner$DebugFilter.doFilter(JettySolrRunner.java:139)
[junit4] 1> at org.eclipse.jetty.servlet.ServletHandler$CachedChain.doFilter(ServletHandler.java:1642)
[junit4] 1> at org.eclipse.jetty.servlet.ServletHandler.doHandle(ServletHandler.java:533)
[junit4] 1> at org.eclipse.jetty.server.handler.ScopedHandler.nextHandle(ScopedHandler.java:255)
[junit4] 1> at org.eclipse.jetty.server.session.SessionHandler.doHandle(SessionHandler.java:1595)
[junit4] 1> at org.eclipse.jetty.server.handler.ScopedHandler.nextHandle(ScopedHandler.java:255)
[junit4] 1> at org.eclipse.jetty.server.handler.ContextHandler.doHandle(ContextHandler.java:1317)
[junit4] 1> at org.eclipse.jetty.server.handler.ScopedHandler.nextScope(ScopedHandler.java:203)
[junit4] 1> at org.eclipse.jetty.servlet.ServletHandler.doScope(ServletHandler.java:473)
[junit4] 1> at org.eclipse.jetty.server.session.SessionHandler.doScope(SessionHandler.java:1564)
[junit4] 1> at org.eclipse.jetty.server.handler.ScopedHandler.nextScope(ScopedHandler.java:201)
[junit4] 1> at org.eclipse.jetty.server.handler.ContextHandler.doScope(ContextHandler.java:1219)
[junit4] 1> at org.eclipse.jetty.server.handler.ScopedHandler.handle(ScopedHandler.java:144)
[junit4] 1> at org.eclipse.jetty.server.handler.gzip.GzipHandler.handle(GzipHandler.java:724)
[junit4] 1> at org.eclipse.jetty.server.handler.HandlerWrapper.handle(HandlerWrapper.java:132)
[junit4] 1> at org.eclipse.jetty.server.Server.handle(Server.java:531)
[junit4] 1> at org.eclipse.jetty.server.HttpChannel.handle(HttpChannel.java:352)
[junit4] 1> at org.eclipse.jetty.server.HttpConnection.onFillable(HttpConnection.java:260)
[junit4] 1> at org.eclipse.jetty.io.AbstractConnection$ReadCallback.succeeded(AbstractConnection.java:281)
[junit4] 1> at org.eclipse.jetty.io.FillInterest.fillable(FillInterest.java:102)
[junit4] 1> at org.eclipse.jetty.io.ChannelEndPoint$2.run(ChannelEndPoint.java:118)
[junit4] 1> at org.eclipse.jetty.util.thread.strategy.EatWhatYouKill.runTask(EatWhatYouKill.java:333)
[junit4] 1> at org.eclipse.jetty.util.thread.strategy.EatWhatYouKill.doProduce(EatWhatYouKill.java:310)
[junit4] 1> at org.eclipse.jetty.util.thread.strategy.EatWhatYouKill.tryProduce(EatWhatYouKill.java:168)
[junit4] 1> at org.eclipse.jetty.util.thread.strategy.EatWhatYouKill.run(EatWhatYouKill.java:126)
[junit4] 1> at org.eclipse.jetty.util.thread.ReservedThreadExecutor$ReservedThread.run(ReservedThreadExecutor.java:366)
[junit4] 1> at org.eclipse.jetty.util.thread.QueuedThreadPool.runJob(QueuedThreadPool.java:762)
[junit4] 1> at org.eclipse.jetty.util.thread.QueuedThreadPool$2.run(QueuedThreadPool.java:680)
[junit4] 1> at java.lang.Thread.run(Thread.java:748)
[junit4] 1>
[junit4] 1> 23:44:09.450 [qtp1530363196-500] ERROR org.apache.solr.handler.RequestHandlerBase - org.apache.solr.common.SolrException: Unknown action: foobar
[junit4] 1> at org.apache.solr.handler.admin.CollectionsHandler.handleRequestBody(CollectionsHandler.java:241)
[junit4] 1> at org.apache.solr.handler.RequestHandlerBase.handleRequest(RequestHandlerBase.java:199)
[junit4] 1> at org.apache.solr.servlet.HttpSolrCall.handleAdmin(HttpSolrCall.java:734)
[junit4] 1> at org.apache.solr.servlet.HttpSolrCall.handleAdminRequest(HttpSolrCall.java:715)
[junit4] 1> at org.apache.solr.servlet.HttpSolrCall.call(HttpSolrCall.java:496)
[junit4] 1> at org.apache.solr.servlet.SolrDispatchFilter.doFilter(SolrDispatchFilter.java:377)
[junit4] 1> at org.apache.solr.servlet.SolrDispatchFilter.doFilter(SolrDispatchFilter.java:323)
[junit4] 1> at org.eclipse.jetty.servlet.ServletHandler$CachedChain.doFilter(ServletHandler.java:1642)
[junit4] 1> at org.apache.solr.client.solrj.embedded.JettySolrRunner$DebugFilter.doFilter(JettySolrRunner.java:139)
[junit4] 1> at org.eclipse.jetty.servlet.ServletHandler$CachedChain.doFilter(ServletHandler.java:1642)
[junit4] 1> at org.eclipse.jetty.servlet.ServletHandler.doHandle(ServletHandler.java:533)
[junit4] 1> at org.eclipse.jetty.server.handler.ScopedHandler.nextHandle(ScopedHandler.java:255)
[junit4] 1> at org.eclipse.jetty.server.session.SessionHandler.doHandle(SessionHandler.java:1595)
[junit4] 1> at org.eclipse.jetty.server.handler.ScopedHandler.nextHandle(ScopedHandler.java:255)
[junit4] 1> at org.eclipse.jetty.server.handler.ContextHandler.doHandle(ContextHandler.java:1317)
[junit4] 1> at org.eclipse.jetty.server.handler.ScopedHandler.nextScope(ScopedHandler.java:203)
[junit4] 1> at org.eclipse.jetty.servlet.ServletHandler.doScope(ServletHandler.java:473)
[junit4] 1> at org.eclipse.jetty.server.session.SessionHandler.doScope(SessionHandler.java:1564)
[junit4] 1> at org.eclipse.jetty.server.handler.ScopedHandler.nextScope(ScopedHandler.java:201)
[junit4] 1> at org.eclipse.jetty.server.handler.ContextHandler.doScope(ContextHandler.java:1219)
[junit4] 1> at org.eclipse.jetty.server.handler.ScopedHandler.handle(ScopedHandler.java:144)
[junit4] 1> at org.eclipse.jetty.server.handler.gzip.GzipHandler.handle(GzipHandler.java:724)
[junit4] 1> at org.eclipse.jetty.server.handler.HandlerWrapper.handle(HandlerWrapper.java:132)
[junit4] 1> at org.eclipse.jetty.server.Server.handle(Server.java:531)
[junit4] 1> at org.eclipse.jetty.server.HttpChannel.handle(HttpChannel.java:352)
[junit4] 1> at org.eclipse.jetty.server.HttpConnection.onFillable(HttpConnection.java:260)
[junit4] 1> at org.eclipse.jetty.io.AbstractConnection$ReadCallback.succeeded(AbstractConnection.java:281)
[junit4] 1> at org.eclipse.jetty.io.FillInterest.fillable(FillInterest.java:102)
[junit4] 1> at org.eclipse.jetty.io.ChannelEndPoint$2.run(ChannelEndPoint.java:118)
[junit4] 1> at org.eclipse.jetty.util.thread.strategy.EatWhatYouKill.runTask(EatWhatYouKill.java:333)
[junit4] 1> at org.eclipse.jetty.util.thread.strategy.EatWhatYouKill.doProduce(EatWhatYouKill.java:310)
[junit4] 1> at org.eclipse.jetty.util.thread.strategy.EatWhatYouKill.tryProduce(EatWhatYouKill.java:168)
[junit4] 1> at org.eclipse.jetty.util.thread.strategy.EatWhatYouKill.run(EatWhatYouKill.java:126)
[junit4] 1> at org.eclipse.jetty.util.thread.ReservedThreadExecutor$ReservedThread.run(ReservedThreadExecutor.java:366)
[junit4] 1> at org.eclipse.jetty.util.thread.QueuedThreadPool.runJob(QueuedThreadPool.java:762)
[junit4] 1> at org.eclipse.jetty.util.thread.QueuedThreadPool$2.run(QueuedThreadPool.java:680)
[junit4] 1> at java.lang.Thread.run(Thread.java:748)
[junit4] 1>
[junit4] 1> 23:44:09.501 [qtp1530363196-499] ERROR org.apache.solr.handler.RequestHandlerBase - org.apache.solr.common.SolrException: Unsupported operation: foobar
[junit4] 1> at org.apache.solr.handler.admin.CoreAdminHandler.handleCustomAction(CoreAdminHandler.java:220)
[junit4] 1> at org.apache.solr.handler.admin.CoreAdminHandler.handleRequestBody(CoreAdminHandler.java:169)
[junit4] 1> at org.apache.solr.handler.RequestHandlerBase.handleRequest(RequestHandlerBase.java:199)
[junit4] 1> at org.apache.solr.servlet.HttpSolrCall.handleAdmin(HttpSolrCall.java:734)
[junit4] 1> at org.apache.solr.servlet.HttpSolrCall.handleAdminRequest(HttpSolrCall.java:715)
[junit4] 1> at org.apache.solr.servlet.HttpSolrCall.call(HttpSolrCall.java:496)
[junit4] 1> at org.apache.solr.servlet.SolrDispatchFilter.doFilter(SolrDispatchFilter.java:377)
[junit4] 1> at org.apache.solr.servlet.SolrDispatchFilter.doFilter(SolrDispatchFilter.java:323)
[junit4] 1> at org.eclipse.jetty.servlet.ServletHandler$CachedChain.doFilter(ServletHandler.java:1642)
[junit4] 1> at org.apache.solr.client.solrj.embedded.JettySolrRunner$DebugFilter.doFilter(JettySolrRunner.java:139)
[junit4] 1> at org.eclipse.jetty.servlet.ServletHandler$CachedChain.doFilter(ServletHandler.java:1642)
[junit4] 1> at org.eclipse.jetty.servlet.ServletHandler.doHandle(ServletHandler.java:533)
[junit4] 1> at org.eclipse.jetty.server.handler.ScopedHandler.nextHandle(ScopedHandler.java:255)
[junit4] 1> at org.eclipse.jetty.server.session.SessionHandler.doHandle(SessionHandler.java:1595)
[junit4] 1> at org.eclipse.jetty.server.handler.ScopedHandler.nextHandle(ScopedHandler.java:255)
[junit4] 1> at org.eclipse.jetty.server.handler.ContextHandler.doHandle(ContextHandler.java:1317)
[junit4] 1> at org.eclipse.jetty.server.handler.ScopedHandler.nextScope(ScopedHandler.java:203)
[junit4] 1> at org.eclipse.jetty.servlet.ServletHandler.doScope(ServletHandler.java:473)
[junit4] 1> at org.eclipse.jetty.server.session.SessionHandler.doScope(SessionHandler.java:1564)
[junit4] 1> at org.eclipse.jetty.server.handler.ScopedHandler.nextScope(ScopedHandler.java:201)
[junit4] 1> at org.eclipse.jetty.server.handler.ContextHandler.doScope(ContextHandler.java:1219)
[junit4] 1> at org.eclipse.jetty.server.handler.ScopedHandler.handle(ScopedHandler.java:144)
[junit4] 1> at org.eclipse.jetty.server.handler.gzip.GzipHandler.handle(GzipHandler.java:724)
[junit4] 1> at org.eclipse.jetty.server.handler.HandlerWrapper.handle(HandlerWrapper.java:132)
[junit4] 1> at org.eclipse.jetty.server.Server.handle(Server.java:531)
[junit4] 1> at org.eclipse.jetty.server.HttpChannel.handle(HttpChannel.java:352)
[junit4] 1> at org.eclipse.jetty.server.HttpConnection.onFillable(HttpConnection.java:260)
[junit4] 1> at org.eclipse.jetty.io.AbstractConnection$ReadCallback.succeeded(AbstractConnection.java:281)
[junit4] 1> at org.eclipse.jetty.io.FillInterest.fillable(FillInterest.java:102)
[junit4] 1> at org.eclipse.jetty.io.ChannelEndPoint$2.run(ChannelEndPoint.java:118)
[junit4] 1> at org.eclipse.jetty.util.thread.strategy.EatWhatYouKill.runTask(EatWhatYouKill.java:333)
[junit4] 1> at org.eclipse.jetty.util.thread.strategy.EatWhatYouKill.doProduce(EatWhatYouKill.java:310)
[junit4] 1> at org.eclipse.jetty.util.thread.strategy.EatWhatYouKill.tryProduce(EatWhatYouKill.java:168)
[junit4] 1> at org.eclipse.jetty.util.thread.strategy.EatWhatYouKill.run(EatWhatYouKill.java:126)
[junit4] 1> at org.eclipse.jetty.util.thread.ReservedThreadExecutor$ReservedThread.run(ReservedThreadExecutor.java:366)
[junit4] 1> at org.eclipse.jetty.util.thread.QueuedThreadPool.runJob(QueuedThreadPool.java:762)
[junit4] 1> at org.eclipse.jetty.util.thread.QueuedThreadPool$2.run(QueuedThreadPool.java:680)
[junit4] 1> at java.lang.Thread.run(Thread.java:748)
[junit4] 1>
[junit4] 1> -
[junit4] 1> replica:core_node2 rstate:active live:true
[junit4] 1> no one is recoverying
[junit4] 1> -
[junit4] 1> replica:core_node2 rstate:active live:true
[junit4] 1> replica:core_node4 rstate:down live:true
[junit4] 1> -
[junit4] 1> replica:core_node2 rstate:active live:true
[junit4] 1> replica:core_node4 rstate:recovering live:true
[junit4] 1> -
[junit4] 1> replica:core_node2 rstate:active live:true
[junit4] 1> replica:core_node4 rstate:active live:true
[junit4] 1> no one is recoverying
[junit4] 1> -
[junit4] 1> replica:core_node4 rstate:active live:true
[junit4] 1> no one is recoverying
[junit4] 1> 23:44:36.280 [TEST-CloudSolrClientTest.testRetryUpdatesWhenClusterStateIsStale-seed#[11BA2941AAF9C91F]] ERROR org.apache.solr.client.solrj.impl.CloudSolrClient - Request to collection [stale_state_test_col] failed due to (404) org.apache.solr.client.solrj.impl.HttpSolrClient$RemoteSolrException: Error from server at http://127.0.0.1:44242/solr/stale_state_test_col_shard1_replica_n1: Expected mime type application/octet-stream but got text/html. <html>
[junit4] 1> <head>
[junit4] 1> <meta http-equiv="Content-Type" content="text/html;charset=utf-8"/>
[junit4] 1> <title>Error 404 Can not find: /solr/stale_state_test_col_shard1_replica_n1/update</title>
[junit4] 1> </head>
[junit4] 1> <body><h2>HTTP ERROR 404</h2>
[junit4] 1> <p>Problem accessing /solr/stale_state_test_col_shard1_replica_n1/update. Reason:
[junit4] 1> <pre> Can not find: /solr/stale_state_test_col_shard1_replica_n1/update</pre></p><hr><a href="http://eclipse.org/jetty">Powered by Jetty:// 9.4.11.v20180605</a><hr/>
[junit4] 1>
[junit4] 1> </body>
[junit4] 1> </html>
[junit4] 1> , retry? 0
[junit4] 1> 23:44:39.460 [qtp1962867074-836] ERROR org.apache.solr.handler.RequestHandlerBase - org.apache.solr.common.SolrException: Collection: boguscollectionname not found
[junit4] 1> at org.apache.solr.handler.admin.ClusterStatus.getClusterStatus(ClusterStatus.java:115)
[junit4] 1> at org.apache.solr.handler.admin.CollectionsHandler$CollectionOperation.lambda$static$22(CollectionsHandler.java:865)
[junit4] 1> at org.apache.solr.handler.admin.CollectionsHandler$CollectionOperation.execute(CollectionsHandler.java:1177)
[junit4] 1> at org.apache.solr.handler.admin.CollectionsHandler.invokeAction(CollectionsHandler.java:258)
[junit4] 1> at org.apache.solr.handler.admin.CollectionsHandler.handleRequestBody(CollectionsHandler.java:246)
[junit4] 1> at org.apache.solr.handler.RequestHandlerBase.handleRequest(RequestHandlerBase.java:199)
[junit4] 1> at org.apache.solr.servlet.HttpSolrCall.handleAdmin(HttpSolrCall.java:734)
[junit4] 1> at org.apache.solr.servlet.HttpSolrCall.handleAdminRequest(HttpSolrCall.java:715)
[junit4] 1> at org.apache.solr.servlet.HttpSolrCall.call(HttpSolrCall.java:496)
[junit4] 1> at org.apache.solr.servlet.SolrDispatchFilter.doFilter(SolrDispatchFilter.java:377)
[junit4] 1> at org.apache.solr.servlet.SolrDispatchFilter.doFilter(SolrDispatchFilter.java:323)
[junit4] 1> at org.eclipse.jetty.servlet.ServletHandler$CachedChain.doFilter(ServletHandler.java:1642)
[junit4] 1> at org.apache.solr.client.solrj.embedded.JettySolrRunner$DebugFilter.doFilter(JettySolrRunner.java:139)
[junit4] 1> at org.eclipse.jetty.servlet.ServletHandler$CachedChain.doFilter(ServletHandler.java:1642)
[junit4] 1> at org.eclipse.jetty.servlet.ServletHandler.doHandle(ServletHandler.java:533)
[junit4] 1> at org.eclipse.jetty.server.handler.ScopedHandler.nextHandle(ScopedHandler.java:255)
[junit4] 1> at org.eclipse.jetty.server.session.SessionHandler.doHandle(SessionHandler.java:1595)
[junit4] 1> at org.eclipse.jetty.server.handler.ScopedHandler.nextHandle(ScopedHandler.java:255)
[junit4] 1> at org.eclipse.jetty.server.handler.ContextHandler.doHandle(ContextHandler.java:1317)
[junit4] 1> at org.eclipse.jetty.server.handler.ScopedHandler.nextScope(ScopedHandler.java:203)
[junit4] 1> at org.eclipse.jetty.servlet.ServletHandler.doScope(ServletHandler.java:473)
[junit4] 1> at org.eclipse.jetty.server.session.SessionHandler.doScope(SessionHandler.java:1564)
[junit4] 1> at org.eclipse.jetty.server.handler.ScopedHandler.nextScope(ScopedHandler.java:201)
[junit4] 1> at org.eclipse.jetty.server.handler.ContextHandler.doScope(ContextHandler.java:1219)
[junit4] 1> at org.eclipse.jetty.server.handler.ScopedHandler.handle(ScopedHandler.java:144)
[junit4] 1> at org.eclipse.jetty.server.handler.gzip.GzipHandler.handle(GzipHandler.java:724)
[junit4] 1> at org.eclipse.jetty.server.handler.HandlerWrapper.handle(HandlerWrapper.java:132)
[junit4] 1> at org.eclipse.jetty.server.Server.handle(Server.java:531)
[junit4] 1> at org.eclipse.jetty.server.HttpChannel.handle(HttpChannel.java:352)
[junit4] 1> at org.eclipse.jetty.server.HttpConnection.onFillable(HttpConnection.java:260)
[junit4] 1> at org.eclipse.jetty.io.AbstractConnection$ReadCallback.succeeded(AbstractConnection.java:281)
[junit4] 1> at org.eclipse.jetty.io.FillInterest.fillable(FillInterest.java:102)
[junit4] 1> at org.eclipse.jetty.io.ChannelEndPoint$2.run(ChannelEndPoint.java:118)
[junit4] 1> at org.eclipse.jetty.util.thread.strategy.EatWhatYouKill.runTask(EatWhatYouKill.java:333)
[junit4] 1> at org.eclipse.jetty.util.thread.strategy.EatWhatYouKill.doProduce(EatWhatYouKill.java:310)
[junit4] 1> at org.eclipse.jetty.util.thread.strategy.EatWhatYouKill.tryProduce(EatWhatYouKill.java:168)
[junit4] 1> at org.eclipse.jetty.util.thread.strategy.EatWhatYouKill.run(EatWhatYouKill.java:126)
[junit4] 1> at org.eclipse.jetty.util.thread.ReservedThreadExecutor$ReservedThread.run(ReservedThreadExecutor.java:366)
[junit4] 1> at org.eclipse.jetty.util.thread.QueuedThreadPool.runJob(QueuedThreadPool.java:762)
[junit4] 1> at org.eclipse.jetty.util.thread.QueuedThreadPool$2.run(QueuedThreadPool.java:680)
[junit4] 1> at java.lang.Thread.run(Thread.java:748)
[junit4] 1>
[junit4] 1> 23:44:39.465 [qtp1530363196-697] ERROR org.apache.solr.handler.RequestHandlerBase - org.apache.solr.common.SolrException: Collection: boguscollectionname not found
[junit4] 1> at org.apache.solr.handler.admin.ClusterStatus.getClusterStatus(ClusterStatus.java:115)
[junit4] 1> at org.apache.solr.handler.admin.CollectionsHandler$CollectionOperation.lambda$static$22(CollectionsHandler.java:865)
[junit4] 1> at org.apache.solr.handler.admin.CollectionsHandler$CollectionOperation.execute(CollectionsHandler.java:1177)
[junit4] 1> at org.apache.solr.handler.admin.CollectionsHandler.invokeAction(CollectionsHandler.java:258)
[junit4] 1> at org.apache.solr.handler.admin.CollectionsHandler.handleRequestBody(CollectionsHandler.java:246)
[junit4] 1> at org.apache.solr.handler.RequestHandlerBase.handleRequest(RequestHandlerBase.java:199)
[junit4] 1> at org.apache.solr.servlet.HttpSolrCall.handleAdmin(HttpSolrCall.java:734)
[junit4] 1> at org.apache.solr.servlet.HttpSolrCall.handleAdminRequest(HttpSolrCall.java:715)
[junit4] 1> at org.apache.solr.servlet.HttpSolrCall.call(HttpSolrCall.java:496)
[junit4] 1> at org.apache.solr.servlet.SolrDispatchFilter.doFilter(SolrDispatchFilter.java:377)
[junit4] 1> at org.apache.solr.servlet.SolrDispatchFilter.doFilter(SolrDispatchFilter.java:323)
[junit4] 1> at org.eclipse.jetty.servlet.ServletHandler$CachedChain.doFilter(ServletHandler.java:1642)
[junit4] 1> at org.apache.solr.client.solrj.embedded.JettySolrRunner$DebugFilter.doFilter(JettySolrRunner.java:139)
[junit4] 1> at org.eclipse.jetty.servlet.ServletHandler$CachedChain.doFilter(ServletHandler.java:1642)
[junit4] 1> at org.eclipse.jetty.servlet.ServletHandler.doHandle(ServletHandler.java:533)
[junit4] 1> at org.eclipse.jetty.server.handler.ScopedHandler.nextHandle(ScopedHandler.java:255)
[junit4] 1> at org.eclipse.jetty.server.session.SessionHandler.doHandle(SessionHandler.java:1595)
[junit4] 1> at org.eclipse.jetty.server.handler.ScopedHandler.nextHandle(ScopedHandler.java:255)
[junit4] 1> at org.eclipse.jetty.server.handler.ContextHandler.doHandle(ContextHandler.java:1317)
[junit4] 1> at org.eclipse.jetty.server.handler.ScopedHandler.nextScope(ScopedHandler.java:203)
[junit4] 1> at org.eclipse.jetty.servlet.ServletHandler.doScope(ServletHandler.java:473)
[junit4] 1> at org.eclipse.jetty.server.session.SessionHandler.doScope(SessionHandler.java:1564)
[junit4] 1> at org.eclipse.jetty.server.handler.ScopedHandler.nextScope(ScopedHandler.java:201)
[junit4] 1> at org.eclipse.jetty.server.handler.ContextHandler.doScope(ContextHandler.java:1219)
[junit4] 1> at org.eclipse.jetty.server.handler.ScopedHandler.handle(ScopedHandler.java:144)
[junit4] 1> at org.eclipse.jetty.server.handler.gzip.GzipHandler.handle(GzipHandler.java:724)
[junit4] 1> at org.eclipse.jetty.server.handler.HandlerWrapper.handle(HandlerWrapper.java:132)
[junit4] 1> at org.eclipse.jetty.server.Server.handle(Server.java:531)
[junit4] 1> at org.eclipse.jetty.server.HttpChannel.handle(HttpChannel.java:352)
[junit4] 1> at org.eclipse.jetty.server.HttpConnection.onFillable(HttpConnection.java:260)
[junit4] 1> at org.eclipse.jetty.io.AbstractConnection$ReadCallback.succeeded(AbstractConnection.java:281)
[junit4] 1> at org.eclipse.jetty.io.FillInterest.fillable(FillInterest.java:102)
[junit4] 1> at org.eclipse.jetty.io.ChannelEndPoint$2.run(ChannelEndPoint.java:118)
[junit4] 1> at org.eclipse.jetty.util.thread.strategy.EatWhatYouKill.runTask(EatWhatYouKill.java:333)
[junit4] 1> at org.eclipse.jetty.util.thread.strategy.EatWhatYouKill.doProduce(EatWhatYouKill.java:310)
[junit4] 1> at org.eclipse.jetty.util.thread.strategy.EatWhatYouKill.tryProduce(EatWhatYouKill.java:168)
[junit4] 1> at org.eclipse.jetty.util.thread.strategy.EatWhatYouKill.run(EatWhatYouKill.java:126)
[junit4] 1> at org.eclipse.jetty.util.thread.ReservedThreadExecutor$ReservedThread.run(ReservedThreadExecutor.java:366)
[junit4] 1> at org.eclipse.jetty.util.thread.QueuedThreadPool.runJob(QueuedThreadPool.java:762)
[junit4] 1> at org.eclipse.jetty.util.thread.QueuedThreadPool$2.run(QueuedThreadPool.java:680)
[junit4] 1> at java.lang.Thread.run(Thread.java:748)
[junit4] 1>
[junit4] 1> 23:44:39.470 [qtp1227882558-512] ERROR org.apache.solr.handler.RequestHandlerBase - org.apache.solr.common.SolrException: Collection: boguscollectionname not found
[junit4] 1> at org.apache.solr.handler.admin.ClusterStatus.getClusterStatus(ClusterStatus.java:115)
[junit4] 1> at org.apache.solr.handler.admin.CollectionsHandler$CollectionOperation.lambda$static$22(CollectionsHandler.java:865)
[junit4] 1> at org.apache.solr.handler.admin.CollectionsHandler$CollectionOperation.execute(CollectionsHandler.java:1177)
[junit4] 1> at org.apache.solr.handler.admin.CollectionsHandler.invokeAction(CollectionsHandler.java:258)
[junit4] 1> at org.apache.solr.handler.admin.CollectionsHandler.handleRequestBody(CollectionsHandler.java:246)
[junit4] 1> at org.apache.solr.handler.RequestHandlerBase.handleRequest(RequestHandlerBase.java:199)
[junit4] 1> at org.apache.solr.servlet.HttpSolrCall.handleAdmin(HttpSolrCall.java:734)
[junit4] 1> at org.apache.solr.servlet.HttpSolrCall.handleAdminRequest(HttpSolrCall.java:715)
[junit4] 1> at org.apache.solr.servlet.HttpSolrCall.call(HttpSolrCall.java:496)
[junit4] 1> at org.apache.solr.servlet.SolrDispatchFilter.doFilter(SolrDispatchFilter.java:377)
[junit4] 1> at org.apache.solr.servlet.SolrDispatchFilter.doFilter(SolrDispatchFilter.java:323)
[junit4] 1> at org.eclipse.jetty.servlet.ServletHandler$CachedChain.doFilter(ServletHandler.java:1642)
[junit4] 1> at org.apache.solr.client.solrj.embedded.JettySolrRunner$DebugFilter.doFilter(JettySolrRunner.java:139)
[junit4] 1> at org.eclipse.jetty.servlet.ServletHandler$CachedChain.doFilter(ServletHandler.java:1642)
[junit4] 1> at org.eclipse.jetty.servlet.ServletHandler.doHandle(ServletHandler.java:533)
[junit4] 1> at org.eclipse.jetty.server.handler.ScopedHandler.nextHandle(ScopedHandler.java:255)
[junit4] 1> at org.eclipse.jetty.server.session.SessionHandler.doHandle(SessionHandler.java:1595)
[junit4] 1> at org.eclipse.jetty.server.handler.ScopedHandler.nextHandle(ScopedHandler.java:255)
[junit4] 1> at org.eclipse.jetty.server.handler.ContextHandler.doHandle(ContextHandler.java:1317)
[junit4] 1> at org.eclipse.jetty.server.handler.ScopedHandler.nextScope(ScopedHandler.java:203)
[junit4] 1> at org.eclipse.jetty.servlet.ServletHandler.doScope(ServletHandler.java:473)
[junit4] 1> at org.eclipse.jetty.server.session.SessionHandler.doScope(SessionHandler.java:1564)
[junit4] 1> at org.eclipse.jetty.server.handler.ScopedHandler.nextScope(ScopedHandler.java:201)
[junit4] 1> at org.eclipse.jetty.server.handler.ContextHandler.doScope(ContextHandler.java:1219)
[junit4] 1> at org.eclipse.jetty.server.handler.ScopedHandler.handle(ScopedHandler.java:144)
[junit4] 1> at org.eclipse.jetty.server.handler.gzip.GzipHandler.handle(GzipHandler.java:724)
[junit4] 1> at org.eclipse.jetty.server.handler.HandlerWrapper.handle(HandlerWrapper.java:132)
[junit4] 1> at org.eclipse.jetty.server.Server.handle(Server.java:531)
[junit4] 1> at org.eclipse.jetty.server.HttpChannel.handle(HttpChannel.java:352)
[junit4] 1> at org.eclipse.jetty.server.HttpConnection.onFillable(HttpConnection.java:260)
[junit4] 1> at org.eclipse.jetty.io.AbstractConnection$ReadCallback.succeeded(AbstractConnection.java:281)
[junit4] 1> at org.eclipse.jetty.io.FillInterest.fillable(FillInterest.java:102)
[junit4] 1> at org.eclipse.jetty.io.ChannelEndPoint$2.run(ChannelEndPoint.java:118)
[junit4] 1> at org.eclipse.jetty.util.thread.strategy.EatWhatYouKill.runTask(EatWhatYouKill.java:333)
[junit4] 1> at org.eclipse.jetty.util.thread.strategy.EatWhatYouKill.doProduce(EatWhatYouKill.java:310)
[junit4] 1> at org.eclipse.jetty.util.thread.strategy.EatWhatYouKill.tryProduce(EatWhatYouKill.java:168)
[junit4] 1> at org.eclipse.jetty.util.thread.strategy.EatWhatYouKill.run(EatWhatYouKill.java:126)
[junit4] 1> at org.eclipse.jetty.util.thread.ReservedThreadExecutor$ReservedThread.run(ReservedThreadExecutor.java:366)
[junit4] 1> at org.eclipse.jetty.util.thread.QueuedThreadPool.runJob(QueuedThreadPool.java:762)
[junit4] 1> at org.eclipse.jetty.util.thread.QueuedThreadPool$2.run(QueuedThreadPool.java:680)
[junit4] 1> at java.lang.Thread.run(Thread.java:748)
[junit4] 1>
[junit4] 2> NOTE: reproduce with: ant test -Dtestcase=CloudSolrClientTest -Dtests.method=testCollectionDoesntExist -Dtests.seed=11BA2941AAF9C91F -Dtests.multiplier=2 -Dtests.slow=true -Dtests.locale=es-EC -Dtests.timezone=Africa/Dar_es_Salaam -Dtests.asserts=true -Dtests.file.encoding=ISO-8859-1
[junit4] ERROR 0.88s J2 | CloudSolrClientTest.testCollectionDoesntExist <<<
[junit4] > Throwable #1: java.lang.RuntimeException: Tried fetching cluster state using the node names we knew of, i.e. [127.0.0.1:35627_solr, 127.0.0.1:44242_solr, 127.0.0.1:42632_solr]. However, succeeded in obtaining the cluster state from none of them.If you think your Solr cluster is up and is accessible, you could try re-creating a new CloudSolrClient using working solrUrl(s) or zkHost(s).
[junit4] > at __randomizedtesting.SeedInfo.seed([11BA2941AAF9C91F:731937EFA87BAD0F]:0)
[junit4] > at org.apache.solr.client.solrj.impl.HttpClusterStateProvider.getState(HttpClusterStateProvider.java:108)
[junit4] > at org.apache.solr.client.solrj.impl.CloudSolrClient.resolveAliases(CloudSolrClient.java:1115)
[junit4] > at org.apache.solr.client.solrj.impl.CloudSolrClient.requestWithRetryOnStaleState(CloudSolrClient.java:844)
[junit4] > at org.apache.solr.client.solrj.impl.CloudSolrClient.request(CloudSolrClient.java:817)
[junit4] > at org.apache.solr.client.solrj.SolrRequest.process(SolrRequest.java:194)
[junit4] > at org.apache.solr.client.solrj.SolrClient.add(SolrClient.java:177)
[junit4] > at org.apache.solr.client.solrj.SolrClient.add(SolrClient.java:138)
[junit4] > at org.apache.solr.client.solrj.impl.CloudSolrClientTest.testCollectionDoesntExist(CloudSolrClientTest.java:779)
[junit4] > at java.lang.Thread.run(Thread.java:748)
[junit4] 1> 23:44:39.561 [SUITE-CloudSolrClientTest-seed#[11BA2941AAF9C91F]-worker] ERROR org.apache.zookeeper.server.ZooKeeperServer - ZKShutdownHandler is not registered, so ZooKeeper server won't take any action on ERROR or SHUTDOWN server state changes
[junit4] 2> NOTE: leaving temporary files on disk at: /x1/jenkins/jenkins-slave/workspace/Lucene-Solr-Tests-7.x/solr/build/solr-solrj/test/J2/temp/solr.client.solrj.impl.CloudSolrClientTest_11BA2941AAF9C91F-001
[junit4] 2> NOTE: test params are: codec=Asserting(Lucene70): {_version_=PostingsFormat(name=Memory), multiDefault=PostingsFormat(name=Memory), a_t=PostingsFormat(name=Memory), title_s=PostingsFormat(name=Memory), intDefault=PostingsFormat(name=Memory), id=PostingsFormat(name=MockRandom), text=PostingsFormat(name=LuceneFixedGap), timestamp=PostingsFormat(name=Memory)}, docValues:{_version_=DocValuesFormat(name=Memory), multiDefault=DocValuesFormat(name=Asserting), a_t=DocValuesFormat(name=Asserting), title_s=DocValuesFormat(name=Asserting), intDefault=DocValuesFormat(name=Memory), id=DocValuesFormat(name=Direct), text=DocValuesFormat(name=Lucene70), timestamp=DocValuesFormat(name=Asserting)}, maxPointsInLeafNode=216, maxMBSortInHeap=6.047430275954714, sim=RandomSimilarity(queryNorm=false): {}, locale=es-EC, timezone=Africa/Dar_es_Salaam
[junit4] 2> NOTE: Linux 4.4.0-137-generic amd64/Oracle Corporation 1.8.0_191 (64-bit)/cpus=4,threads=1,free=135466128,total=358088704
[junit4] 2> NOTE: All tests run in this JVM: [TestTimeSource, TestLang, QueryResponseTest, SolrSchemalessExampleTest, TestPolicy2, FieldValueEvaluatorTest, CubedRootEvaluatorTest, ReverseEvaluatorTest, LessThanEvaluatorTest, RawValueEvaluatorTest, SolrZkClientTest, BasicHttpSolrClientTest, CollectionAdminRequestRequiredParamsTest, SquareRootEvaluatorTest, AscEvaluatorTest, TestConfigSetAdminRequest, SolrExampleStreamingTest, HyperbolicTangentEvaluatorTest, ConcurrentUpdateSolrClientMultiCollectionTest, TestZkConfigManager, SolrExampleXMLTest, FacetFieldTest, TestJavaBinCodec, NotEvaluatorTest, ModifiableSolrParamsTest, NaturalLogEvaluatorTest, SolrExampleEmbeddedTest, CloudSolrClientTest]
[junit4] Completed [112/162 (1!)] on J2 in 69.09s, 16 tests, 1 error <<< FAILURES!
[...truncated 47990 lines...]
[asciidoctor:convert] asciidoctor: ERROR: about-this-guide.adoc: line 1: invalid part, must have at least one section (e.g., chapter, appendix, etc.)
[asciidoctor:convert] asciidoctor: ERROR: solr-glossary.adoc: line 1: invalid part, must have at least one section (e.g., chapter, appendix, etc.)
[java] Processed 2434 links (1987 relative) to 3199 anchors in 247 files
[echo] Validated Links & Anchors via: /x1/jenkins/jenkins-slave/workspace/Lucene-Solr-Tests-7.x/solr/build/solr-ref-guide/bare-bones-html/
-documentation-lint:
[jtidy] Checking for broken html (such as invalid tags)...
[delete] Deleting directory /x1/jenkins/jenkins-slave/workspace/Lucene-Solr-Tests-7.x/lucene/build/jtidy_tmp
[echo] Checking for broken links...
[exec]
[exec] Crawl/parse...
[exec]
[exec] Verify...
[echo] Checking for malformed docs...
jar-checksums:
resolve:
ivy-availability-check:
[loadresource] Do not set property disallowed.ivy.jars.list as its length is 0.
-ivy-fail-disallowed-ivy-version:
ivy-fail:
ivy-configure:
[ivy:configure] :: loading settings :: file = /x1/jenkins/jenkins-slave/workspace/Lucene-Solr-Tests-7.x/lucene/top-level-ivy-settings.xml
resolve:
ivy-availability-check:
[loadresource] Do not set property disallowed.ivy.jars.list as its length is 0.
-ivy-fail-disallowed-ivy-version:
ivy-fail:
ivy-configure:
[ivy:configure] :: loading settings :: file = /x1/jenkins/jenkins-slave/workspace/Lucene-Solr-Tests-7.x/lucene/top-level-ivy-settings.xml
resolve:
resolve:
ivy-availability-check:
[loadresource] Do not set property disallowed.ivy.jars.list as its length is 0.
-ivy-fail-disallowed-ivy-version:
ivy-fail:
ivy-configure:
[ivy:configure] :: loading settings :: file = /x1/jenkins/jenkins-slave/workspace/Lucene-Solr-Tests-7.x/lucene/top-level-ivy-settings.xml
resolve:
ivy-availability-check:
[loadresource] Do not set property disallowed.ivy.jars.list as its length is 0.
-ivy-fail-disallowed-ivy-version:
ivy-fail:
ivy-configure:
[ivy:configure] :: loading settings :: file = /x1/jenkins/jenkins-slave/workspace/Lucene-Solr-Tests-7.x/lucene/top-level-ivy-settings.xml
resolve:
ivy-availability-check:
[loadresource] Do not set property disallowed.ivy.jars.list as its length is 0.
-ivy-fail-disallowed-ivy-version:
ivy-fail:
ivy-configure:
[ivy:configure] :: loading settings :: file = /x1/jenkins/jenkins-slave/workspace/Lucene-Solr-Tests-7.x/lucene/top-level-ivy-settings.xml
resolve:
ivy-availability-check:
[loadresource] Do not set property disallowed.ivy.jars.list as its length is 0.
-ivy-fail-disallowed-ivy-version:
ivy-fail:
ivy-configure:
[ivy:configure] :: loading settings :: file = /x1/jenkins/jenkins-slave/workspace/Lucene-Solr-Tests-7.x/lucene/top-level-ivy-settings.xml
resolve:
ivy-availability-check:
[loadresource] Do not set property disallowed.ivy.jars.list as its length is 0.
-ivy-fail-disallowed-ivy-version:
ivy-fail:
ivy-configure:
[ivy:configure] :: loading settings :: file = /x1/jenkins/jenkins-slave/workspace/Lucene-Solr-Tests-7.x/lucene/top-level-ivy-settings.xml
resolve:
ivy-availability-check:
[loadresource] Do not set property disallowed.ivy.jars.list as its length is 0.
-ivy-fail-disallowed-ivy-version:
ivy-fail:
ivy-configure:
[ivy:configure] :: loading settings :: file = /x1/jenkins/jenkins-slave/workspace/Lucene-Solr-Tests-7.x/lucene/top-level-ivy-settings.xml
resolve:
ivy-availability-check:
[loadresource] Do not set property disallowed.ivy.jars.list as its length is 0.
-ivy-fail-disallowed-ivy-version:
ivy-fail:
ivy-configure:
[ivy:configure] :: loading settings :: file = /x1/jenkins/jenkins-slave/workspace/Lucene-Solr-Tests-7.x/lucene/top-level-ivy-settings.xml
resolve:
ivy-availability-check:
[loadresource] Do not set property disallowed.ivy.jars.list as its length is 0.
-ivy-fail-disallowed-ivy-version:
ivy-fail:
ivy-configure:
[ivy:configure] :: loading settings :: file = /x1/jenkins/jenkins-slave/workspace/Lucene-Solr-Tests-7.x/lucene/top-level-ivy-settings.xml
resolve:
ivy-availability-check:
[loadresource] Do not set property disallowed.ivy.jars.list as its length is 0.
-ivy-fail-disallowed-ivy-version:
ivy-fail:
ivy-configure:
[ivy:configure] :: loading settings :: file = /x1/jenkins/jenkins-slave/workspace/Lucene-Solr-Tests-7.x/lucene/top-level-ivy-settings.xml
resolve:
ivy-availability-check:
[loadresource] Do not set property disallowed.ivy.jars.list as its length is 0.
-ivy-fail-disallowed-ivy-version:
ivy-fail:
ivy-configure:
[ivy:configure] :: loading settings :: file = /x1/jenkins/jenkins-slave/workspace/Lucene-Solr-Tests-7.x/lucene/top-level-ivy-settings.xml
resolve:
ivy-availability-check:
[loadresource] Do not set property disallowed.ivy.jars.list as its length is 0.
-ivy-fail-disallowed-ivy-version:
ivy-fail:
ivy-configure:
[ivy:configure] :: loading settings :: file = /x1/jenkins/jenkins-slave/workspace/Lucene-Solr-Tests-7.x/lucene/top-level-ivy-settings.xml
resolve:
ivy-availability-check:
[loadresource] Do not set property disallowed.ivy.jars.list as its length is 0.
-ivy-fail-disallowed-ivy-version:
ivy-fail:
ivy-configure:
[ivy:configure] :: loading settings :: file = /x1/jenkins/jenkins-slave/workspace/Lucene-Solr-Tests-7.x/lucene/top-level-ivy-settings.xml
resolve:
ivy-availability-check:
[loadresource] Do not set property disallowed.ivy.jars.list as its length is 0.
-ivy-fail-disallowed-ivy-version:
ivy-fail:
ivy-configure:
[ivy:configure] :: loading settings :: file = /x1/jenkins/jenkins-slave/workspace/Lucene-Solr-Tests-7.x/lucene/top-level-ivy-settings.xml
resolve:
ivy-availability-check:
[loadresource] Do not set property disallowed.ivy.jars.list as its length is 0.
-ivy-fail-disallowed-ivy-version:
ivy-fail:
ivy-configure:
[ivy:configure] :: loading settings :: file = /x1/jenkins/jenkins-slave/workspace/Lucene-Solr-Tests-7.x/lucene/top-level-ivy-settings.xml
resolve:
ivy-availability-check:
[loadresource] Do not set property disallowed.ivy.jars.list as its length is 0.
-ivy-fail-disallowed-ivy-version:
ivy-fail:
ivy-configure:
[ivy:configure] :: loading settings :: file = /x1/jenkins/jenkins-slave/workspace/Lucene-Solr-Tests-7.x/lucene/top-level-ivy-settings.xml
resolve:
ivy-availability-check:
[loadresource] Do not set property disallowed.ivy.jars.list as its length is 0.
-ivy-fail-disallowed-ivy-version:
ivy-fail:
ivy-configure:
[ivy:configure] :: loading settings :: file = /x1/jenkins/jenkins-slave/workspace/Lucene-Solr-Tests-7.x/lucene/top-level-ivy-settings.xml
resolve:
ivy-availability-check:
[loadresource] Do not set property disallowed.ivy.jars.list as its length is 0.
-ivy-fail-disallowed-ivy-version:
ivy-fail:
ivy-configure:
[ivy:configure] :: loading settings :: file = /x1/jenkins/jenkins-slave/workspace/Lucene-Solr-Tests-7.x/lucene/top-level-ivy-settings.xml
resolve:
ivy-availability-check:
[loadresource] Do not set property disallowed.ivy.jars.list as its length is 0.
-ivy-fail-disallowed-ivy-version:
ivy-fail:
ivy-configure:
[ivy:configure] :: loading settings :: file = /x1/jenkins/jenkins-slave/workspace/Lucene-Solr-Tests-7.x/lucene/top-level-ivy-settings.xml
resolve:
ivy-availability-check:
[loadresource] Do not set property disallowed.ivy.jars.list as its length is 0.
-ivy-fail-disallowed-ivy-version:
ivy-fail:
ivy-configure:
[ivy:configure] :: loading settings :: file = /x1/jenkins/jenkins-slave/workspace/Lucene-Solr-Tests-7.x/lucene/top-level-ivy-settings.xml
resolve:
ivy-availability-check:
[loadresource] Do not set property disallowed.ivy.jars.list as its length is 0.
-ivy-fail-disallowed-ivy-version:
ivy-fail:
ivy-configure:
[ivy:configure] :: loading settings :: file = /x1/jenkins/jenkins-slave/workspace/Lucene-Solr-Tests-7.x/lucene/top-level-ivy-settings.xml
resolve:
ivy-availability-check:
[loadresource] Do not set property disallowed.ivy.jars.list as its length is 0.
-ivy-fail-disallowed-ivy-version:
ivy-fail:
ivy-configure:
[ivy:configure] :: loading settings :: file = /x1/jenkins/jenkins-slave/workspace/Lucene-Solr-Tests-7.x/lucene/top-level-ivy-settings.xml
resolve:
ivy-availability-check:
[loadresource] Do not set property disallowed.ivy.jars.list as its length is 0.
-ivy-fail-disallowed-ivy-version:
ivy-fail:
ivy-configure:
[ivy:configure] :: loading settings :: file = /x1/jenkins/jenkins-slave/workspace/Lucene-Solr-Tests-7.x/lucene/top-level-ivy-settings.xml
resolve:
ivy-availability-check:
[loadresource] Do not set property disallowed.ivy.jars.list as its length is 0.
-ivy-fail-disallowed-ivy-version:
ivy-fail:
ivy-configure:
[ivy:configure] :: loading settings :: file = /x1/jenkins/jenkins-slave/workspace/Lucene-Solr-Tests-7.x/lucene/top-level-ivy-settings.xml
resolve:
ivy-availability-check:
[loadresource] Do not set property disallowed.ivy.jars.list as its length is 0.
-ivy-fail-disallowed-ivy-version:
ivy-fail:
ivy-configure:
[ivy:configure] :: loading settings :: file = /x1/jenkins/jenkins-slave/workspace/Lucene-Solr-Tests-7.x/lucene/top-level-ivy-settings.xml
common.resolve:
resolve:
ivy-availability-check:
[loadresource] Do not set property disallowed.ivy.jars.list as its length is 0.
-ivy-fail-disallowed-ivy-version:
ivy-fail:
ivy-configure:
[ivy:configure] :: loading settings :: file = /x1/jenkins/jenkins-slave/workspace/Lucene-Solr-Tests-7.x/lucene/top-level-ivy-settings.xml
resolve:
ivy-availability-check:
[loadresource] Do not set property disallowed.ivy.jars.list as its length is 0.
-ivy-fail-disallowed-ivy-version:
ivy-fail:
ivy-configure:
[ivy:configure] :: loading settings :: file = /x1/jenkins/jenkins-slave/workspace/Lucene-Solr-Tests-7.x/lucene/top-level-ivy-settings.xml
resolve:
ivy-availability-check:
[loadresource] Do not set property disallowed.ivy.jars.list as its length is 0.
-ivy-fail-disallowed-ivy-version:
ivy-fail:
ivy-configure:
[ivy:configure] :: loading settings :: file = /x1/jenkins/jenkins-slave/workspace/Lucene-Solr-Tests-7.x/lucene/top-level-ivy-settings.xml
resolve:
ivy-availability-check:
[loadresource] Do not set property disallowed.ivy.jars.list as its length is 0.
-ivy-fail-disallowed-ivy-version:
ivy-fail:
ivy-configure:
[ivy:configure] :: loading settings :: file = /x1/jenkins/jenkins-slave/workspace/Lucene-Solr-Tests-7.x/lucene/top-level-ivy-settings.xml
resolve:
ivy-availability-check:
[loadresource] Do not set property disallowed.ivy.jars.list as its length is 0.
-ivy-fail-disallowed-ivy-version:
ivy-fail:
ivy-configure:
[ivy:configure] :: loading settings :: file = /x1/jenkins/jenkins-slave/workspace/Lucene-Solr-Tests-7.x/lucene/top-level-ivy-settings.xml
resolve:
jar-checksums:
[mkdir] Created dir: /x1/jenkins/jenkins-slave/workspace/Lucene-Solr-Tests-7.x/lucene/null1732515657
[copy] Copying 35 files to /x1/jenkins/jenkins-slave/workspace/Lucene-Solr-Tests-7.x/lucene/null1732515657
[delete] Deleting directory /x1/jenkins/jenkins-slave/workspace/Lucene-Solr-Tests-7.x/lucene/null1732515657
resolve-example:
ivy-availability-check:
[loadresource] Do not set property disallowed.ivy.jars.list as its length is 0.
-ivy-fail-disallowed-ivy-version:
ivy-fail:
ivy-configure:
[ivy:configure] :: loading settings :: file = /x1/jenkins/jenkins-slave/workspace/Lucene-Solr-Tests-7.x/lucene/top-level-ivy-settings.xml
resolve:
resolve-server:
ivy-availability-check:
[loadresource] Do not set property disallowed.ivy.jars.list as its length is 0.
-ivy-fail-disallowed-ivy-version:
ivy-fail:
ivy-fail:
ivy-configure:
[ivy:configure] :: loading settings :: file = /x1/jenkins/jenkins-slave/workspace/Lucene-Solr-Tests-7.x/lucene/top-level-ivy-settings.xml
resolve:
resolve:
ivy-availability-check:
[loadresource] Do not set property disallowed.ivy.jars.list as its length is 0.
-ivy-fail-disallowed-ivy-version:
ivy-fail:
ivy-fail:
ivy-configure:
[ivy:configure] :: loading settings :: file = /x1/jenkins/jenkins-slave/workspace/Lucene-Solr-Tests-7.x/lucene/top-level-ivy-settings.xml
resolve:
ivy-availability-check:
[loadresource] Do not set property disallowed.ivy.jars.list as its length is 0.
-ivy-fail-disallowed-ivy-version:
ivy-fail:
ivy-fail:
ivy-configure:
[ivy:configure] :: loading settings :: file = /x1/jenkins/jenkins-slave/workspace/Lucene-Solr-Tests-7.x/lucene/top-level-ivy-settings.xml
resolve:
ivy-availability-check:
[loadresource] Do not set property disallowed.ivy.jars.list as its length is 0.
-ivy-fail-disallowed-ivy-version:
ivy-fail:
ivy-configure:
[ivy:configure] :: loading settings :: file = /x1/jenkins/jenkins-slave/workspace/Lucene-Solr-Tests-7.x/lucene/top-level-ivy-settings.xml
resolve:
ivy-availability-check:
[loadresource] Do not set property disallowed.ivy.jars.list as its length is 0.
-ivy-fail-disallowed-ivy-version:
ivy-fail:
ivy-fail:
ivy-configure:
[ivy:configure] :: loading settings :: file = /x1/jenkins/jenkins-slave/workspace/Lucene-Solr-Tests-7.x/lucene/top-level-ivy-settings.xml
resolve:
ivy-availability-check:
[loadresource] Do not set property disallowed.ivy.jars.list as its length is 0.
-ivy-fail-disallowed-ivy-version:
ivy-fail:
ivy-configure:
[ivy:configure] :: loading settings :: file = /x1/jenkins/jenkins-slave/workspace/Lucene-Solr-Tests-7.x/lucene/top-level-ivy-settings.xml
resolve:
ivy-availability-check:
[loadresource] Do not set property disallowed.ivy.jars.list as its length is 0.
-ivy-fail-disallowed-ivy-version:
ivy-fail:
ivy-fail:
ivy-configure:
[ivy:configure] :: loading settings :: file = /x1/jenkins/jenkins-slave/workspace/Lucene-Solr-Tests-7.x/lucene/top-level-ivy-settings.xml
resolve:
ivy-availability-check:
[loadresource] Do not set property disallowed.ivy.jars.list as its length is 0.
-ivy-fail-disallowed-ivy-version:
ivy-fail:
ivy-fail:
ivy-configure:
[ivy:configure] :: loading settings :: file = /x1/jenkins/jenkins-slave/workspace/Lucene-Solr-Tests-7.x/lucene/top-level-ivy-settings.xml
resolve:
ivy-availability-check:
[loadresource] Do not set property disallowed.ivy.jars.list as its length is 0.
-ivy-fail-disallowed-ivy-version:
ivy-fail:
ivy-fail:
ivy-configure:
[ivy:configure] :: loading settings :: file = /x1/jenkins/jenkins-slave/workspace/Lucene-Solr-Tests-7.x/lucene/top-level-ivy-settings.xml
resolve:
ivy-availability-check:
[loadresource] Do not set property disallowed.ivy.jars.list as its length is 0.
-ivy-fail-disallowed-ivy-version:
ivy-fail:
ivy-fail:
ivy-configure:
[ivy:configure] :: loading settings :: file = /x1/jenkins/jenkins-slave/workspace/Lucene-Solr-Tests-7.x/lucene/top-level-ivy-settings.xml
resolve:
ivy-availability-check:
[loadresource] Do not set property disallowed.ivy.jars.list as its length is 0.
-ivy-fail-disallowed-ivy-version:
ivy-fail:
ivy-fail:
ivy-configure:
[ivy:configure] :: loading settings :: file = /x1/jenkins/jenkins-slave/workspace/Lucene-Solr-Tests-7.x/lucene/top-level-ivy-settings.xml
resolve:
ivy-availability-check:
[loadresource] Do not set property disallowed.ivy.jars.list as its length is 0.
-ivy-fail-disallowed-ivy-version:
ivy-fail:
ivy-fail:
ivy-configure:
[ivy:configure] :: loading settings :: file = /x1/jenkins/jenkins-slave/workspace/Lucene-Solr-Tests-7.x/lucene/top-level-ivy-settings.xml
resolve:
ivy-availability-check:
[loadresource] Do not set property disallowed.ivy.jars.list as its length is 0.
-ivy-fail-disallowed-ivy-version:
ivy-fail:
ivy-fail:
ivy-configure:
[ivy:configure] :: loading settings :: file = /x1/jenkins/jenkins-slave/workspace/Lucene-Solr-Tests-7.x/lucene/top-level-ivy-settings.xml
resolve:
ivy-availability-check:
[loadresource] Do not set property disallowed.ivy.jars.list as its length is 0.
-ivy-fail-disallowed-ivy-version:
ivy-fail:
ivy-fail:
ivy-configure:
[ivy:configure] :: loading settings :: file = /x1/jenkins/jenkins-slave/workspace/Lucene-Solr-Tests-7.x/lucene/top-level-ivy-settings.xml
resolve:
ivy-availability-check:
[loadresource] Do not set property disallowed.ivy.jars.list as its length is 0.
-ivy-fail-disallowed-ivy-version:
ivy-fail:
ivy-fail:
ivy-configure:
[ivy:configure] :: loading settings :: file = /x1/jenkins/jenkins-slave/workspace/Lucene-Solr-Tests-7.x/lucene/top-level-ivy-settings.xml
resolve:
ivy-availability-check:
[loadresource] Do not set property disallowed.ivy.jars.list as its length is 0.
-ivy-fail-disallowed-ivy-version:
ivy-fail:
ivy-fail:
ivy-configure:
[ivy:configure] :: loading settings :: file = /x1/jenkins/jenkins-slave/workspace/Lucene-Solr-Tests-7.x/lucene/top-level-ivy-settings.xml
resolve:
jar-checksums:
[mkdir] Created dir: /x1/jenkins/jenkins-slave/workspace/Lucene-Solr-Tests-7.x/solr/null286195483
[copy] Copying 241 files to /x1/jenkins/jenkins-slave/workspace/Lucene-Solr-Tests-7.x/solr/null286195483
[delete] Deleting directory /x1/jenkins/jenkins-slave/workspace/Lucene-Solr-Tests-7.x/solr/null286195483
check-working-copy:
[ivy:cachepath] :: resolving dependencies :: org.eclipse.jgit#org.eclipse.jgit-caller;working
[ivy:cachepath] confs: [default]
[ivy:cachepath] found org.eclipse.jgit#org.eclipse.jgit;4.6.0.201612231935-r in public
[ivy:cachepath] found com.jcraft#jsch;0.1.53 in public
[ivy:cachepath] found com.googlecode.javaewah#JavaEWAH;1.1.6 in public
[ivy:cachepath] found org.apache.httpcomponents#httpclient;4.3.6 in public
[ivy:cachepath] found org.apache.httpcomponents#httpcore;4.3.3 in public
[ivy:cachepath] found commons-logging#commons-logging;1.1.3 in public
[ivy:cachepath] found commons-codec#commons-codec;1.6 in public
[ivy:cachepath] found org.slf4j#slf4j-api;1.7.2 in public
[ivy:cachepath] :: resolution report :: resolve 29ms :: artifacts dl 2ms
---------------------------------------------------------------------
| | modules || artifacts |
| conf | number| search|dwnlded|evicted|| number|dwnlded|
---------------------------------------------------------------------
| default | 8 | 0 | 0 | 0 || 8 | 0 |
---------------------------------------------------------------------
[wc-checker] Initializing working copy...
[wc-checker] SLF4J: Failed to load class "org.slf4j.impl.StaticLoggerBinder".
[wc-checker] SLF4J: Defaulting to no-operation (NOP) logger implementation
[wc-checker] SLF4J: See http://www.slf4j.org/codes.html#StaticLoggerBinder for further details.
[wc-checker] Checking working copy status...
-jenkins-base:
BUILD SUCCESSFUL
Total time: 106 minutes 26 seconds
Archiving artifacts
java.lang.InterruptedException: no matches found within 10000
at hudson.FilePath$34.hasMatch(FilePath.java:2678)
at hudson.FilePath$34.invoke(FilePath.java:2557)
at hudson.FilePath$34.invoke(FilePath.java:2547)
at hudson.FilePath$FileCallableWrapper.call(FilePath.java:2918)
Also: hudson.remoting.Channel$CallSiteStackTrace: Remote call to lucene
at hudson.remoting.Channel.attachCallSiteStackTrace(Channel.java:1741)
at hudson.remoting.UserRequest$ExceptionResponse.retrieve(UserRequest.java:357)
at hudson.remoting.Channel.call(Channel.java:955)
at hudson.FilePath.act(FilePath.java:1036)
at hudson.FilePath.act(FilePath.java:1025)
at hudson.FilePath.validateAntFileMask(FilePath.java:2547)
at hudson.tasks.ArtifactArchiver.perform(ArtifactArchiver.java:243)
at hudson.tasks.BuildStepCompatibilityLayer.perform(BuildStepCompatibilityLayer.java:81)
at hudson.tasks.BuildStepMonitor$1.perform(BuildStepMonitor.java:20)
at hudson.model.AbstractBuild$AbstractBuildExecution.perform(AbstractBuild.java:744)
at hudson.model.AbstractBuild$AbstractBuildExecution.performAllBuildSteps(AbstractBuild.java:690)
at hudson.model.Build$BuildExecution.post2(Build.java:186)
at hudson.model.AbstractBuild$AbstractBuildExecution.post(AbstractBuild.java:635)
at hudson.model.Run.execute(Run.java:1819)
at hudson.model.FreeStyleBuild.run(FreeStyleBuild.java:43)
at hudson.model.ResourceController.execute(ResourceController.java:97)
at hudson.model.Executor.run(Executor.java:429)
Caused: hudson.FilePath$TunneledInterruptedException
at hudson.FilePath$FileCallableWrapper.call(FilePath.java:2920)
at hudson.remoting.UserRequest.perform(UserRequest.java:212)
at hudson.remoting.UserRequest.perform(UserRequest.java:54)
at hudson.remoting.Request$2.run(Request.java:369)
at hudson.remoting.InterceptingExecutorService$1.call(InterceptingExecutorService.java:72)
at java.util.concurrent.FutureTask.run(FutureTask.java:266)
at java.util.concurrent.ThreadPoolExecutor.runWorker(ThreadPoolExecutor.java:1142)
at java.util.concurrent.ThreadPoolExecutor$Worker.run(ThreadPoolExecutor.java:617)
at java.lang.Thread.run(Thread.java:748)
Caused: java.lang.InterruptedException: java.lang.InterruptedException: no matches found within 10000
at hudson.FilePath.act(FilePath.java:1038)
at hudson.FilePath.act(FilePath.java:1025)
at hudson.FilePath.validateAntFileMask(FilePath.java:2547)
at hudson.tasks.ArtifactArchiver.perform(ArtifactArchiver.java:243)
at hudson.tasks.BuildStepCompatibilityLayer.perform(BuildStepCompatibilityLayer.java:81)
at hudson.tasks.BuildStepMonitor$1.perform(BuildStepMonitor.java:20)
at hudson.model.AbstractBuild$AbstractBuildExecution.perform(AbstractBuild.java:744)
at hudson.model.AbstractBuild$AbstractBuildExecution.performAllBuildSteps(AbstractBuild.java:690)
at hudson.model.Build$BuildExecution.post2(Build.java:186)
at hudson.model.AbstractBuild$AbstractBuildExecution.post(AbstractBuild.java:635)
at hudson.model.Run.execute(Run.java:1819)
at hudson.model.FreeStyleBuild.run(FreeStyleBuild.java:43)
at hudson.model.ResourceController.execute(ResourceController.java:97)
at hudson.model.Executor.run(Executor.java:429)
No artifacts found that match the file pattern "**/*.events,heapdumps/**,**/hs_err_pid*". Configuration error?
Recording test results
Build step 'Publish JUnit test result report' changed build result to UNSTABLE
Email was triggered for: Unstable (Test Failures)
Sending email for trigger: Unstable (Test Failures)