You are viewing a plain text version of this content. The canonical link for it is here.
Posted to dev@zookeeper.apache.org by Apache Jenkins Server <je...@builds.apache.org> on 2016/11/24 17:31:04 UTC

ZooKeeper-trunk - Build # 3169 - Failure

See https://builds.apache.org/job/ZooKeeper-trunk/3169/

###################################################################################
########################## LAST 60 LINES OF THE CONSOLE ###########################
[...truncated 481984 lines...]
     [exec] /home/jenkins/jenkins-slave/workspace/ZooKeeper-trunk/src/c/src/zookeeper.c:4712:12: error: (near initialization for 'h') [-Werror]
     [exec] /home/jenkins/jenkins-slave/workspace/ZooKeeper-trunk/src/c/src/zookeeper.c:4712:26: error: storage size of 'h' isn't known
     [exec]      struct RequestHeader h = { get_xid(), ZOO_REMOVE_WATCHES };
     [exec]                           ^
     [exec] /home/jenkins/jenkins-slave/workspace/ZooKeeper-trunk/src/c/src/zookeeper.c:4713:12: error: variable 'req' has initializer but incomplete type
     [exec]      struct RemoveWatchesRequest req =  { (char*)server_path, wtype };
     [exec]             ^
     [exec] /home/jenkins/jenkins-slave/workspace/ZooKeeper-trunk/src/c/src/zookeeper.c:4713:12: error: excess elements in struct initializer [-Werror]
     [exec] /home/jenkins/jenkins-slave/workspace/ZooKeeper-trunk/src/c/src/zookeeper.c:4713:12: error: (near initialization for 'req') [-Werror]
     [exec] /home/jenkins/jenkins-slave/workspace/ZooKeeper-trunk/src/c/src/zookeeper.c:4713:12: error: excess elements in struct initializer [-Werror]
     [exec] /home/jenkins/jenkins-slave/workspace/ZooKeeper-trunk/src/c/src/zookeeper.c:4713:12: error: (near initialization for 'req') [-Werror]
     [exec] /home/jenkins/jenkins-slave/workspace/ZooKeeper-trunk/src/c/src/zookeeper.c:4713:33: error: storage size of 'req' isn't known
     [exec]      struct RemoveWatchesRequest req =  { (char*)server_path, wtype };
     [exec]                                  ^
     [exec] /home/jenkins/jenkins-slave/workspace/ZooKeeper-trunk/src/c/src/zookeeper.c:4740:5: error: implicit declaration of function 'serialize_RemoveWatchesRequest' [-Werror=implicit-function-declaration]
     [exec]      rc = rc < 0 ? rc : serialize_RemoveWatchesRequest(oa, "req", &req);
     [exec]      ^
     [exec] /home/jenkins/jenkins-slave/workspace/ZooKeeper-trunk/src/c/src/zookeeper.c:4713:33: error: unused variable 'req' [-Werror=unused-variable]
     [exec]      struct RemoveWatchesRequest req =  { (char*)server_path, wtype };
     [exec]                                  ^
     [exec] /home/jenkins/jenkins-slave/workspace/ZooKeeper-trunk/src/c/src/zookeeper.c:4712:26: error: unused variable 'h' [-Werror=unused-variable]
     [exec]      struct RequestHeader h = { get_xid(), ZOO_REMOVE_WATCHES };
     [exec]                           ^
     [exec] /home/jenkins/jenkins-slave/workspace/ZooKeeper-trunk/src/c/src/zookeeper.c: At top level:
     [exec] /home/jenkins/jenkins-slave/workspace/ZooKeeper-trunk/src/c/src/zookeeper.c:141:19: error: '_OPEN_ACL_UNSAFE_ACL' defined but not used [-Werror=unused-variable]
     [exec]  static struct ACL _OPEN_ACL_UNSAFE_ACL[] = {{0x1f, {"world", "anyone"}}};
     [exec]                    ^
     [exec] /home/jenkins/jenkins-slave/workspace/ZooKeeper-trunk/src/c/src/zookeeper.c:142:19: error: '_READ_ACL_UNSAFE_ACL' defined but not used [-Werror=unused-variable]
     [exec]  static struct ACL _READ_ACL_UNSAFE_ACL[] = {{0x01, {"world", "anyone"}}};
     [exec]                    ^
     [exec] /home/jenkins/jenkins-slave/workspace/ZooKeeper-trunk/src/c/src/zookeeper.c:143:19: error: '_CREATOR_ALL_ACL_ACL' defined but not used [-Werror=unused-variable]
     [exec]  static struct ACL _CREATOR_ALL_ACL_ACL[] = {{0x1f, {"auth", ""}}};
     [exec]                    ^
     [exec] cc1: all warnings being treated as errors
     [exec] make: *** [zookeeper.lo] Error 1

BUILD FAILED
/home/jenkins/jenkins-slave/workspace/ZooKeeper-trunk/build.xml:1324: The following error occurred while executing this line:
/home/jenkins/jenkins-slave/workspace/ZooKeeper-trunk/build.xml:1284: The following error occurred while executing this line:
/home/jenkins/jenkins-slave/workspace/ZooKeeper-trunk/build.xml:1294: exec returned: 2

Total time: 13 minutes 36 seconds
Build step 'Execute shell' marked build as failure
[FINDBUGS] Skipping publisher since build result is FAILURE
[WARNINGS] Skipping publisher since build result is FAILURE
Archiving artifacts
Setting JDK_1_7_LATEST__HOME=/home/jenkins/tools/java/latest1.7
Recording fingerprints
Setting JDK_1_7_LATEST__HOME=/home/jenkins/tools/java/latest1.7
Updating ZOOKEEPER-2628
Recording test results
Setting JDK_1_7_LATEST__HOME=/home/jenkins/tools/java/latest1.7
Publishing Javadoc
Setting JDK_1_7_LATEST__HOME=/home/jenkins/tools/java/latest1.7
Setting JDK_1_7_LATEST__HOME=/home/jenkins/tools/java/latest1.7
Email was triggered for: Failure - Any
Sending email for trigger: Failure - Any
Setting JDK_1_7_LATEST__HOME=/home/jenkins/tools/java/latest1.7
Setting JDK_1_7_LATEST__HOME=/home/jenkins/tools/java/latest1.7



###################################################################################
############################## FAILED TESTS (if any) ##############################
All tests passed

ZooKeeper-trunk - Build # 3170 - Still Failing

Posted by Apache Jenkins Server <je...@builds.apache.org>.
See https://builds.apache.org/job/ZooKeeper-trunk/3170/

###################################################################################
########################## LAST 60 LINES OF THE CONSOLE ###########################
[...truncated 484376 lines...]
    [junit] 	at java.util.concurrent.ThreadPoolExecutor.runWorker(ThreadPoolExecutor.java:1145)
    [junit] 	at java.util.concurrent.ThreadPoolExecutor$Worker.run(ThreadPoolExecutor.java:615)
    [junit] 	at java.lang.Thread.run(Thread.java:745)
    [junit] 2016-11-24 23:36:07,051 [myid:127.0.0.1:14066] - INFO  [main-SendThread(127.0.0.1:14066):ClientCnxn$SendThread@1231] - Unable to read additional data from server sessionid 0x0, likely server has closed socket, closing socket connection and attempting reconnect
    [junit] 2016-11-24 23:36:07,261 [myid:127.0.0.1:14066] - INFO  [main-SendThread(127.0.0.1:14066):ClientCnxn$SendThread@1113] - Opening socket connection to server 127.0.0.1/127.0.0.1:14066. Will not attempt to authenticate using SASL (unknown error)
    [junit] 2016-11-24 23:36:07,261 [myid:127.0.0.1:14066] - INFO  [main-SendThread(127.0.0.1:14066):ClientCnxn$SendThread@948] - Socket connection established, initiating session, client: /127.0.0.1:60796, server: 127.0.0.1/127.0.0.1:14066
    [junit] 2016-11-24 23:36:07,261 [myid:] - WARN  [New I/O worker #4119:NettyServerCnxn@399] - Closing connection to /127.0.0.1:60796
    [junit] java.io.IOException: ZK down
    [junit] 	at org.apache.zookeeper.server.NettyServerCnxn.receiveMessage(NettyServerCnxn.java:336)
    [junit] 	at org.apache.zookeeper.server.NettyServerCnxnFactory$CnxnChannelHandler.processMessage(NettyServerCnxnFactory.java:244)
    [junit] 	at org.apache.zookeeper.server.NettyServerCnxnFactory$CnxnChannelHandler.messageReceived(NettyServerCnxnFactory.java:166)
    [junit] 	at org.jboss.netty.channel.SimpleChannelHandler.handleUpstream(SimpleChannelHandler.java:88)
    [junit] 	at org.jboss.netty.channel.DefaultChannelPipeline.sendUpstream(DefaultChannelPipeline.java:564)
    [junit] 	at org.jboss.netty.channel.DefaultChannelPipeline.sendUpstream(DefaultChannelPipeline.java:559)
    [junit] 	at org.jboss.netty.channel.Channels.fireMessageReceived(Channels.java:268)
    [junit] 	at org.jboss.netty.channel.Channels.fireMessageReceived(Channels.java:255)
    [junit] 	at org.jboss.netty.channel.socket.nio.NioWorker.read(NioWorker.java:88)
    [junit] 	at org.jboss.netty.channel.socket.nio.AbstractNioWorker.process(AbstractNioWorker.java:108)
    [junit] 	at org.jboss.netty.channel.socket.nio.AbstractNioSelector.run(AbstractNioSelector.java:337)
    [junit] 	at org.jboss.netty.channel.socket.nio.AbstractNioWorker.run(AbstractNioWorker.java:89)
    [junit] 	at org.jboss.netty.channel.socket.nio.NioWorker.run(NioWorker.java:178)
    [junit] 	at org.jboss.netty.util.ThreadRenamingRunnable.run(ThreadRenamingRunnable.java:108)
    [junit] 	at org.jboss.netty.util.internal.DeadLockProofWorker$1.run(DeadLockProofWorker.java:42)
    [junit] 	at java.util.concurrent.ThreadPoolExecutor.runWorker(ThreadPoolExecutor.java:1145)
    [junit] 	at java.util.concurrent.ThreadPoolExecutor$Worker.run(ThreadPoolExecutor.java:615)
    [junit] 	at java.lang.Thread.run(Thread.java:745)
    [junit] 2016-11-24 23:36:07,262 [myid:127.0.0.1:14066] - INFO  [main-SendThread(127.0.0.1:14066):ClientCnxn$SendThread@1231] - Unable to read additional data from server sessionid 0x501291b5f850000, likely server has closed socket, closing socket connection and attempting reconnect
    [junit] 2016-11-24 23:36:07,286 [myid:127.0.0.1:14039] - INFO  [main-SendThread(127.0.0.1:14039):ClientCnxn$SendThread@1113] - Opening socket connection to server 127.0.0.1/127.0.0.1:14039. Will not attempt to authenticate using SASL (unknown error)
    [junit] 2016-11-24 23:36:07,286 [myid:127.0.0.1:14039] - WARN  [main-SendThread(127.0.0.1:14039):ClientCnxn$SendThread@1235] - Session 0x201291b362e0000 for server 127.0.0.1/127.0.0.1:14039, unexpected error, closing socket connection and attempting reconnect
    [junit] java.net.ConnectException: Connection refused
    [junit] 	at sun.nio.ch.SocketChannelImpl.checkConnect(Native Method)
    [junit] 	at sun.nio.ch.SocketChannelImpl.finishConnect(SocketChannelImpl.java:744)
    [junit] 	at org.apache.zookeeper.ClientCnxnSocketNIO.doTransport(ClientCnxnSocketNIO.java:357)
    [junit] 	at org.apache.zookeeper.ClientCnxn$SendThread.run(ClientCnxn.java:1214)
    [junit] Running org.apache.zookeeper.test.NioNettySuiteTest in thread 2
    [junit] Tests run: 1, Failures: 0, Errors: 1, Skipped: 0, Time elapsed: 0 sec, Thread: 2, Class: org.apache.zookeeper.test.NioNettySuiteTest
    [junit] Test org.apache.zookeeper.test.NioNettySuiteTest FAILED (timeout)

BUILD FAILED
/home/jenkins/jenkins-slave/workspace/ZooKeeper-trunk/build.xml:1324: The following error occurred while executing this line:
/home/jenkins/jenkins-slave/workspace/ZooKeeper-trunk/build.xml:1209: Tests failed!

Total time: 19 minutes 41 seconds
Build step 'Execute shell' marked build as failure
[FINDBUGS] Skipping publisher since build result is FAILURE
[WARNINGS] Skipping publisher since build result is FAILURE
Archiving artifacts
Setting JDK_1_7_LATEST__HOME=/home/jenkins/tools/java/latest1.7
Recording fingerprints
Setting JDK_1_7_LATEST__HOME=/home/jenkins/tools/java/latest1.7
Recording test results
Setting JDK_1_7_LATEST__HOME=/home/jenkins/tools/java/latest1.7
Publishing Javadoc
Setting JDK_1_7_LATEST__HOME=/home/jenkins/tools/java/latest1.7
Setting JDK_1_7_LATEST__HOME=/home/jenkins/tools/java/latest1.7
Email was triggered for: Failure - Any
Sending email for trigger: Failure - Any
Setting JDK_1_7_LATEST__HOME=/home/jenkins/tools/java/latest1.7
Setting JDK_1_7_LATEST__HOME=/home/jenkins/tools/java/latest1.7



###################################################################################
############################## FAILED TESTS (if any) ##############################
2 tests failed.
FAILED:  org.apache.zookeeper.server.ZxidRolloverTest.testRolloverThenFollowerRestart

Error Message:
Timeout occurred. Please note the time in the report does not reflect the time until the timeout.

Stack Trace:
junit.framework.AssertionFailedError: Timeout occurred. Please note the time in the report does not reflect the time until the timeout.
	at java.lang.Thread.run(Thread.java:745)


FAILED:  org.apache.zookeeper.test.NioNettySuiteTest.testRemoveAddTwo

Error Message:
Timeout occurred. Please note the time in the report does not reflect the time until the timeout.

Stack Trace:
junit.framework.AssertionFailedError: Timeout occurred. Please note the time in the report does not reflect the time until the timeout.
	at java.lang.Thread.run(Thread.java:745)