You are viewing a plain text version of this content. The canonical link for it is here.
Posted to builds@beam.apache.org by Apache Jenkins Server <je...@builds.apache.org> on 2023/03/25 18:09:56 UTC
Build failed in Jenkins: beam_PostCommit_Python310 #631
See <https://ci-beam.apache.org/job/beam_PostCommit_Python310/631/display/redirect>
Changes:
------------------------------------------
[...truncated 9.37 MB...]
message: "Done consuming work."
log_location: "/usr/local/lib/python3.10/site-packages/apache_beam/runners/worker/sdk_worker.py:285"
thread: "MainThread"
INFO:root:severity: INFO
timestamp {
seconds: 1679757673
nanos: 164622068
}
message: "Python sdk harness exiting."
log_location: "/usr/local/lib/python3.10/site-packages/apache_beam/runners/worker/sdk_worker_main.py:205"
thread: "MainThread"
INFO:apache_beam.runners.portability.local_job_service:Completed job in 26.09730839729309 seconds with state DONE.
INFO:root:Completed job in 26.09730839729309 seconds with state DONE.
INFO:apache_beam.runners.portability.portable_runner:Job state changed to DONE
> Task :sdks:python:test-suites:portable:py310:portableWordCountSparkRunnerBatch
INFO:apache_beam.runners.worker.worker_pool_main:Listening for workers at localhost:37047
INFO:root:Default Python SDK image for environment is apache/beam_python3.10_sdk:2.47.0.dev
INFO:apache_beam.runners.portability.fn_api_runner.translations:==================== <function pack_combiners at 0x7fa2eec1a8c0> ====================
INFO:apache_beam.runners.portability.fn_api_runner.translations:==================== <function lift_combiners at 0x7fa2eec1a950> ====================
INFO:apache_beam.runners.portability.fn_api_runner.translations:==================== <function sort_stages at 0x7fa2eec1b0a0> ====================
INFO:apache_beam.utils.subprocess_server:Starting service with ['java' '-jar' '<https://ci-beam.apache.org/job/beam_PostCommit_Python310/ws/src/runners/spark/3/job-server/build/libs/beam-runners-spark-3-job-server-2.47.0-SNAPSHOT.jar'> '--spark-master-url' 'local[4]' '--artifacts-dir' '/tmp/beam-temp8ue4fb71/artifactsdl5q891c' '--job-port' '37209' '--artifact-port' '0' '--expansion-port' '0']
INFO:apache_beam.utils.subprocess_server:23/03/25 15:21:25 WARN software.amazon.awssdk.regions.internal.util.EC2MetadataUtils: Unable to retrieve the requested metadata.
INFO:apache_beam.utils.subprocess_server:23/03/25 15:21:25 INFO org.apache.beam.runners.jobsubmission.JobServerDriver: ArtifactStagingService started on localhost:36111
INFO:apache_beam.utils.subprocess_server:23/03/25 15:21:26 INFO org.apache.beam.runners.jobsubmission.JobServerDriver: Java ExpansionService started on localhost:41271
INFO:apache_beam.utils.subprocess_server:23/03/25 15:21:26 INFO org.apache.beam.runners.jobsubmission.JobServerDriver: JobService started on localhost:37209
INFO:apache_beam.utils.subprocess_server:23/03/25 15:21:26 INFO org.apache.beam.runners.jobsubmission.JobServerDriver: Job server now running, terminate with Ctrl+C
WARNING:root:Waiting for grpc channel to be ready at localhost:37209.
INFO:apache_beam.utils.subprocess_server:23/03/25 15:21:28 INFO org.apache.beam.runners.fnexecution.artifact.ArtifactStagingService: Staging artifacts for job_f31147b1-6693-429b-82a6-7b2c01cae755.
INFO:apache_beam.utils.subprocess_server:23/03/25 15:21:28 INFO org.apache.beam.runners.fnexecution.artifact.ArtifactStagingService: Resolving artifacts for job_f31147b1-6693-429b-82a6-7b2c01cae755.ref_Environment_default_environment_1.
INFO:apache_beam.utils.subprocess_server:23/03/25 15:21:28 INFO org.apache.beam.runners.fnexecution.artifact.ArtifactStagingService: Getting 1 artifacts for job_f31147b1-6693-429b-82a6-7b2c01cae755.null.
INFO:apache_beam.utils.subprocess_server:23/03/25 15:21:28 INFO org.apache.beam.runners.fnexecution.artifact.ArtifactStagingService: Artifacts fully staged for job_f31147b1-6693-429b-82a6-7b2c01cae755.
INFO:apache_beam.utils.subprocess_server:23/03/25 15:21:29 INFO org.apache.beam.runners.spark.SparkJobInvoker: Invoking job BeamApp-jenkins-0325152128-cf81d8c4_000ba42e-8657-41f4-b91e-5bdd3e331f82
INFO:apache_beam.utils.subprocess_server:23/03/25 15:21:29 INFO org.apache.beam.runners.jobsubmission.JobInvocation: Starting job invocation BeamApp-jenkins-0325152128-cf81d8c4_000ba42e-8657-41f4-b91e-5bdd3e331f82
INFO:apache_beam.runners.portability.portable_runner:Environment "LOOPBACK" has started a component necessary for the execution. Be sure to run the pipeline using
with Pipeline() as p:
p.apply(..)
This ensures that the pipeline finishes before this program exits.
INFO:apache_beam.runners.portability.portable_runner:Job state changed to STOPPED
INFO:apache_beam.runners.portability.portable_runner:Job state changed to STARTING
INFO:apache_beam.runners.portability.portable_runner:Job state changed to RUNNING
INFO:apache_beam.utils.subprocess_server:23/03/25 15:21:29 INFO org.apache.beam.runners.spark.translation.SparkContextFactory: Creating a brand new Spark Context.
INFO:apache_beam.utils.subprocess_server:23/03/25 15:21:29 WARN org.apache.hadoop.util.NativeCodeLoader: Unable to load native-hadoop library for your platform... using builtin-java classes where applicable
INFO:apache_beam.utils.subprocess_server:23/03/25 15:21:30 INFO org.sparkproject.jetty.util.log: Logging initialized @7571ms to org.sparkproject.jetty.util.log.Slf4jLog
INFO:apache_beam.utils.subprocess_server:23/03/25 15:21:31 INFO org.sparkproject.jetty.server.Server: jetty-9.4.40.v20210413; built: 2021-04-13T20:42:42.668Z; git: b881a572662e1943a14ae12e7e1207989f218b74; jvm 1.8.0_362-8u362-ga-0ubuntu1~20.04.1-b09
INFO:apache_beam.utils.subprocess_server:23/03/25 15:21:31 INFO org.sparkproject.jetty.server.Server: Started @7856ms
INFO:apache_beam.utils.subprocess_server:23/03/25 15:21:31 INFO org.sparkproject.jetty.server.AbstractConnector: Started ServerConnector@2f3ce8a2{HTTP/1.1, (http/1.1)}{127.0.0.1:4040}
INFO:apache_beam.utils.subprocess_server:23/03/25 15:21:31 INFO org.sparkproject.jetty.server.handler.ContextHandler: Started o.s.j.s.ServletContextHandler@535cbcee{/jobs,null,AVAILABLE,@Spark}
INFO:apache_beam.utils.subprocess_server:23/03/25 15:21:31 INFO org.sparkproject.jetty.server.handler.ContextHandler: Started o.s.j.s.ServletContextHandler@68d7b2fa{/jobs/json,null,AVAILABLE,@Spark}
INFO:apache_beam.utils.subprocess_server:23/03/25 15:21:31 INFO org.sparkproject.jetty.server.handler.ContextHandler: Started o.s.j.s.ServletContextHandler@4d0428d6{/jobs/job,null,AVAILABLE,@Spark}
INFO:apache_beam.utils.subprocess_server:23/03/25 15:21:31 INFO org.sparkproject.jetty.server.handler.ContextHandler: Started o.s.j.s.ServletContextHandler@6ce5efb5{/jobs/job/json,null,AVAILABLE,@Spark}
INFO:apache_beam.utils.subprocess_server:23/03/25 15:21:31 INFO org.sparkproject.jetty.server.handler.ContextHandler: Started o.s.j.s.ServletContextHandler@278132b5{/stages,null,AVAILABLE,@Spark}
INFO:apache_beam.utils.subprocess_server:23/03/25 15:21:31 INFO org.sparkproject.jetty.server.handler.ContextHandler: Started o.s.j.s.ServletContextHandler@3f6edc2a{/stages/json,null,AVAILABLE,@Spark}
INFO:apache_beam.utils.subprocess_server:23/03/25 15:21:31 INFO org.sparkproject.jetty.server.handler.ContextHandler: Started o.s.j.s.ServletContextHandler@4805d158{/stages/stage,null,AVAILABLE,@Spark}
INFO:apache_beam.utils.subprocess_server:23/03/25 15:21:31 INFO org.sparkproject.jetty.server.handler.ContextHandler: Started o.s.j.s.ServletContextHandler@2f179f61{/stages/stage/json,null,AVAILABLE,@Spark}
INFO:apache_beam.utils.subprocess_server:23/03/25 15:21:31 INFO org.sparkproject.jetty.server.handler.ContextHandler: Started o.s.j.s.ServletContextHandler@5629ed01{/stages/pool,null,AVAILABLE,@Spark}
INFO:apache_beam.utils.subprocess_server:23/03/25 15:21:31 INFO org.sparkproject.jetty.server.handler.ContextHandler: Started o.s.j.s.ServletContextHandler@7cd10f60{/stages/pool/json,null,AVAILABLE,@Spark}
INFO:apache_beam.utils.subprocess_server:23/03/25 15:21:31 INFO org.sparkproject.jetty.server.handler.ContextHandler: Started o.s.j.s.ServletContextHandler@6ca76d9b{/storage,null,AVAILABLE,@Spark}
INFO:apache_beam.utils.subprocess_server:23/03/25 15:21:31 INFO org.sparkproject.jetty.server.handler.ContextHandler: Started o.s.j.s.ServletContextHandler@400cff9{/storage/json,null,AVAILABLE,@Spark}
INFO:apache_beam.utils.subprocess_server:23/03/25 15:21:31 INFO org.sparkproject.jetty.server.handler.ContextHandler: Started o.s.j.s.ServletContextHandler@58d6a6b9{/storage/rdd,null,AVAILABLE,@Spark}
INFO:apache_beam.utils.subprocess_server:23/03/25 15:21:31 INFO org.sparkproject.jetty.server.handler.ContextHandler: Started o.s.j.s.ServletContextHandler@59d23829{/storage/rdd/json,null,AVAILABLE,@Spark}
INFO:apache_beam.utils.subprocess_server:23/03/25 15:21:31 INFO org.sparkproject.jetty.server.handler.ContextHandler: Started o.s.j.s.ServletContextHandler@6d041692{/environment,null,AVAILABLE,@Spark}
INFO:apache_beam.utils.subprocess_server:23/03/25 15:21:31 INFO org.sparkproject.jetty.server.handler.ContextHandler: Started o.s.j.s.ServletContextHandler@48c5898{/environment/json,null,AVAILABLE,@Spark}
INFO:apache_beam.utils.subprocess_server:23/03/25 15:21:31 INFO org.sparkproject.jetty.server.handler.ContextHandler: Started o.s.j.s.ServletContextHandler@1d750fe3{/executors,null,AVAILABLE,@Spark}
INFO:apache_beam.utils.subprocess_server:23/03/25 15:21:31 INFO org.sparkproject.jetty.server.handler.ContextHandler: Started o.s.j.s.ServletContextHandler@eeb6e64{/executors/json,null,AVAILABLE,@Spark}
INFO:apache_beam.utils.subprocess_server:23/03/25 15:21:31 INFO org.sparkproject.jetty.server.handler.ContextHandler: Started o.s.j.s.ServletContextHandler@2ad2e5c5{/executors/threadDump,null,AVAILABLE,@Spark}
INFO:apache_beam.utils.subprocess_server:23/03/25 15:21:31 INFO org.sparkproject.jetty.server.handler.ContextHandler: Started o.s.j.s.ServletContextHandler@3a84b6f3{/executors/threadDump/json,null,AVAILABLE,@Spark}
INFO:apache_beam.utils.subprocess_server:23/03/25 15:21:31 INFO org.sparkproject.jetty.server.handler.ContextHandler: Started o.s.j.s.ServletContextHandler@7706a134{/static,null,AVAILABLE,@Spark}
INFO:apache_beam.utils.subprocess_server:23/03/25 15:21:31 INFO org.sparkproject.jetty.server.handler.ContextHandler: Started o.s.j.s.ServletContextHandler@3898e9ff{/,null,AVAILABLE,@Spark}
INFO:apache_beam.utils.subprocess_server:23/03/25 15:21:31 INFO org.sparkproject.jetty.server.handler.ContextHandler: Started o.s.j.s.ServletContextHandler@a721798{/api,null,AVAILABLE,@Spark}
INFO:apache_beam.utils.subprocess_server:23/03/25 15:21:31 INFO org.sparkproject.jetty.server.handler.ContextHandler: Started o.s.j.s.ServletContextHandler@543f93fd{/jobs/job/kill,null,AVAILABLE,@Spark}
INFO:apache_beam.utils.subprocess_server:23/03/25 15:21:31 INFO org.sparkproject.jetty.server.handler.ContextHandler: Started o.s.j.s.ServletContextHandler@2005573b{/stages/stage/kill,null,AVAILABLE,@Spark}
INFO:apache_beam.utils.subprocess_server:23/03/25 15:21:31 INFO org.sparkproject.jetty.server.handler.ContextHandler: Started o.s.j.s.ServletContextHandler@5f672ad{/metrics/json,null,AVAILABLE,@Spark}
INFO:apache_beam.utils.subprocess_server:23/03/25 15:21:31 INFO org.apache.beam.runners.spark.metrics.MetricsAccumulator: Instantiated metrics accumulator: MetricQueryResults()
INFO:apache_beam.utils.subprocess_server:23/03/25 15:21:31 WARN software.amazon.awssdk.regions.internal.util.EC2MetadataUtils: Unable to retrieve the requested metadata.
INFO:apache_beam.utils.subprocess_server:23/03/25 15:21:31 INFO org.apache.beam.runners.spark.SparkPipelineRunner: Running job BeamApp-jenkins-0325152128-cf81d8c4_000ba42e-8657-41f4-b91e-5bdd3e331f82 on Spark master local[4]
INFO:apache_beam.utils.subprocess_server:23/03/25 15:21:33 WARN software.amazon.awssdk.regions.internal.util.EC2MetadataUtils: Unable to retrieve the requested metadata.
INFO:apache_beam.utils.subprocess_server:23/03/25 15:21:33 WARN software.amazon.awssdk.regions.internal.util.EC2MetadataUtils: Unable to retrieve the requested metadata.
INFO:apache_beam.utils.subprocess_server:23/03/25 15:21:33 WARN software.amazon.awssdk.regions.internal.util.EC2MetadataUtils: Unable to retrieve the requested metadata.
INFO:apache_beam.utils.subprocess_server:23/03/25 15:21:33 WARN software.amazon.awssdk.regions.internal.util.EC2MetadataUtils: Unable to retrieve the requested metadata.
INFO:apache_beam.runners.worker.statecache:Creating state cache with size 0
INFO:apache_beam.runners.worker.sdk_worker:Creating insecure control channel for localhost:46543.
INFO:apache_beam.runners.worker.sdk_worker:Control channel established.
INFO:apache_beam.runners.worker.sdk_worker:Initializing SDKHarness with unbounded number of workers.
INFO:apache_beam.utils.subprocess_server:23/03/25 15:21:33 INFO org.apache.beam.runners.fnexecution.control.FnApiControlClientPoolService: Beam Fn Control client connected with id 1-1
INFO:apache_beam.utils.subprocess_server:23/03/25 15:21:33 INFO org.apache.beam.runners.fnexecution.control.FnApiControlClientPoolService: getProcessBundleDescriptor request with id 1-2
INFO:apache_beam.runners.worker.sdk_worker:Creating insecure state channel for localhost:43433.
INFO:apache_beam.runners.worker.sdk_worker:State channel established.
INFO:root:Default Python SDK image for environment is apache/beam_python3.10_sdk:2.47.0.dev
INFO:apache_beam.runners.worker.data_plane:Creating client data channel for localhost:33195
INFO:apache_beam.utils.subprocess_server:23/03/25 15:21:33 INFO org.apache.beam.runners.fnexecution.data.GrpcDataService: Beam Fn Data client connected.
INFO:apache_beam.utils.subprocess_server:23/03/25 15:21:33 INFO org.apache.beam.runners.fnexecution.control.FnApiControlClientPoolService: getProcessBundleDescriptor request with id 1-3
INFO:root:Default Python SDK image for environment is apache/beam_python3.10_sdk:2.47.0.dev
INFO:apache_beam.utils.subprocess_server:23/03/25 15:21:33 WARN software.amazon.awssdk.regions.internal.util.EC2MetadataUtils: Unable to retrieve the requested metadata.
INFO:apache_beam.utils.subprocess_server:23/03/25 15:21:33 WARN software.amazon.awssdk.regions.internal.util.EC2MetadataUtils: Unable to retrieve the requested metadata.
INFO:apache_beam.utils.subprocess_server:23/03/25 15:21:33 WARN software.amazon.awssdk.regions.internal.util.EC2MetadataUtils: Unable to retrieve the requested metadata.
INFO:apache_beam.utils.subprocess_server:23/03/25 15:21:33 WARN software.amazon.awssdk.regions.internal.util.EC2MetadataUtils: Unable to retrieve the requested metadata.
INFO:apache_beam.utils.subprocess_server:23/03/25 15:21:34 INFO org.apache.beam.runners.fnexecution.control.FnApiControlClientPoolService: getProcessBundleDescriptor request with id 1-4
INFO:root:Default Python SDK image for environment is apache/beam_python3.10_sdk:2.47.0.dev
INFO:apache_beam.utils.subprocess_server:23/03/25 15:21:34 INFO org.apache.beam.runners.fnexecution.control.FnApiControlClientPoolService: getProcessBundleDescriptor request with id 1-5
INFO:root:Default Python SDK image for environment is apache/beam_python3.10_sdk:2.47.0.dev
INFO:apache_beam.utils.subprocess_server:23/03/25 15:21:34 WARN software.amazon.awssdk.regions.internal.util.EC2MetadataUtils: Unable to retrieve the requested metadata.
INFO:apache_beam.utils.subprocess_server:23/03/25 15:21:34 WARN software.amazon.awssdk.regions.internal.util.EC2MetadataUtils: Unable to retrieve the requested metadata.
INFO:apache_beam.utils.subprocess_server:23/03/25 15:21:34 WARN software.amazon.awssdk.regions.internal.util.EC2MetadataUtils: Unable to retrieve the requested metadata.
INFO:apache_beam.utils.subprocess_server:23/03/25 15:21:34 WARN software.amazon.awssdk.regions.internal.util.EC2MetadataUtils: Unable to retrieve the requested metadata.
INFO:apache_beam.utils.subprocess_server:23/03/25 15:21:34 INFO org.apache.beam.runners.fnexecution.control.FnApiControlClientPoolService: getProcessBundleDescriptor request with id 1-7
INFO:apache_beam.utils.subprocess_server:23/03/25 15:21:34 INFO org.apache.beam.runners.fnexecution.control.FnApiControlClientPoolService: getProcessBundleDescriptor request with id 1-6
INFO:apache_beam.utils.subprocess_server:23/03/25 15:21:34 INFO org.apache.beam.runners.fnexecution.control.FnApiControlClientPoolService: getProcessBundleDescriptor request with id 1-9
INFO:root:Default Python SDK image for environment is apache/beam_python3.10_sdk:2.47.0.dev
INFO:root:Default Python SDK image for environment is apache/beam_python3.10_sdk:2.47.0.dev
INFO:root:Default Python SDK image for environment is apache/beam_python3.10_sdk:2.47.0.dev
INFO:apache_beam.utils.subprocess_server:23/03/25 15:21:34 INFO org.apache.beam.runners.fnexecution.control.FnApiControlClientPoolService: getProcessBundleDescriptor request with id 1-8
INFO:root:Default Python SDK image for environment is apache/beam_python3.10_sdk:2.47.0.dev
INFO:apache_beam.utils.subprocess_server:23/03/25 15:21:34 INFO org.apache.beam.runners.fnexecution.control.FnApiControlClientPoolService: getProcessBundleDescriptor request with id 1-10
INFO:root:Default Python SDK image for environment is apache/beam_python3.10_sdk:2.47.0.dev
INFO:apache_beam.utils.subprocess_server:23/03/25 15:21:34 INFO org.apache.beam.runners.fnexecution.control.FnApiControlClientPoolService: getProcessBundleDescriptor request with id 1-13
INFO:root:Default Python SDK image for environment is apache/beam_python3.10_sdk:2.47.0.dev
INFO:apache_beam.utils.subprocess_server:23/03/25 15:21:34 INFO org.apache.beam.runners.fnexecution.control.FnApiControlClientPoolService: getProcessBundleDescriptor request with id 1-11
INFO:root:Default Python SDK image for environment is apache/beam_python3.10_sdk:2.47.0.dev
INFO:root:Default Python SDK image for environment is apache/beam_python3.10_sdk:2.47.0.dev
INFO:apache_beam.utils.subprocess_server:23/03/25 15:21:34 INFO org.apache.beam.runners.fnexecution.control.FnApiControlClientPoolService: getProcessBundleDescriptor request with id 1-12
INFO:apache_beam.utils.subprocess_server:23/03/25 15:21:34 WARN software.amazon.awssdk.regions.internal.util.EC2MetadataUtils: Unable to retrieve the requested metadata.
INFO:apache_beam.utils.subprocess_server:23/03/25 15:21:34 WARN software.amazon.awssdk.regions.internal.util.EC2MetadataUtils: Unable to retrieve the requested metadata.
INFO:apache_beam.utils.subprocess_server:23/03/25 15:21:34 WARN software.amazon.awssdk.regions.internal.util.EC2MetadataUtils: Unable to retrieve the requested metadata.
INFO:apache_beam.utils.subprocess_server:23/03/25 15:21:34 WARN software.amazon.awssdk.regions.internal.util.EC2MetadataUtils: Unable to retrieve the requested metadata.
INFO:apache_beam.utils.subprocess_server:23/03/25 15:21:34 INFO org.apache.beam.runners.fnexecution.control.FnApiControlClientPoolService: getProcessBundleDescriptor request with id 1-14
INFO:root:Default Python SDK image for environment is apache/beam_python3.10_sdk:2.47.0.dev
INFO:apache_beam.utils.subprocess_server:23/03/25 15:21:34 WARN software.amazon.awssdk.regions.internal.util.EC2MetadataUtils: Unable to retrieve the requested metadata.
INFO:apache_beam.utils.subprocess_server:23/03/25 15:21:34 WARN software.amazon.awssdk.regions.internal.util.EC2MetadataUtils: Unable to retrieve the requested metadata.
INFO:apache_beam.utils.subprocess_server:23/03/25 15:21:34 WARN software.amazon.awssdk.regions.internal.util.EC2MetadataUtils: Unable to retrieve the requested metadata.
INFO:apache_beam.utils.subprocess_server:23/03/25 15:21:34 WARN software.amazon.awssdk.regions.internal.util.EC2MetadataUtils: Unable to retrieve the requested metadata.
INFO:apache_beam.utils.subprocess_server:23/03/25 15:21:35 INFO org.apache.beam.runners.fnexecution.control.FnApiControlClientPoolService: getProcessBundleDescriptor request with id 1-15
INFO:root:Default Python SDK image for environment is apache/beam_python3.10_sdk:2.47.0.dev
INFO:apache_beam.utils.subprocess_server:23/03/25 15:21:35 INFO org.apache.beam.runners.spark.SparkPipelineRunner: Job BeamApp-jenkins-0325152128-cf81d8c4_000ba42e-8657-41f4-b91e-5bdd3e331f82: Pipeline translated successfully. Computing outputs
INFO:apache_beam.utils.subprocess_server:23/03/25 15:21:35 WARN software.amazon.awssdk.regions.internal.util.EC2MetadataUtils: Unable to retrieve the requested metadata.
INFO:apache_beam.utils.subprocess_server:23/03/25 15:21:35 WARN software.amazon.awssdk.regions.internal.util.EC2MetadataUtils: Unable to retrieve the requested metadata.
INFO:apache_beam.utils.subprocess_server:23/03/25 15:21:35 WARN software.amazon.awssdk.regions.internal.util.EC2MetadataUtils: Unable to retrieve the requested metadata.
INFO:apache_beam.utils.subprocess_server:23/03/25 15:21:35 WARN software.amazon.awssdk.regions.internal.util.EC2MetadataUtils: Unable to retrieve the requested metadata.
INFO:apache_beam.utils.subprocess_server:23/03/25 15:21:35 INFO org.apache.beam.runners.fnexecution.control.FnApiControlClientPoolService: getProcessBundleDescriptor request with id 1-16
INFO:root:Default Python SDK image for environment is apache/beam_python3.10_sdk:2.47.0.dev
INFO:apache_beam.io.filebasedsink:Starting finalize_write threads with num_shards: 4 (skipped: 0), batches: 4, num_threads: 4
INFO:apache_beam.io.filebasedsink:Renamed 4 shards in 0.01 seconds.
INFO:apache_beam.utils.subprocess_server:23/03/25 15:21:35 INFO org.apache.beam.runners.spark.SparkPipelineRunner: Job BeamApp-jenkins-0325152128-cf81d8c4_000ba42e-8657-41f4-b91e-5bdd3e331f82 finished.
INFO:apache_beam.utils.subprocess_server:23/03/25 15:21:35 INFO org.sparkproject.jetty.server.AbstractConnector: Stopped Spark@2f3ce8a2{HTTP/1.1, (http/1.1)}{127.0.0.1:4040}
INFO:apache_beam.runners.portability.portable_runner:Job state changed to DONE
Exception in thread run_worker_1-1:
Traceback (most recent call last):
File "/usr/lib/python3.10/threading.py", line 1009, in _bootstrap_inner
Exception in thread read_state:
Traceback (most recent call last):
File "/usr/lib/python3.10/threading.py", line 1009, in _bootstrap_inner
self.run()
File "/usr/lib/python3.10/threading.py", line 946, in run
self.run()
File "/usr/lib/python3.10/threading.py", line 946, in run
self._target(*self._args, **self._kwargs)
File "<https://ci-beam.apache.org/job/beam_PostCommit_Python310/ws/src/sdks/python/apache_beam/runners/worker/sdk_worker.py",> line 1039, in pull_responses
self._target(*self._args, **self._kwargs)
File "<https://ci-beam.apache.org/job/beam_PostCommit_Python310/ws/src/sdks/python/apache_beam/runners/worker/sdk_worker.py",> line 262, in run
for response in responses:
for work_request in self._control_stub.Control(get_responses()):
File "<https://ci-beam.apache.org/job/beam_PostCommit_Python310/ws/src/build/gradleenv/-1720702907/lib/python3.10/site-packages/grpc/_channel.py",> line 426, in __next__
File "<https://ci-beam.apache.org/job/beam_PostCommit_Python310/ws/src/build/gradleenv/-1720702907/lib/python3.10/site-packages/grpc/_channel.py",> line 426, in __next__
return self._next()
ERROR:apache_beam.runners.worker.data_plane:Failed to read inputs in the data plane.
Traceback (most recent call last):
File "<https://ci-beam.apache.org/job/beam_PostCommit_Python310/ws/src/sdks/python/apache_beam/runners/worker/data_plane.py",> line 654, in _read_inputs
for elements in elements_iterator:
File "<https://ci-beam.apache.org/job/beam_PostCommit_Python310/ws/src/build/gradleenv/-1720702907/lib/python3.10/site-packages/grpc/_channel.py",> line 426, in __next__
return self._next()
File "<https://ci-beam.apache.org/job/beam_PostCommit_Python310/ws/src/build/gradleenv/-1720702907/lib/python3.10/site-packages/grpc/_channel.py",> line 826, in _next
raise self
grpc._channel._MultiThreadedRendezvous: <_MultiThreadedRendezvous of RPC that terminated with:
status = StatusCode.UNAVAILABLE
details = "Socket closed"
debug_error_string = "UNKNOWN:Error received from peer ipv6:%5B::1%5D:33195 {created_time:"2023-03-25T15:21:35.749538154+00:00", grpc_status:14, grpc_message:"Socket closed"}"
>
File "<https://ci-beam.apache.org/job/beam_PostCommit_Python310/ws/src/build/gradleenv/-1720702907/lib/python3.10/site-packages/grpc/_channel.py",> line 826, in _next
return self._next()
Exception in thread read_grpc_client_inputs:
Traceback (most recent call last):
File "/usr/lib/python3.10/threading.py", line 1009, in _bootstrap_inner
File "<https://ci-beam.apache.org/job/beam_PostCommit_Python310/ws/src/build/gradleenv/-1720702907/lib/python3.10/site-packages/grpc/_channel.py",> line 826, in _next
raise self
self.run()
File "/usr/lib/python3.10/threading.py", line 946, in run
raise self
grpc._channel._MultiThreadedRendezvous: <_MultiThreadedRendezvous of RPC that terminated with:
status = StatusCode.UNAVAILABLE
details = "Socket closed"
debug_error_string = "UNKNOWN:Error received from peer ipv6:%5B::1%5D:46543 {created_time:"2023-03-25T15:21:35.749578932+00:00", grpc_status:14, grpc_message:"Socket closed"}"
>
grpc._channel._MultiThreadedRendezvous: <_MultiThreadedRendezvous of RPC that terminated with:
status = StatusCode.UNAVAILABLE
details = "Socket closed"
debug_error_string = "UNKNOWN:Error received from peer ipv6:%5B::1%5D:43433 {created_time:"2023-03-25T15:21:35.749643253+00:00", grpc_status:14, grpc_message:"Socket closed"}"
>
self._target(*self._args, **self._kwargs)
File "<https://ci-beam.apache.org/job/beam_PostCommit_Python310/ws/src/sdks/python/apache_beam/runners/worker/data_plane.py",> line 671, in <lambda>
target=lambda: self._read_inputs(elements_iterator),
File "<https://ci-beam.apache.org/job/beam_PostCommit_Python310/ws/src/sdks/python/apache_beam/runners/worker/data_plane.py",> line 654, in _read_inputs
for elements in elements_iterator:
File "<https://ci-beam.apache.org/job/beam_PostCommit_Python310/ws/src/build/gradleenv/-1720702907/lib/python3.10/site-packages/grpc/_channel.py",> line 426, in __next__
return self._next()
File "<https://ci-beam.apache.org/job/beam_PostCommit_Python310/ws/src/build/gradleenv/-1720702907/lib/python3.10/site-packages/grpc/_channel.py",> line 826, in _next
raise self
grpc._channel._MultiThreadedRendezvous: <_MultiThreadedRendezvous of RPC that terminated with:
status = StatusCode.UNAVAILABLE
details = "Socket closed"
debug_error_string = "UNKNOWN:Error received from peer ipv6:%5B::1%5D:33195 {created_time:"2023-03-25T15:21:35.749538154+00:00", grpc_status:14, grpc_message:"Socket closed"}"
>
> Task :sdks:python:test-suites:portable:py310:postCommitPy310
> Task :sdks:python:test-suites:dataflow:py310:postCommitIT FAILED
FAILURE: Build failed with an exception.
* Where:
Script '<https://ci-beam.apache.org/job/beam_PostCommit_Python310/ws/src/sdks/python/test-suites/dataflow/common.gradle'> line: 111
* What went wrong:
Execution failed for task ':sdks:python:test-suites:dataflow:py310:postCommitIT'.
> Process 'command 'sh'' finished with non-zero exit value 1
* Try:
> Run with --stacktrace option to get the stack trace.
> Run with --info or --debug option to get more log output.
* Get more help at https://help.gradle.org
Deprecated Gradle features were used in this build, making it incompatible with Gradle 8.0.
You can use '--warning-mode all' to show the individual deprecation warnings and determine if they come from your own scripts or plugins.
See https://docs.gradle.org/7.5.1/userguide/command_line_interface.html#sec:command_line_warnings
Execution optimizations have been disabled for 1 invalid unit(s) of work during this build to ensure correctness.
Please consult deprecation warnings for more details.
BUILD FAILED in 3h 6m 30s
207 actionable tasks: 151 executed, 50 from cache, 6 up-to-date
Publishing build scan...
https://gradle.com/s/cw6klgvc3azim
Build step 'Invoke Gradle script' changed build result to FAILURE
Build step 'Invoke Gradle script' marked build as failure
---------------------------------------------------------------------
To unsubscribe, e-mail: builds-unsubscribe@beam.apache.org
For additional commands, e-mail: builds-help@beam.apache.org
Jenkins build is back to normal : beam_PostCommit_Python310 #641
Posted by Apache Jenkins Server <je...@builds.apache.org>.
See <https://ci-beam.apache.org/job/beam_PostCommit_Python310/641/display/redirect>
---------------------------------------------------------------------
To unsubscribe, e-mail: builds-unsubscribe@beam.apache.org
For additional commands, e-mail: builds-help@beam.apache.org
Build failed in Jenkins: beam_PostCommit_Python310 #640
Posted by Apache Jenkins Server <je...@builds.apache.org>.
See <https://ci-beam.apache.org/job/beam_PostCommit_Python310/640/display/redirect>
Changes:
------------------------------------------
[...truncated 11.77 MB...]
apache_beam/io/gcp/bigquery_write_it_test.py: 3 warnings
apache_beam/io/gcp/bigquery_test.py: 3 warnings
<https://ci-beam.apache.org/job/beam_PostCommit_Python310/ws/src/sdks/python/apache_beam/io/gcp/bigquery_file_loads.py>:1173: BeamDeprecationWarning: options is deprecated since First stable release. References to <pipeline>.options will not be supported
temp_location = p.options.view_as(GoogleCloudOptions).temp_location
apache_beam/examples/cookbook/bigquery_tornadoes_it_test.py: 1 warning
apache_beam/examples/complete/game/hourly_team_score_it_test.py: 1 warning
apache_beam/io/gcp/big_query_query_to_table_it_test.py: 4 warnings
apache_beam/io/gcp/bigquery_file_loads_test.py: 3 warnings
apache_beam/io/gcp/bigquery_write_it_test.py: 3 warnings
apache_beam/io/gcp/bigquery_test.py: 3 warnings
<https://ci-beam.apache.org/job/beam_PostCommit_Python310/ws/src/sdks/python/apache_beam/io/gcp/bigquery_file_loads.py>:1175: BeamDeprecationWarning: options is deprecated since First stable release. References to <pipeline>.options will not be supported
p.options.view_as(GoogleCloudOptions).job_name or 'AUTOMATIC_JOB_NAME')
apache_beam/examples/cookbook/bigquery_tornadoes_it_test.py::BigqueryTornadoesIT::test_bigquery_tornadoes_it
<https://ci-beam.apache.org/job/beam_PostCommit_Python310/ws/src/sdks/python/apache_beam/io/gcp/tests/utils.py>:100: PendingDeprecationWarning: Client.dataset is deprecated and will be removed in a future version. Use a string like 'my_project.my_dataset' or a cloud.google.bigquery.DatasetReference object, instead.
table_ref = client.dataset(dataset_id).table(table_id)
apache_beam/examples/dataframe/flight_delays_it_test.py::FlightDelaysTest::test_flight_delays
<https://ci-beam.apache.org/job/beam_PostCommit_Python310/ws/src/sdks/python/apache_beam/examples/dataframe/flight_delays.py>:47: FutureWarning: The default value of numeric_only in DataFrame.mean is deprecated. In a future version, it will default to False. In addition, specifying 'numeric_only=None' is deprecated. Select only valid columns or specify the value of numeric_only to silence this warning.
return airline_df[at_top_airports].mean()
apache_beam/examples/dataframe/flight_delays_it_test.py::FlightDelaysTest::test_flight_delays
apache_beam/examples/dataframe/taxiride_it_test.py::TaxirideIT::test_aggregation
apache_beam/examples/dataframe/taxiride_it_test.py::TaxirideIT::test_enrich
<https://ci-beam.apache.org/job/beam_PostCommit_Python310/ws/src/sdks/python/apache_beam/dataframe/io.py>:659: FutureWarning: WriteToFiles is experimental.
return pcoll | fileio.WriteToFiles(
apache_beam/examples/dataframe/flight_delays_it_test.py::FlightDelaysTest::test_flight_delays
apache_beam/examples/dataframe/taxiride_it_test.py::TaxirideIT::test_aggregation
apache_beam/examples/dataframe/taxiride_it_test.py::TaxirideIT::test_enrich
<https://ci-beam.apache.org/job/beam_PostCommit_Python310/ws/src/sdks/python/apache_beam/io/fileio.py>:596: BeamDeprecationWarning: options is deprecated since First stable release. References to <pipeline>.options will not be supported
p.options.view_as(GoogleCloudOptions).temp_location or
apache_beam/io/gcp/bigquery_test.py::BigQueryStreamingInsertTransformIntegrationTests::test_multiple_destinations_transform
<https://ci-beam.apache.org/job/beam_PostCommit_Python310/ws/src/sdks/python/apache_beam/io/gcp/bigquery_test.py>:1694: BeamDeprecationWarning: options is deprecated since First stable release. References to <pipeline>.options will not be supported
streaming = self.test_pipeline.options.view_as(StandardOptions).streaming
apache_beam/io/gcp/bigquery_read_it_test.py::ReadTests::test_native_source
<https://ci-beam.apache.org/job/beam_PostCommit_Python310/ws/src/sdks/python/apache_beam/io/gcp/bigquery_read_it_test.py>:170: BeamDeprecationWarning: BigQuerySource is deprecated since 2.25.0. Use ReadFromBigQuery instead.
beam.io.BigQuerySource(query=self.query, use_standard_sql=True)))
apache_beam/ml/gcp/cloud_dlp_it_test.py::CloudDLPIT::test_deidentification
<https://ci-beam.apache.org/job/beam_PostCommit_Python310/ws/src/sdks/python/apache_beam/ml/gcp/cloud_dlp_it_test.py>:74: FutureWarning: MaskDetectedDetails is experimental.
| MaskDetectedDetails(
apache_beam/ml/inference/sklearn_inference_it_test.py::SklearnInference::test_sklearn_regression
<https://ci-beam.apache.org/job/beam_PostCommit_Python310/ws/src/sdks/python/apache_beam/examples/inference/sklearn_japanese_housing_regression.py>:128: FutureWarning: SklearnModelHandlerPandas is experimental. No backwards-compatibility guarantees.
model_loader = SklearnModelHandlerPandas(
apache_beam/ml/inference/sklearn_inference_it_test.py::SklearnInference::test_sklearn_regression
<https://ci-beam.apache.org/job/beam_PostCommit_Python310/ws/src/build/gradleenv/2050596098/lib/python3.10/site-packages/dill/_dill.py>:472: FutureWarning: SklearnModelHandlerPandas is experimental. No backwards-compatibility guarantees.
obj = StockUnpickler.load(self)
apache_beam/ml/gcp/cloud_dlp_it_test.py::CloudDLPIT::test_inspection
<https://ci-beam.apache.org/job/beam_PostCommit_Python310/ws/src/sdks/python/apache_beam/ml/gcp/cloud_dlp_it_test.py>:85: FutureWarning: InspectForDetails is experimental.
| InspectForDetails(
apache_beam/io/gcp/bigquery_read_it_test.py::ReadNewTypesTests::test_native_source
<https://ci-beam.apache.org/job/beam_PostCommit_Python310/ws/src/sdks/python/apache_beam/io/gcp/bigquery_read_it_test.py>:693: BeamDeprecationWarning: BigQuerySource is deprecated since 2.25.0. Use ReadFromBigQuery instead.
beam.io.BigQuerySource(query=self.query, use_standard_sql=True)))
apache_beam/io/gcp/bigquery_read_it_test.py::ReadAllBQTests::test_read_queries
<https://ci-beam.apache.org/job/beam_PostCommit_Python310/ws/src/sdks/python/apache_beam/io/gcp/bigquery_read_it_test.py>:808: FutureWarning: ReadAllFromBigQuery is experimental.
| beam.io.ReadAllFromBigQuery())
apache_beam/io/gcp/bigquery_read_it_test.py::ReadAllBQTests::test_read_queries
<https://ci-beam.apache.org/job/beam_PostCommit_Python310/ws/src/sdks/python/apache_beam/io/gcp/bigquery.py>:2665: BeamDeprecationWarning: options is deprecated since First stable release. References to <pipeline>.options will not be supported
job_name = pcoll.pipeline.options.view_as(GoogleCloudOptions).job_name
apache_beam/io/gcp/bigquery_read_it_test.py::ReadAllBQTests::test_read_queries
<https://ci-beam.apache.org/job/beam_PostCommit_Python310/ws/src/sdks/python/apache_beam/io/gcp/bigquery.py>:2666: BeamDeprecationWarning: options is deprecated since First stable release. References to <pipeline>.options will not be supported
project = pcoll.pipeline.options.view_as(GoogleCloudOptions).project
apache_beam/io/gcp/bigquery_read_it_test.py::ReadAllBQTests::test_read_queries
<https://ci-beam.apache.org/job/beam_PostCommit_Python310/ws/src/sdks/python/apache_beam/io/gcp/bigquery.py>:2679: BeamDeprecationWarning: options is deprecated since First stable release. References to <pipeline>.options will not be supported
options=pcoll.pipeline.options,
-- Docs: https://docs.pytest.org/en/stable/how-to/capture-warnings.html
- generated xml file: <https://ci-beam.apache.org/job/beam_PostCommit_Python310/ws/src/sdks/python/pytest_postCommitIT-df-py310.xml> -
[36m[1m=========================== short test summary info ============================[0m
[31mFAILED[0m apache_beam/examples/complete/game/leader_board_it_test.py::[1mLeaderBoardIT::test_leader_board_it[0m - AssertionError:
Expected: (Test pipeline expected terminated in state: RUNNING and Expected checksum is de00231fe6730b972c0ff60a99988438911cda53 and Expected checksum is de00231fe6730b972c0ff60a99988438911cda53)
but: Expected checksum is de00231fe6730b972c0ff60a99988438911cda53 Actual checksum is da39a3ee5e6b4b0d3255bfef95601890afd80709
[31mFAILED[0m apache_beam/ml/inference/sklearn_inference_it_test.py::[1mSklearnInference::test_sklearn_regression[0m - apache_beam.runners.dataflow.dataflow_runner.DataflowRuntimeException: Dataflow pipeline failed. State: FAILED, Error:
Traceback (most recent call last):
File "apache_beam/runners/common.py", line 1418, in apache_beam.runners.common.DoFnRunner.process
File "apache_beam/runners/common.py", line 838, in apache_beam.runners.common.PerWindowInvoker.invoke_process
File "apache_beam/runners/common.py", line 984, in apache_beam.runners.common.PerWindowInvoker._invoke_process_per_window
File "/usr/local/lib/python3.10/site-packages/apache_beam/ml/inference/base.py", line 552, in process
return self._run_inference(batch, inference_args)
File "/usr/local/lib/python3.10/site-packages/apache_beam/ml/inference/base.py", line 521, in _run_inference
raise e
File "/usr/local/lib/python3.10/site-packages/apache_beam/ml/inference/base.py", line 517, in _run_inference
result_generator = self._model_handler.run_inference(
File "/usr/local/lib/python3.10/site-packages/apache_beam/ml/inference/sklearn_inference.py", line 268, in run_inference
predictions, splits = self._model_inference_fn(model, batch, inference_args)
File "/usr/local/lib/python3.10/site-packages/apache_beam/ml/inference/sklearn_inference.py", line 185, in _default_pandas_inference_fn
predictions = model.predict(vectorized_batch)
File "/usr/local/lib/python3.10/site-packages/sklearn/pipeline.py", line 480, in predict
Xt = transform.transform(Xt)
File "/usr/local/lib/python3.10/site-packages/sklearn/utils/_set_output.py", line 140, in wrapped
data_to_wrap = f(self, X, *args, **kwargs)
File "/usr/local/lib/python3.10/site-packages/sklearn/compose/_column_transformer.py", line 800, in transform
Xs = self._fit_transform(
File "/usr/local/lib/python3.10/site-packages/sklearn/compose/_column_transformer.py", line 652, in _fit_transform
transformers = list(
File "/usr/local/lib/python3.10/site-packages/sklearn/compose/_column_transformer.py", line 349, in _iter
transformers = [
File "/usr/local/lib/python3.10/site-packages/sklearn/compose/_column_transformer.py", line 350, in <listcomp>
replace_passthrough(*trans) for trans in self.transformers_
File "/usr/local/lib/python3.10/site-packages/sklearn/compose/_column_transformer.py", line 345, in replace_passthrough
if name not in self._name_to_fitted_passthrough:
AttributeError: 'ColumnTransformer' object has no attribute '_name_to_fitted_passthrough'
During handling of the above exception, another exception occurred:
Traceback (most recent call last):
File "/usr/local/lib/python3.10/site-packages/apache_beam/runners/worker/sdk_worker.py", line 295, in _execute
response = task()
File "/usr/local/lib/python3.10/site-packages/apache_beam/runners/worker/sdk_worker.py", line 370, in <lambda>
lambda: self.create_worker().do_instruction(request), request)
File "/usr/local/lib/python3.10/site-packages/apache_beam/runners/worker/sdk_worker.py", line 629, in do_instruction
return getattr(self, request_type)(
File "/usr/local/lib/python3.10/site-packages/apache_beam/runners/worker/sdk_worker.py", line 667, in process_bundle
bundle_processor.process_bundle(instruction_id))
File "/usr/local/lib/python3.10/site-packages/apache_beam/runners/worker/bundle_processor.py", line 1062, in process_bundle
input_op_by_transform_id[element.transform_id].process_encoded(
File "/usr/local/lib/python3.10/site-packages/apache_beam/runners/worker/bundle_processor.py", line 232, in process_encoded
self.output(decoded_value)
File "apache_beam/runners/worker/operations.py", line 526, in apache_beam.runners.worker.operations.Operation.output
File "apache_beam/runners/worker/operations.py", line 528, in apache_beam.runners.worker.operations.Operation.output
File "apache_beam/runners/worker/operations.py", line 237, in apache_beam.runners.worker.operations.SingletonElementConsumerSet.receive
File "apache_beam/runners/worker/operations.py", line 240, in apache_beam.runners.worker.operations.SingletonElementConsumerSet.receive
File "apache_beam/runners/worker/operations.py", line 907, in apache_beam.runners.worker.operations.DoOperation.process
File "apache_beam/runners/worker/operations.py", line 908, in apache_beam.runners.worker.operations.DoOperation.process
File "apache_beam/runners/common.py", line 1420, in apache_beam.runners.common.DoFnRunner.process
File "apache_beam/runners/common.py", line 1492, in apache_beam.runners.common.DoFnRunner._reraise_augmented
File "apache_beam/runners/common.py", line 1418, in apache_beam.runners.common.DoFnRunner.process
File "apache_beam/runners/common.py", line 624, in apache_beam.runners.common.SimpleInvoker.invoke_process
File "apache_beam/runners/common.py", line 1582, in apache_beam.runners.common._OutputHandler.handle_process_outputs
File "apache_beam/runners/common.py", line 1695, in apache_beam.runners.common._OutputHandler._write_value_to_tag
File "apache_beam/runners/worker/operations.py", line 240, in apache_beam.runners.worker.operations.SingletonElementConsumerSet.receive
File "apache_beam/runners/worker/operations.py", line 907, in apache_beam.runners.worker.operations.DoOperation.process
File "apache_beam/runners/worker/operations.py", line 908, in apache_beam.runners.worker.operations.DoOperation.process
File "apache_beam/runners/common.py", line 1420, in apache_beam.runners.common.DoFnRunner.process
File "apache_beam/runners/common.py", line 1492, in apache_beam.runners.common.DoFnRunner._reraise_augmented
File "apache_beam/runners/common.py", line 1418, in apache_beam.runners.common.DoFnRunner.process
File "apache_beam/runners/common.py", line 624, in apache_beam.runners.common.SimpleInvoker.invoke_process
File "apache_beam/runners/common.py", line 1582, in apache_beam.runners.common._OutputHandler.handle_process_outputs
File "apache_beam/runners/common.py", line 1695, in apache_beam.runners.common._OutputHandler._write_value_to_tag
File "apache_beam/runners/worker/operations.py", line 240, in apache_beam.runners.worker.operations.SingletonElementConsumerSet.receive
File "apache_beam/runners/worker/operations.py", line 907, in apache_beam.runners.worker.operations.DoOperation.process
File "apache_beam/runners/worker/operations.py", line 908, in apache_beam.runners.worker.operations.DoOperation.process
File "apache_beam/runners/common.py", line 1420, in apache_beam.runners.common.DoFnRunner.process
File "apache_beam/runners/common.py", line 1492, in apache_beam.runners.common.DoFnRunner._reraise_augmented
File "apache_beam/runners/common.py", line 1418, in apache_beam.runners.common.DoFnRunner.process
File "apache_beam/runners/common.py", line 624, in apache_beam.runners.common.SimpleInvoker.invoke_process
File "apache_beam/runners/common.py", line 1582, in apache_beam.runners.common._OutputHandler.handle_process_outputs
File "apache_beam/runners/common.py", line 1695, in apache_beam.runners.common._OutputHandler._write_value_to_tag
File "apache_beam/runners/worker/operations.py", line 240, in apache_beam.runners.worker.operations.SingletonElementConsumerSet.receive
File "apache_beam/runners/worker/operations.py", line 907, in apache_beam.runners.worker.operations.DoOperation.process
File "apache_beam/runners/worker/operations.py", line 908, in apache_beam.runners.worker.operations.DoOperation.process
File "apache_beam/runners/common.py", line 1420, in apache_beam.runners.common.DoFnRunner.process
File "apache_beam/runners/common.py", line 1492, in apache_beam.runners.common.DoFnRunner._reraise_augmented
File "apache_beam/runners/common.py", line 1418, in apache_beam.runners.common.DoFnRunner.process
File "apache_beam/runners/common.py", line 838, in apache_beam.runners.common.PerWindowInvoker.invoke_process
File "apache_beam/runners/common.py", line 982, in apache_beam.runners.common.PerWindowInvoker._invoke_process_per_window
File "apache_beam/runners/common.py", line 1582, in apache_beam.runners.common._OutputHandler.handle_process_outputs
File "apache_beam/runners/common.py", line 1697, in apache_beam.runners.common._OutputHandler._write_value_to_tag
File "apache_beam/runners/worker/operations.py", line 237, in apache_beam.runners.worker.operations.SingletonElementConsumerSet.receive
File "apache_beam/runners/worker/operations.py", line 240, in apache_beam.runners.worker.operations.SingletonElementConsumerSet.receive
File "apache_beam/runners/worker/operations.py", line 907, in apache_beam.runners.worker.operations.DoOperation.process
File "apache_beam/runners/worker/operations.py", line 908, in apache_beam.runners.worker.operations.DoOperation.process
File "apache_beam/runners/common.py", line 1420, in apache_beam.runners.common.DoFnRunner.process
File "apache_beam/runners/common.py", line 1492, in apache_beam.runners.common.DoFnRunner._reraise_augmented
File "apache_beam/runners/common.py", line 1418, in apache_beam.runners.common.DoFnRunner.process
File "apache_beam/runners/common.py", line 624, in apache_beam.runners.common.SimpleInvoker.invoke_process
File "apache_beam/runners/common.py", line 1582, in apache_beam.runners.common._OutputHandler.handle_process_outputs
File "apache_beam/runners/common.py", line 1695, in apache_beam.runners.common._OutputHandler._write_value_to_tag
File "apache_beam/runners/worker/operations.py", line 240, in apache_beam.runners.worker.operations.SingletonElementConsumerSet.receive
File "apache_beam/runners/worker/operations.py", line 907, in apache_beam.runners.worker.operations.DoOperation.process
File "apache_beam/runners/worker/operations.py", line 908, in apache_beam.runners.worker.operations.DoOperation.process
File "apache_beam/runners/common.py", line 1420, in apache_beam.runners.common.DoFnRunner.process
File "apache_beam/runners/common.py", line 1508, in apache_beam.runners.common.DoFnRunner._reraise_augmented
File "apache_beam/runners/common.py", line 1418, in apache_beam.runners.common.DoFnRunner.process
File "apache_beam/runners/common.py", line 838, in apache_beam.runners.common.PerWindowInvoker.invoke_process
File "apache_beam/runners/common.py", line 984, in apache_beam.runners.common.PerWindowInvoker._invoke_process_per_window
File "/usr/local/lib/python3.10/site-packages/apache_beam/ml/inference/base.py", line 552, in process
return self._run_inference(batch, inference_args)
File "/usr/local/lib/python3.10/site-packages/apache_beam/ml/inference/base.py", line 521, in _run_inference
raise e
File "/usr/local/lib/python3.10/site-packages/apache_beam/ml/inference/base.py", line 517, in _run_inference
result_generator = self._model_handler.run_inference(
File "/usr/local/lib/python3.10/site-packages/apache_beam/ml/inference/sklearn_inference.py", line 268, in run_inference
predictions, splits = self._model_inference_fn(model, batch, inference_args)
File "/usr/local/lib/python3.10/site-packages/apache_beam/ml/inference/sklearn_inference.py", line 185, in _default_pandas_inference_fn
predictions = model.predict(vectorized_batch)
File "/usr/local/lib/python3.10/site-packages/sklearn/pipeline.py", line 480, in predict
Xt = transform.transform(Xt)
File "/usr/local/lib/python3.10/site-packages/sklearn/utils/_set_output.py", line 140, in wrapped
data_to_wrap = f(self, X, *args, **kwargs)
File "/usr/local/lib/python3.10/site-packages/sklearn/compose/_column_transformer.py", line 800, in transform
Xs = self._fit_transform(
File "/usr/local/lib/python3.10/site-packages/sklearn/compose/_column_transformer.py", line 652, in _fit_transform
transformers = list(
File "/usr/local/lib/python3.10/site-packages/sklearn/compose/_column_transformer.py", line 349, in _iter
transformers = [
File "/usr/local/lib/python3.10/site-packages/sklearn/compose/_column_transformer.py", line 350, in <listcomp>
replace_passthrough(*trans) for trans in self.transformers_
File "/usr/local/lib/python3.10/site-packages/sklearn/compose/_column_transformer.py", line 345, in replace_passthrough
if name not in self._name_to_fitted_passthrough:
AttributeError: 'ColumnTransformer' object has no attribute '_name_to_fitted_passthrough' [while running 'RunInference all_features/BeamML_RunInference-ptransform-155']
[31m===== [31m[1m2 failed[0m, [32m81 passed[0m, [33m39 skipped[0m, [33m616 warnings[0m[31m in 11737.35s (3:15:37)[0m[31m =====[0m
> Task :sdks:python:test-suites:dataflow:py310:postCommitIT FAILED
FAILURE: Build failed with an exception.
* Where:
Script '<https://ci-beam.apache.org/job/beam_PostCommit_Python310/ws/src/sdks/python/test-suites/dataflow/common.gradle'> line: 111
* What went wrong:
Execution failed for task ':sdks:python:test-suites:dataflow:py310:postCommitIT'.
> Process 'command 'sh'' finished with non-zero exit value 1
* Try:
> Run with --stacktrace option to get the stack trace.
> Run with --info or --debug option to get more log output.
* Get more help at https://help.gradle.org
Deprecated Gradle features were used in this build, making it incompatible with Gradle 8.0.
You can use '--warning-mode all' to show the individual deprecation warnings and determine if they come from your own scripts or plugins.
See https://docs.gradle.org/7.5.1/userguide/command_line_interface.html#sec:command_line_warnings
Execution optimizations have been disabled for 1 invalid unit(s) of work during this build to ensure correctness.
Please consult deprecation warnings for more details.
BUILD FAILED in 3h 17m 34s
207 actionable tasks: 142 executed, 59 from cache, 6 up-to-date
Publishing build scan...
https://gradle.com/s/7lhzm3c46ucac
Build step 'Invoke Gradle script' changed build result to FAILURE
Build step 'Invoke Gradle script' marked build as failure
---------------------------------------------------------------------
To unsubscribe, e-mail: builds-unsubscribe@beam.apache.org
For additional commands, e-mail: builds-help@beam.apache.org
Build failed in Jenkins: beam_PostCommit_Python310 #639
Posted by Apache Jenkins Server <je...@builds.apache.org>.
See <https://ci-beam.apache.org/job/beam_PostCommit_Python310/639/display/redirect?page=changes>
Changes:
[noreply] Bump webpack (#25846)
------------------------------------------
[...truncated 11.77 MB...]
apache_beam/io/gcp/bigquery_test.py: 3 warnings
apache_beam/io/gcp/big_query_query_to_table_it_test.py: 4 warnings
<https://ci-beam.apache.org/job/beam_PostCommit_Python310/ws/src/sdks/python/apache_beam/io/gcp/bigquery_file_loads.py>:1175: BeamDeprecationWarning: options is deprecated since First stable release. References to <pipeline>.options will not be supported
p.options.view_as(GoogleCloudOptions).job_name or 'AUTOMATIC_JOB_NAME')
apache_beam/examples/cookbook/bigquery_tornadoes_it_test.py::BigqueryTornadoesIT::test_bigquery_tornadoes_it
<https://ci-beam.apache.org/job/beam_PostCommit_Python310/ws/src/sdks/python/apache_beam/io/gcp/tests/utils.py>:100: PendingDeprecationWarning: Client.dataset is deprecated and will be removed in a future version. Use a string like 'my_project.my_dataset' or a cloud.google.bigquery.DatasetReference object, instead.
table_ref = client.dataset(dataset_id).table(table_id)
apache_beam/dataframe/io_it_test.py: 2 warnings
apache_beam/io/gcp/bigquery_json_it_test.py: 1 warning
apache_beam/io/gcp/bigquery_read_it_test.py: 9 warnings
<https://ci-beam.apache.org/job/beam_PostCommit_Python310/ws/src/sdks/python/apache_beam/io/gcp/bigquery.py>:2536: BeamDeprecationWarning: options is deprecated since First stable release. References to <pipeline>.options will not be supported
project_id = pcoll.pipeline.options.view_as(GoogleCloudOptions).project
apache_beam/dataframe/io_it_test.py: 2 warnings
apache_beam/io/gcp/bigquery_json_it_test.py: 1 warning
apache_beam/io/gcp/bigquery_read_it_test.py: 9 warnings
<https://ci-beam.apache.org/job/beam_PostCommit_Python310/ws/src/sdks/python/apache_beam/io/gcp/bigquery.py>:2557: BeamDeprecationWarning: options is deprecated since First stable release. References to <pipeline>.options will not be supported
pipeline_options=pcoll.pipeline.options,
apache_beam/examples/dataframe/taxiride_it_test.py::TaxirideIT::test_aggregation
apache_beam/examples/dataframe/flight_delays_it_test.py::FlightDelaysTest::test_flight_delays
apache_beam/examples/dataframe/taxiride_it_test.py::TaxirideIT::test_enrich
<https://ci-beam.apache.org/job/beam_PostCommit_Python310/ws/src/sdks/python/apache_beam/dataframe/io.py>:659: FutureWarning: WriteToFiles is experimental.
return pcoll | fileio.WriteToFiles(
apache_beam/examples/dataframe/taxiride_it_test.py::TaxirideIT::test_aggregation
apache_beam/examples/dataframe/flight_delays_it_test.py::FlightDelaysTest::test_flight_delays
apache_beam/examples/dataframe/taxiride_it_test.py::TaxirideIT::test_enrich
<https://ci-beam.apache.org/job/beam_PostCommit_Python310/ws/src/sdks/python/apache_beam/io/fileio.py>:596: BeamDeprecationWarning: options is deprecated since First stable release. References to <pipeline>.options will not be supported
p.options.view_as(GoogleCloudOptions).temp_location or
apache_beam/examples/dataframe/flight_delays_it_test.py::FlightDelaysTest::test_flight_delays
<https://ci-beam.apache.org/job/beam_PostCommit_Python310/ws/src/sdks/python/apache_beam/examples/dataframe/flight_delays.py>:47: FutureWarning: The default value of numeric_only in DataFrame.mean is deprecated. In a future version, it will default to False. In addition, specifying 'numeric_only=None' is deprecated. Select only valid columns or specify the value of numeric_only to silence this warning.
return airline_df[at_top_airports].mean()
apache_beam/io/gcp/bigquery_test.py::BigQueryStreamingInsertTransformIntegrationTests::test_multiple_destinations_transform
<https://ci-beam.apache.org/job/beam_PostCommit_Python310/ws/src/sdks/python/apache_beam/io/gcp/bigquery_test.py>:1694: BeamDeprecationWarning: options is deprecated since First stable release. References to <pipeline>.options will not be supported
streaming = self.test_pipeline.options.view_as(StandardOptions).streaming
apache_beam/io/gcp/bigquery_read_it_test.py::ReadTests::test_native_source
<https://ci-beam.apache.org/job/beam_PostCommit_Python310/ws/src/sdks/python/apache_beam/io/gcp/bigquery_read_it_test.py>:170: BeamDeprecationWarning: BigQuerySource is deprecated since 2.25.0. Use ReadFromBigQuery instead.
beam.io.BigQuerySource(query=self.query, use_standard_sql=True)))
apache_beam/ml/gcp/cloud_dlp_it_test.py::CloudDLPIT::test_deidentification
<https://ci-beam.apache.org/job/beam_PostCommit_Python310/ws/src/sdks/python/apache_beam/ml/gcp/cloud_dlp_it_test.py>:74: FutureWarning: MaskDetectedDetails is experimental.
| MaskDetectedDetails(
apache_beam/ml/gcp/cloud_dlp_it_test.py::CloudDLPIT::test_inspection
<https://ci-beam.apache.org/job/beam_PostCommit_Python310/ws/src/sdks/python/apache_beam/ml/gcp/cloud_dlp_it_test.py>:85: FutureWarning: InspectForDetails is experimental.
| InspectForDetails(
apache_beam/ml/inference/sklearn_inference_it_test.py::SklearnInference::test_sklearn_regression
<https://ci-beam.apache.org/job/beam_PostCommit_Python310/ws/src/sdks/python/apache_beam/examples/inference/sklearn_japanese_housing_regression.py>:128: FutureWarning: SklearnModelHandlerPandas is experimental. No backwards-compatibility guarantees.
model_loader = SklearnModelHandlerPandas(
apache_beam/ml/inference/sklearn_inference_it_test.py::SklearnInference::test_sklearn_regression
<https://ci-beam.apache.org/job/beam_PostCommit_Python310/ws/src/build/gradleenv/2050596098/lib/python3.10/site-packages/dill/_dill.py>:472: FutureWarning: SklearnModelHandlerPandas is experimental. No backwards-compatibility guarantees.
obj = StockUnpickler.load(self)
apache_beam/io/gcp/bigquery_read_it_test.py::ReadNewTypesTests::test_native_source
<https://ci-beam.apache.org/job/beam_PostCommit_Python310/ws/src/sdks/python/apache_beam/io/gcp/bigquery_read_it_test.py>:693: BeamDeprecationWarning: BigQuerySource is deprecated since 2.25.0. Use ReadFromBigQuery instead.
beam.io.BigQuerySource(query=self.query, use_standard_sql=True)))
apache_beam/io/gcp/bigquery_read_it_test.py::ReadAllBQTests::test_read_queries
<https://ci-beam.apache.org/job/beam_PostCommit_Python310/ws/src/sdks/python/apache_beam/io/gcp/bigquery_read_it_test.py>:808: FutureWarning: ReadAllFromBigQuery is experimental.
| beam.io.ReadAllFromBigQuery())
apache_beam/io/gcp/bigquery_read_it_test.py::ReadAllBQTests::test_read_queries
<https://ci-beam.apache.org/job/beam_PostCommit_Python310/ws/src/sdks/python/apache_beam/io/gcp/bigquery.py>:2665: BeamDeprecationWarning: options is deprecated since First stable release. References to <pipeline>.options will not be supported
job_name = pcoll.pipeline.options.view_as(GoogleCloudOptions).job_name
apache_beam/io/gcp/bigquery_read_it_test.py::ReadAllBQTests::test_read_queries
<https://ci-beam.apache.org/job/beam_PostCommit_Python310/ws/src/sdks/python/apache_beam/io/gcp/bigquery.py>:2666: BeamDeprecationWarning: options is deprecated since First stable release. References to <pipeline>.options will not be supported
project = pcoll.pipeline.options.view_as(GoogleCloudOptions).project
apache_beam/io/gcp/bigquery_read_it_test.py::ReadAllBQTests::test_read_queries
<https://ci-beam.apache.org/job/beam_PostCommit_Python310/ws/src/sdks/python/apache_beam/io/gcp/bigquery.py>:2679: BeamDeprecationWarning: options is deprecated since First stable release. References to <pipeline>.options will not be supported
options=pcoll.pipeline.options,
-- Docs: https://docs.pytest.org/en/stable/how-to/capture-warnings.html
- generated xml file: <https://ci-beam.apache.org/job/beam_PostCommit_Python310/ws/src/sdks/python/pytest_postCommitIT-df-py310.xml> -
[36m[1m=========================== short test summary info ============================[0m
[31mFAILED[0m apache_beam/ml/inference/sklearn_inference_it_test.py::[1mSklearnInference::test_sklearn_regression[0m - apache_beam.runners.dataflow.dataflow_runner.DataflowRuntimeException: Dataflow pipeline failed. State: FAILED, Error:
Traceback (most recent call last):
File "apache_beam/runners/common.py", line 1418, in apache_beam.runners.common.DoFnRunner.process
File "apache_beam/runners/common.py", line 838, in apache_beam.runners.common.PerWindowInvoker.invoke_process
File "apache_beam/runners/common.py", line 984, in apache_beam.runners.common.PerWindowInvoker._invoke_process_per_window
File "/usr/local/lib/python3.10/site-packages/apache_beam/ml/inference/base.py", line 552, in process
return self._run_inference(batch, inference_args)
File "/usr/local/lib/python3.10/site-packages/apache_beam/ml/inference/base.py", line 521, in _run_inference
raise e
File "/usr/local/lib/python3.10/site-packages/apache_beam/ml/inference/base.py", line 517, in _run_inference
result_generator = self._model_handler.run_inference(
File "/usr/local/lib/python3.10/site-packages/apache_beam/ml/inference/sklearn_inference.py", line 268, in run_inference
predictions, splits = self._model_inference_fn(model, batch, inference_args)
File "/usr/local/lib/python3.10/site-packages/apache_beam/ml/inference/sklearn_inference.py", line 185, in _default_pandas_inference_fn
predictions = model.predict(vectorized_batch)
File "/usr/local/lib/python3.10/site-packages/sklearn/pipeline.py", line 480, in predict
Xt = transform.transform(Xt)
File "/usr/local/lib/python3.10/site-packages/sklearn/utils/_set_output.py", line 140, in wrapped
data_to_wrap = f(self, X, *args, **kwargs)
File "/usr/local/lib/python3.10/site-packages/sklearn/compose/_column_transformer.py", line 800, in transform
Xs = self._fit_transform(
File "/usr/local/lib/python3.10/site-packages/sklearn/compose/_column_transformer.py", line 652, in _fit_transform
transformers = list(
File "/usr/local/lib/python3.10/site-packages/sklearn/compose/_column_transformer.py", line 349, in _iter
transformers = [
File "/usr/local/lib/python3.10/site-packages/sklearn/compose/_column_transformer.py", line 350, in <listcomp>
replace_passthrough(*trans) for trans in self.transformers_
File "/usr/local/lib/python3.10/site-packages/sklearn/compose/_column_transformer.py", line 345, in replace_passthrough
if name not in self._name_to_fitted_passthrough:
AttributeError: 'ColumnTransformer' object has no attribute '_name_to_fitted_passthrough'
During handling of the above exception, another exception occurred:
Traceback (most recent call last):
File "/usr/local/lib/python3.10/site-packages/apache_beam/runners/worker/sdk_worker.py", line 295, in _execute
response = task()
File "/usr/local/lib/python3.10/site-packages/apache_beam/runners/worker/sdk_worker.py", line 370, in <lambda>
lambda: self.create_worker().do_instruction(request), request)
File "/usr/local/lib/python3.10/site-packages/apache_beam/runners/worker/sdk_worker.py", line 629, in do_instruction
return getattr(self, request_type)(
File "/usr/local/lib/python3.10/site-packages/apache_beam/runners/worker/sdk_worker.py", line 667, in process_bundle
bundle_processor.process_bundle(instruction_id))
File "/usr/local/lib/python3.10/site-packages/apache_beam/runners/worker/bundle_processor.py", line 1062, in process_bundle
input_op_by_transform_id[element.transform_id].process_encoded(
File "/usr/local/lib/python3.10/site-packages/apache_beam/runners/worker/bundle_processor.py", line 232, in process_encoded
self.output(decoded_value)
File "apache_beam/runners/worker/operations.py", line 526, in apache_beam.runners.worker.operations.Operation.output
File "apache_beam/runners/worker/operations.py", line 528, in apache_beam.runners.worker.operations.Operation.output
File "apache_beam/runners/worker/operations.py", line 237, in apache_beam.runners.worker.operations.SingletonElementConsumerSet.receive
File "apache_beam/runners/worker/operations.py", line 240, in apache_beam.runners.worker.operations.SingletonElementConsumerSet.receive
File "apache_beam/runners/worker/operations.py", line 907, in apache_beam.runners.worker.operations.DoOperation.process
File "apache_beam/runners/worker/operations.py", line 908, in apache_beam.runners.worker.operations.DoOperation.process
File "apache_beam/runners/common.py", line 1420, in apache_beam.runners.common.DoFnRunner.process
File "apache_beam/runners/common.py", line 1492, in apache_beam.runners.common.DoFnRunner._reraise_augmented
File "apache_beam/runners/common.py", line 1418, in apache_beam.runners.common.DoFnRunner.process
File "apache_beam/runners/common.py", line 624, in apache_beam.runners.common.SimpleInvoker.invoke_process
File "apache_beam/runners/common.py", line 1582, in apache_beam.runners.common._OutputHandler.handle_process_outputs
File "apache_beam/runners/common.py", line 1695, in apache_beam.runners.common._OutputHandler._write_value_to_tag
File "apache_beam/runners/worker/operations.py", line 240, in apache_beam.runners.worker.operations.SingletonElementConsumerSet.receive
File "apache_beam/runners/worker/operations.py", line 907, in apache_beam.runners.worker.operations.DoOperation.process
File "apache_beam/runners/worker/operations.py", line 908, in apache_beam.runners.worker.operations.DoOperation.process
File "apache_beam/runners/common.py", line 1420, in apache_beam.runners.common.DoFnRunner.process
File "apache_beam/runners/common.py", line 1492, in apache_beam.runners.common.DoFnRunner._reraise_augmented
File "apache_beam/runners/common.py", line 1418, in apache_beam.runners.common.DoFnRunner.process
File "apache_beam/runners/common.py", line 624, in apache_beam.runners.common.SimpleInvoker.invoke_process
File "apache_beam/runners/common.py", line 1582, in apache_beam.runners.common._OutputHandler.handle_process_outputs
File "apache_beam/runners/common.py", line 1695, in apache_beam.runners.common._OutputHandler._write_value_to_tag
File "apache_beam/runners/worker/operations.py", line 240, in apache_beam.runners.worker.operations.SingletonElementConsumerSet.receive
File "apache_beam/runners/worker/operations.py", line 907, in apache_beam.runners.worker.operations.DoOperation.process
File "apache_beam/runners/worker/operations.py", line 908, in apache_beam.runners.worker.operations.DoOperation.process
File "apache_beam/runners/common.py", line 1420, in apache_beam.runners.common.DoFnRunner.process
File "apache_beam/runners/common.py", line 1492, in apache_beam.runners.common.DoFnRunner._reraise_augmented
File "apache_beam/runners/common.py", line 1418, in apache_beam.runners.common.DoFnRunner.process
File "apache_beam/runners/common.py", line 624, in apache_beam.runners.common.SimpleInvoker.invoke_process
File "apache_beam/runners/common.py", line 1582, in apache_beam.runners.common._OutputHandler.handle_process_outputs
File "apache_beam/runners/common.py", line 1695, in apache_beam.runners.common._OutputHandler._write_value_to_tag
File "apache_beam/runners/worker/operations.py", line 240, in apache_beam.runners.worker.operations.SingletonElementConsumerSet.receive
File "apache_beam/runners/worker/operations.py", line 907, in apache_beam.runners.worker.operations.DoOperation.process
File "apache_beam/runners/worker/operations.py", line 908, in apache_beam.runners.worker.operations.DoOperation.process
File "apache_beam/runners/common.py", line 1420, in apache_beam.runners.common.DoFnRunner.process
File "apache_beam/runners/common.py", line 1492, in apache_beam.runners.common.DoFnRunner._reraise_augmented
File "apache_beam/runners/common.py", line 1418, in apache_beam.runners.common.DoFnRunner.process
File "apache_beam/runners/common.py", line 838, in apache_beam.runners.common.PerWindowInvoker.invoke_process
File "apache_beam/runners/common.py", line 982, in apache_beam.runners.common.PerWindowInvoker._invoke_process_per_window
File "apache_beam/runners/common.py", line 1582, in apache_beam.runners.common._OutputHandler.handle_process_outputs
File "apache_beam/runners/common.py", line 1697, in apache_beam.runners.common._OutputHandler._write_value_to_tag
File "apache_beam/runners/worker/operations.py", line 237, in apache_beam.runners.worker.operations.SingletonElementConsumerSet.receive
File "apache_beam/runners/worker/operations.py", line 240, in apache_beam.runners.worker.operations.SingletonElementConsumerSet.receive
File "apache_beam/runners/worker/operations.py", line 907, in apache_beam.runners.worker.operations.DoOperation.process
File "apache_beam/runners/worker/operations.py", line 908, in apache_beam.runners.worker.operations.DoOperation.process
File "apache_beam/runners/common.py", line 1420, in apache_beam.runners.common.DoFnRunner.process
File "apache_beam/runners/common.py", line 1492, in apache_beam.runners.common.DoFnRunner._reraise_augmented
File "apache_beam/runners/common.py", line 1418, in apache_beam.runners.common.DoFnRunner.process
File "apache_beam/runners/common.py", line 624, in apache_beam.runners.common.SimpleInvoker.invoke_process
File "apache_beam/runners/common.py", line 1582, in apache_beam.runners.common._OutputHandler.handle_process_outputs
File "apache_beam/runners/common.py", line 1695, in apache_beam.runners.common._OutputHandler._write_value_to_tag
File "apache_beam/runners/worker/operations.py", line 240, in apache_beam.runners.worker.operations.SingletonElementConsumerSet.receive
File "apache_beam/runners/worker/operations.py", line 907, in apache_beam.runners.worker.operations.DoOperation.process
File "apache_beam/runners/worker/operations.py", line 908, in apache_beam.runners.worker.operations.DoOperation.process
File "apache_beam/runners/common.py", line 1420, in apache_beam.runners.common.DoFnRunner.process
File "apache_beam/runners/common.py", line 1508, in apache_beam.runners.common.DoFnRunner._reraise_augmented
File "apache_beam/runners/common.py", line 1418, in apache_beam.runners.common.DoFnRunner.process
File "apache_beam/runners/common.py", line 838, in apache_beam.runners.common.PerWindowInvoker.invoke_process
File "apache_beam/runners/common.py", line 984, in apache_beam.runners.common.PerWindowInvoker._invoke_process_per_window
File "/usr/local/lib/python3.10/site-packages/apache_beam/ml/inference/base.py", line 552, in process
return self._run_inference(batch, inference_args)
File "/usr/local/lib/python3.10/site-packages/apache_beam/ml/inference/base.py", line 521, in _run_inference
raise e
File "/usr/local/lib/python3.10/site-packages/apache_beam/ml/inference/base.py", line 517, in _run_inference
result_generator = self._model_handler.run_inference(
File "/usr/local/lib/python3.10/site-packages/apache_beam/ml/inference/sklearn_inference.py", line 268, in run_inference
predictions, splits = self._model_inference_fn(model, batch, inference_args)
File "/usr/local/lib/python3.10/site-packages/apache_beam/ml/inference/sklearn_inference.py", line 185, in _default_pandas_inference_fn
predictions = model.predict(vectorized_batch)
File "/usr/local/lib/python3.10/site-packages/sklearn/pipeline.py", line 480, in predict
Xt = transform.transform(Xt)
File "/usr/local/lib/python3.10/site-packages/sklearn/utils/_set_output.py", line 140, in wrapped
data_to_wrap = f(self, X, *args, **kwargs)
File "/usr/local/lib/python3.10/site-packages/sklearn/compose/_column_transformer.py", line 800, in transform
Xs = self._fit_transform(
File "/usr/local/lib/python3.10/site-packages/sklearn/compose/_column_transformer.py", line 652, in _fit_transform
transformers = list(
File "/usr/local/lib/python3.10/site-packages/sklearn/compose/_column_transformer.py", line 349, in _iter
transformers = [
File "/usr/local/lib/python3.10/site-packages/sklearn/compose/_column_transformer.py", line 350, in <listcomp>
replace_passthrough(*trans) for trans in self.transformers_
File "/usr/local/lib/python3.10/site-packages/sklearn/compose/_column_transformer.py", line 345, in replace_passthrough
if name not in self._name_to_fitted_passthrough:
AttributeError: 'ColumnTransformer' object has no attribute '_name_to_fitted_passthrough' [while running 'RunInference all_features/BeamML_RunInference-ptransform-150']
[31m===== [31m[1m1 failed[0m, [32m82 passed[0m, [33m39 skipped[0m, [33m616 warnings[0m[31m in 11009.60s (3:03:29)[0m[31m =====[0m
> Task :sdks:python:test-suites:dataflow:py310:postCommitIT FAILED
FAILURE: Build failed with an exception.
* Where:
Script '<https://ci-beam.apache.org/job/beam_PostCommit_Python310/ws/src/sdks/python/test-suites/dataflow/common.gradle'> line: 111
* What went wrong:
Execution failed for task ':sdks:python:test-suites:dataflow:py310:postCommitIT'.
> Process 'command 'sh'' finished with non-zero exit value 1
* Try:
> Run with --stacktrace option to get the stack trace.
> Run with --info or --debug option to get more log output.
* Get more help at https://help.gradle.org
Deprecated Gradle features were used in this build, making it incompatible with Gradle 8.0.
You can use '--warning-mode all' to show the individual deprecation warnings and determine if they come from your own scripts or plugins.
See https://docs.gradle.org/7.5.1/userguide/command_line_interface.html#sec:command_line_warnings
Execution optimizations have been disabled for 1 invalid unit(s) of work during this build to ensure correctness.
Please consult deprecation warnings for more details.
BUILD FAILED in 3h 6m 5s
207 actionable tasks: 142 executed, 59 from cache, 6 up-to-date
Publishing build scan...
https://gradle.com/s/2kpbiinlxxsya
Build step 'Invoke Gradle script' changed build result to FAILURE
Build step 'Invoke Gradle script' marked build as failure
---------------------------------------------------------------------
To unsubscribe, e-mail: builds-unsubscribe@beam.apache.org
For additional commands, e-mail: builds-help@beam.apache.org
Build failed in Jenkins: beam_PostCommit_Python310 #638
Posted by Apache Jenkins Server <je...@builds.apache.org>.
See <https://ci-beam.apache.org/job/beam_PostCommit_Python310/638/display/redirect>
Changes:
------------------------------------------
[...truncated 11.83 MB...]
apache_beam/examples/complete/game/hourly_team_score_it_test.py: 1 warning
apache_beam/io/gcp/big_query_query_to_table_it_test.py: 4 warnings
apache_beam/io/gcp/bigquery_write_it_test.py: 3 warnings
apache_beam/io/gcp/bigquery_test.py: 3 warnings
apache_beam/io/gcp/bigquery_file_loads_test.py: 3 warnings
<https://ci-beam.apache.org/job/beam_PostCommit_Python310/ws/src/sdks/python/apache_beam/io/gcp/bigquery_file_loads.py>:1173: BeamDeprecationWarning: options is deprecated since First stable release. References to <pipeline>.options will not be supported
temp_location = p.options.view_as(GoogleCloudOptions).temp_location
apache_beam/examples/cookbook/bigquery_tornadoes_it_test.py: 1 warning
apache_beam/examples/complete/game/hourly_team_score_it_test.py: 1 warning
apache_beam/io/gcp/big_query_query_to_table_it_test.py: 4 warnings
apache_beam/io/gcp/bigquery_write_it_test.py: 3 warnings
apache_beam/io/gcp/bigquery_test.py: 3 warnings
apache_beam/io/gcp/bigquery_file_loads_test.py: 3 warnings
<https://ci-beam.apache.org/job/beam_PostCommit_Python310/ws/src/sdks/python/apache_beam/io/gcp/bigquery_file_loads.py>:1175: BeamDeprecationWarning: options is deprecated since First stable release. References to <pipeline>.options will not be supported
p.options.view_as(GoogleCloudOptions).job_name or 'AUTOMATIC_JOB_NAME')
apache_beam/examples/cookbook/bigquery_tornadoes_it_test.py::BigqueryTornadoesIT::test_bigquery_tornadoes_it
<https://ci-beam.apache.org/job/beam_PostCommit_Python310/ws/src/sdks/python/apache_beam/io/gcp/tests/utils.py>:100: PendingDeprecationWarning: Client.dataset is deprecated and will be removed in a future version. Use a string like 'my_project.my_dataset' or a cloud.google.bigquery.DatasetReference object, instead.
table_ref = client.dataset(dataset_id).table(table_id)
apache_beam/examples/dataframe/flight_delays_it_test.py::FlightDelaysTest::test_flight_delays
<https://ci-beam.apache.org/job/beam_PostCommit_Python310/ws/src/sdks/python/apache_beam/examples/dataframe/flight_delays.py>:47: FutureWarning: The default value of numeric_only in DataFrame.mean is deprecated. In a future version, it will default to False. In addition, specifying 'numeric_only=None' is deprecated. Select only valid columns or specify the value of numeric_only to silence this warning.
return airline_df[at_top_airports].mean()
apache_beam/examples/dataframe/flight_delays_it_test.py::FlightDelaysTest::test_flight_delays
apache_beam/examples/dataframe/taxiride_it_test.py::TaxirideIT::test_aggregation
apache_beam/examples/dataframe/taxiride_it_test.py::TaxirideIT::test_enrich
<https://ci-beam.apache.org/job/beam_PostCommit_Python310/ws/src/sdks/python/apache_beam/dataframe/io.py>:659: FutureWarning: WriteToFiles is experimental.
return pcoll | fileio.WriteToFiles(
apache_beam/examples/dataframe/flight_delays_it_test.py::FlightDelaysTest::test_flight_delays
apache_beam/examples/dataframe/taxiride_it_test.py::TaxirideIT::test_aggregation
apache_beam/examples/dataframe/taxiride_it_test.py::TaxirideIT::test_enrich
<https://ci-beam.apache.org/job/beam_PostCommit_Python310/ws/src/sdks/python/apache_beam/io/fileio.py>:596: BeamDeprecationWarning: options is deprecated since First stable release. References to <pipeline>.options will not be supported
p.options.view_as(GoogleCloudOptions).temp_location or
apache_beam/io/gcp/bigquery_test.py::BigQueryStreamingInsertTransformIntegrationTests::test_multiple_destinations_transform
<https://ci-beam.apache.org/job/beam_PostCommit_Python310/ws/src/sdks/python/apache_beam/io/gcp/bigquery_test.py>:1694: BeamDeprecationWarning: options is deprecated since First stable release. References to <pipeline>.options will not be supported
streaming = self.test_pipeline.options.view_as(StandardOptions).streaming
apache_beam/io/gcp/bigquery_read_it_test.py::ReadTests::test_native_source
<https://ci-beam.apache.org/job/beam_PostCommit_Python310/ws/src/sdks/python/apache_beam/io/gcp/bigquery_read_it_test.py>:170: BeamDeprecationWarning: BigQuerySource is deprecated since 2.25.0. Use ReadFromBigQuery instead.
beam.io.BigQuerySource(query=self.query, use_standard_sql=True)))
apache_beam/ml/gcp/cloud_dlp_it_test.py::CloudDLPIT::test_deidentification
<https://ci-beam.apache.org/job/beam_PostCommit_Python310/ws/src/sdks/python/apache_beam/ml/gcp/cloud_dlp_it_test.py>:74: FutureWarning: MaskDetectedDetails is experimental.
| MaskDetectedDetails(
apache_beam/ml/inference/sklearn_inference_it_test.py::SklearnInference::test_sklearn_regression
<https://ci-beam.apache.org/job/beam_PostCommit_Python310/ws/src/sdks/python/apache_beam/examples/inference/sklearn_japanese_housing_regression.py>:128: FutureWarning: SklearnModelHandlerPandas is experimental. No backwards-compatibility guarantees.
model_loader = SklearnModelHandlerPandas(
apache_beam/ml/inference/sklearn_inference_it_test.py::SklearnInference::test_sklearn_regression
<https://ci-beam.apache.org/job/beam_PostCommit_Python310/ws/src/build/gradleenv/2050596098/lib/python3.10/site-packages/dill/_dill.py>:472: FutureWarning: SklearnModelHandlerPandas is experimental. No backwards-compatibility guarantees.
obj = StockUnpickler.load(self)
apache_beam/ml/gcp/cloud_dlp_it_test.py::CloudDLPIT::test_inspection
<https://ci-beam.apache.org/job/beam_PostCommit_Python310/ws/src/sdks/python/apache_beam/ml/gcp/cloud_dlp_it_test.py>:85: FutureWarning: InspectForDetails is experimental.
| InspectForDetails(
apache_beam/io/gcp/bigquery_read_it_test.py::ReadNewTypesTests::test_native_source
<https://ci-beam.apache.org/job/beam_PostCommit_Python310/ws/src/sdks/python/apache_beam/io/gcp/bigquery_read_it_test.py>:693: BeamDeprecationWarning: BigQuerySource is deprecated since 2.25.0. Use ReadFromBigQuery instead.
beam.io.BigQuerySource(query=self.query, use_standard_sql=True)))
apache_beam/io/gcp/bigquery_read_it_test.py::ReadAllBQTests::test_read_queries
<https://ci-beam.apache.org/job/beam_PostCommit_Python310/ws/src/sdks/python/apache_beam/io/gcp/bigquery_read_it_test.py>:808: FutureWarning: ReadAllFromBigQuery is experimental.
| beam.io.ReadAllFromBigQuery())
apache_beam/io/gcp/bigquery_read_it_test.py::ReadAllBQTests::test_read_queries
<https://ci-beam.apache.org/job/beam_PostCommit_Python310/ws/src/sdks/python/apache_beam/io/gcp/bigquery.py>:2665: BeamDeprecationWarning: options is deprecated since First stable release. References to <pipeline>.options will not be supported
job_name = pcoll.pipeline.options.view_as(GoogleCloudOptions).job_name
apache_beam/io/gcp/bigquery_read_it_test.py::ReadAllBQTests::test_read_queries
<https://ci-beam.apache.org/job/beam_PostCommit_Python310/ws/src/sdks/python/apache_beam/io/gcp/bigquery.py>:2666: BeamDeprecationWarning: options is deprecated since First stable release. References to <pipeline>.options will not be supported
project = pcoll.pipeline.options.view_as(GoogleCloudOptions).project
apache_beam/io/gcp/bigquery_read_it_test.py::ReadAllBQTests::test_read_queries
<https://ci-beam.apache.org/job/beam_PostCommit_Python310/ws/src/sdks/python/apache_beam/io/gcp/bigquery.py>:2679: BeamDeprecationWarning: options is deprecated since First stable release. References to <pipeline>.options will not be supported
options=pcoll.pipeline.options,
-- Docs: https://docs.pytest.org/en/stable/how-to/capture-warnings.html
- generated xml file: <https://ci-beam.apache.org/job/beam_PostCommit_Python310/ws/src/sdks/python/pytest_postCommitIT-df-py310.xml> -
[36m[1m=========================== short test summary info ============================[0m
[31mFAILED[0m apache_beam/ml/inference/sklearn_inference_it_test.py::[1mSklearnInference::test_sklearn_regression[0m - apache_beam.runners.dataflow.dataflow_runner.DataflowRuntimeException: Dataflow pipeline failed. State: FAILED, Error:
Traceback (most recent call last):
File "apache_beam/runners/common.py", line 1418, in apache_beam.runners.common.DoFnRunner.process
File "apache_beam/runners/common.py", line 838, in apache_beam.runners.common.PerWindowInvoker.invoke_process
File "apache_beam/runners/common.py", line 984, in apache_beam.runners.common.PerWindowInvoker._invoke_process_per_window
File "/usr/local/lib/python3.10/site-packages/apache_beam/ml/inference/base.py", line 552, in process
return self._run_inference(batch, inference_args)
File "/usr/local/lib/python3.10/site-packages/apache_beam/ml/inference/base.py", line 521, in _run_inference
raise e
File "/usr/local/lib/python3.10/site-packages/apache_beam/ml/inference/base.py", line 517, in _run_inference
result_generator = self._model_handler.run_inference(
File "/usr/local/lib/python3.10/site-packages/apache_beam/ml/inference/sklearn_inference.py", line 268, in run_inference
predictions, splits = self._model_inference_fn(model, batch, inference_args)
File "/usr/local/lib/python3.10/site-packages/apache_beam/ml/inference/sklearn_inference.py", line 185, in _default_pandas_inference_fn
predictions = model.predict(vectorized_batch)
File "/usr/local/lib/python3.10/site-packages/sklearn/pipeline.py", line 480, in predict
Xt = transform.transform(Xt)
File "/usr/local/lib/python3.10/site-packages/sklearn/utils/_set_output.py", line 140, in wrapped
data_to_wrap = f(self, X, *args, **kwargs)
File "/usr/local/lib/python3.10/site-packages/sklearn/compose/_column_transformer.py", line 800, in transform
Xs = self._fit_transform(
File "/usr/local/lib/python3.10/site-packages/sklearn/compose/_column_transformer.py", line 652, in _fit_transform
transformers = list(
File "/usr/local/lib/python3.10/site-packages/sklearn/compose/_column_transformer.py", line 349, in _iter
transformers = [
File "/usr/local/lib/python3.10/site-packages/sklearn/compose/_column_transformer.py", line 350, in <listcomp>
replace_passthrough(*trans) for trans in self.transformers_
File "/usr/local/lib/python3.10/site-packages/sklearn/compose/_column_transformer.py", line 345, in replace_passthrough
if name not in self._name_to_fitted_passthrough:
AttributeError: 'ColumnTransformer' object has no attribute '_name_to_fitted_passthrough'
During handling of the above exception, another exception occurred:
Traceback (most recent call last):
File "/usr/local/lib/python3.10/site-packages/apache_beam/runners/worker/sdk_worker.py", line 295, in _execute
response = task()
File "/usr/local/lib/python3.10/site-packages/apache_beam/runners/worker/sdk_worker.py", line 370, in <lambda>
lambda: self.create_worker().do_instruction(request), request)
File "/usr/local/lib/python3.10/site-packages/apache_beam/runners/worker/sdk_worker.py", line 629, in do_instruction
return getattr(self, request_type)(
File "/usr/local/lib/python3.10/site-packages/apache_beam/runners/worker/sdk_worker.py", line 667, in process_bundle
bundle_processor.process_bundle(instruction_id))
File "/usr/local/lib/python3.10/site-packages/apache_beam/runners/worker/bundle_processor.py", line 1062, in process_bundle
input_op_by_transform_id[element.transform_id].process_encoded(
File "/usr/local/lib/python3.10/site-packages/apache_beam/runners/worker/bundle_processor.py", line 232, in process_encoded
self.output(decoded_value)
File "apache_beam/runners/worker/operations.py", line 526, in apache_beam.runners.worker.operations.Operation.output
File "apache_beam/runners/worker/operations.py", line 528, in apache_beam.runners.worker.operations.Operation.output
File "apache_beam/runners/worker/operations.py", line 237, in apache_beam.runners.worker.operations.SingletonElementConsumerSet.receive
File "apache_beam/runners/worker/operations.py", line 240, in apache_beam.runners.worker.operations.SingletonElementConsumerSet.receive
File "apache_beam/runners/worker/operations.py", line 907, in apache_beam.runners.worker.operations.DoOperation.process
File "apache_beam/runners/worker/operations.py", line 908, in apache_beam.runners.worker.operations.DoOperation.process
File "apache_beam/runners/common.py", line 1420, in apache_beam.runners.common.DoFnRunner.process
File "apache_beam/runners/common.py", line 1492, in apache_beam.runners.common.DoFnRunner._reraise_augmented
File "apache_beam/runners/common.py", line 1418, in apache_beam.runners.common.DoFnRunner.process
File "apache_beam/runners/common.py", line 624, in apache_beam.runners.common.SimpleInvoker.invoke_process
File "apache_beam/runners/common.py", line 1582, in apache_beam.runners.common._OutputHandler.handle_process_outputs
File "apache_beam/runners/common.py", line 1695, in apache_beam.runners.common._OutputHandler._write_value_to_tag
File "apache_beam/runners/worker/operations.py", line 240, in apache_beam.runners.worker.operations.SingletonElementConsumerSet.receive
File "apache_beam/runners/worker/operations.py", line 907, in apache_beam.runners.worker.operations.DoOperation.process
File "apache_beam/runners/worker/operations.py", line 908, in apache_beam.runners.worker.operations.DoOperation.process
File "apache_beam/runners/common.py", line 1420, in apache_beam.runners.common.DoFnRunner.process
File "apache_beam/runners/common.py", line 1492, in apache_beam.runners.common.DoFnRunner._reraise_augmented
File "apache_beam/runners/common.py", line 1418, in apache_beam.runners.common.DoFnRunner.process
File "apache_beam/runners/common.py", line 624, in apache_beam.runners.common.SimpleInvoker.invoke_process
File "apache_beam/runners/common.py", line 1582, in apache_beam.runners.common._OutputHandler.handle_process_outputs
File "apache_beam/runners/common.py", line 1695, in apache_beam.runners.common._OutputHandler._write_value_to_tag
File "apache_beam/runners/worker/operations.py", line 240, in apache_beam.runners.worker.operations.SingletonElementConsumerSet.receive
File "apache_beam/runners/worker/operations.py", line 907, in apache_beam.runners.worker.operations.DoOperation.process
File "apache_beam/runners/worker/operations.py", line 908, in apache_beam.runners.worker.operations.DoOperation.process
File "apache_beam/runners/common.py", line 1420, in apache_beam.runners.common.DoFnRunner.process
File "apache_beam/runners/common.py", line 1492, in apache_beam.runners.common.DoFnRunner._reraise_augmented
File "apache_beam/runners/common.py", line 1418, in apache_beam.runners.common.DoFnRunner.process
File "apache_beam/runners/common.py", line 624, in apache_beam.runners.common.SimpleInvoker.invoke_process
File "apache_beam/runners/common.py", line 1582, in apache_beam.runners.common._OutputHandler.handle_process_outputs
File "apache_beam/runners/common.py", line 1695, in apache_beam.runners.common._OutputHandler._write_value_to_tag
File "apache_beam/runners/worker/operations.py", line 240, in apache_beam.runners.worker.operations.SingletonElementConsumerSet.receive
File "apache_beam/runners/worker/operations.py", line 907, in apache_beam.runners.worker.operations.DoOperation.process
File "apache_beam/runners/worker/operations.py", line 908, in apache_beam.runners.worker.operations.DoOperation.process
File "apache_beam/runners/common.py", line 1420, in apache_beam.runners.common.DoFnRunner.process
File "apache_beam/runners/common.py", line 1492, in apache_beam.runners.common.DoFnRunner._reraise_augmented
File "apache_beam/runners/common.py", line 1418, in apache_beam.runners.common.DoFnRunner.process
File "apache_beam/runners/common.py", line 838, in apache_beam.runners.common.PerWindowInvoker.invoke_process
File "apache_beam/runners/common.py", line 982, in apache_beam.runners.common.PerWindowInvoker._invoke_process_per_window
File "apache_beam/runners/common.py", line 1582, in apache_beam.runners.common._OutputHandler.handle_process_outputs
File "apache_beam/runners/common.py", line 1697, in apache_beam.runners.common._OutputHandler._write_value_to_tag
File "apache_beam/runners/worker/operations.py", line 237, in apache_beam.runners.worker.operations.SingletonElementConsumerSet.receive
File "apache_beam/runners/worker/operations.py", line 240, in apache_beam.runners.worker.operations.SingletonElementConsumerSet.receive
File "apache_beam/runners/worker/operations.py", line 907, in apache_beam.runners.worker.operations.DoOperation.process
File "apache_beam/runners/worker/operations.py", line 908, in apache_beam.runners.worker.operations.DoOperation.process
File "apache_beam/runners/common.py", line 1420, in apache_beam.runners.common.DoFnRunner.process
File "apache_beam/runners/common.py", line 1492, in apache_beam.runners.common.DoFnRunner._reraise_augmented
File "apache_beam/runners/common.py", line 1418, in apache_beam.runners.common.DoFnRunner.process
File "apache_beam/runners/common.py", line 624, in apache_beam.runners.common.SimpleInvoker.invoke_process
File "apache_beam/runners/common.py", line 1582, in apache_beam.runners.common._OutputHandler.handle_process_outputs
File "apache_beam/runners/common.py", line 1695, in apache_beam.runners.common._OutputHandler._write_value_to_tag
File "apache_beam/runners/worker/operations.py", line 240, in apache_beam.runners.worker.operations.SingletonElementConsumerSet.receive
File "apache_beam/runners/worker/operations.py", line 907, in apache_beam.runners.worker.operations.DoOperation.process
File "apache_beam/runners/worker/operations.py", line 908, in apache_beam.runners.worker.operations.DoOperation.process
File "apache_beam/runners/common.py", line 1420, in apache_beam.runners.common.DoFnRunner.process
File "apache_beam/runners/common.py", line 1508, in apache_beam.runners.common.DoFnRunner._reraise_augmented
File "apache_beam/runners/common.py", line 1418, in apache_beam.runners.common.DoFnRunner.process
File "apache_beam/runners/common.py", line 838, in apache_beam.runners.common.PerWindowInvoker.invoke_process
File "apache_beam/runners/common.py", line 984, in apache_beam.runners.common.PerWindowInvoker._invoke_process_per_window
File "/usr/local/lib/python3.10/site-packages/apache_beam/ml/inference/base.py", line 552, in process
return self._run_inference(batch, inference_args)
File "/usr/local/lib/python3.10/site-packages/apache_beam/ml/inference/base.py", line 521, in _run_inference
raise e
File "/usr/local/lib/python3.10/site-packages/apache_beam/ml/inference/base.py", line 517, in _run_inference
result_generator = self._model_handler.run_inference(
File "/usr/local/lib/python3.10/site-packages/apache_beam/ml/inference/sklearn_inference.py", line 268, in run_inference
predictions, splits = self._model_inference_fn(model, batch, inference_args)
File "/usr/local/lib/python3.10/site-packages/apache_beam/ml/inference/sklearn_inference.py", line 185, in _default_pandas_inference_fn
predictions = model.predict(vectorized_batch)
File "/usr/local/lib/python3.10/site-packages/sklearn/pipeline.py", line 480, in predict
Xt = transform.transform(Xt)
File "/usr/local/lib/python3.10/site-packages/sklearn/utils/_set_output.py", line 140, in wrapped
data_to_wrap = f(self, X, *args, **kwargs)
File "/usr/local/lib/python3.10/site-packages/sklearn/compose/_column_transformer.py", line 800, in transform
Xs = self._fit_transform(
File "/usr/local/lib/python3.10/site-packages/sklearn/compose/_column_transformer.py", line 652, in _fit_transform
transformers = list(
File "/usr/local/lib/python3.10/site-packages/sklearn/compose/_column_transformer.py", line 349, in _iter
transformers = [
File "/usr/local/lib/python3.10/site-packages/sklearn/compose/_column_transformer.py", line 350, in <listcomp>
replace_passthrough(*trans) for trans in self.transformers_
File "/usr/local/lib/python3.10/site-packages/sklearn/compose/_column_transformer.py", line 345, in replace_passthrough
if name not in self._name_to_fitted_passthrough:
AttributeError: 'ColumnTransformer' object has no attribute '_name_to_fitted_passthrough' [while running 'RunInference all_features/BeamML_RunInference-ptransform-150']
[31m===== [31m[1m1 failed[0m, [32m82 passed[0m, [33m39 skipped[0m, [33m616 warnings[0m[31m in 11330.73s (3:08:50)[0m[31m =====[0m
> Task :sdks:python:test-suites:dataflow:py310:postCommitIT FAILED
FAILURE: Build failed with an exception.
* Where:
Script '<https://ci-beam.apache.org/job/beam_PostCommit_Python310/ws/src/sdks/python/test-suites/dataflow/common.gradle'> line: 111
* What went wrong:
Execution failed for task ':sdks:python:test-suites:dataflow:py310:postCommitIT'.
> Process 'command 'sh'' finished with non-zero exit value 1
* Try:
> Run with --stacktrace option to get the stack trace.
> Run with --info or --debug option to get more log output.
* Get more help at https://help.gradle.org
Deprecated Gradle features were used in this build, making it incompatible with Gradle 8.0.
You can use '--warning-mode all' to show the individual deprecation warnings and determine if they come from your own scripts or plugins.
See https://docs.gradle.org/7.5.1/userguide/command_line_interface.html#sec:command_line_warnings
Execution optimizations have been disabled for 1 invalid unit(s) of work during this build to ensure correctness.
Please consult deprecation warnings for more details.
BUILD FAILED in 3h 10m 52s
207 actionable tasks: 142 executed, 59 from cache, 6 up-to-date
Publishing build scan...
https://gradle.com/s/gjduiug6onqse
Build step 'Invoke Gradle script' changed build result to FAILURE
Build step 'Invoke Gradle script' marked build as failure
---------------------------------------------------------------------
To unsubscribe, e-mail: builds-unsubscribe@beam.apache.org
For additional commands, e-mail: builds-help@beam.apache.org
Build failed in Jenkins: beam_PostCommit_Python310 #637
Posted by Apache Jenkins Server <je...@builds.apache.org>.
See <https://ci-beam.apache.org/job/beam_PostCommit_Python310/637/display/redirect>
Changes:
------------------------------------------
[...truncated 11.80 MB...]
apache_beam/examples/complete/game/hourly_team_score_it_test.py: 1 warning
apache_beam/io/gcp/bigquery_file_loads_test.py: 3 warnings
apache_beam/io/gcp/bigquery_write_it_test.py: 3 warnings
apache_beam/io/gcp/bigquery_test.py: 3 warnings
apache_beam/io/gcp/big_query_query_to_table_it_test.py: 4 warnings
<https://ci-beam.apache.org/job/beam_PostCommit_Python310/ws/src/sdks/python/apache_beam/io/gcp/bigquery_file_loads.py>:1173: BeamDeprecationWarning: options is deprecated since First stable release. References to <pipeline>.options will not be supported
temp_location = p.options.view_as(GoogleCloudOptions).temp_location
apache_beam/examples/cookbook/bigquery_tornadoes_it_test.py: 1 warning
apache_beam/examples/complete/game/hourly_team_score_it_test.py: 1 warning
apache_beam/io/gcp/bigquery_file_loads_test.py: 3 warnings
apache_beam/io/gcp/bigquery_write_it_test.py: 3 warnings
apache_beam/io/gcp/bigquery_test.py: 3 warnings
apache_beam/io/gcp/big_query_query_to_table_it_test.py: 4 warnings
<https://ci-beam.apache.org/job/beam_PostCommit_Python310/ws/src/sdks/python/apache_beam/io/gcp/bigquery_file_loads.py>:1175: BeamDeprecationWarning: options is deprecated since First stable release. References to <pipeline>.options will not be supported
p.options.view_as(GoogleCloudOptions).job_name or 'AUTOMATIC_JOB_NAME')
apache_beam/examples/cookbook/bigquery_tornadoes_it_test.py::BigqueryTornadoesIT::test_bigquery_tornadoes_it
<https://ci-beam.apache.org/job/beam_PostCommit_Python310/ws/src/sdks/python/apache_beam/io/gcp/tests/utils.py>:100: PendingDeprecationWarning: Client.dataset is deprecated and will be removed in a future version. Use a string like 'my_project.my_dataset' or a cloud.google.bigquery.DatasetReference object, instead.
table_ref = client.dataset(dataset_id).table(table_id)
apache_beam/examples/dataframe/flight_delays_it_test.py::FlightDelaysTest::test_flight_delays
<https://ci-beam.apache.org/job/beam_PostCommit_Python310/ws/src/sdks/python/apache_beam/examples/dataframe/flight_delays.py>:47: FutureWarning: The default value of numeric_only in DataFrame.mean is deprecated. In a future version, it will default to False. In addition, specifying 'numeric_only=None' is deprecated. Select only valid columns or specify the value of numeric_only to silence this warning.
return airline_df[at_top_airports].mean()
apache_beam/examples/dataframe/flight_delays_it_test.py::FlightDelaysTest::test_flight_delays
apache_beam/examples/dataframe/taxiride_it_test.py::TaxirideIT::test_aggregation
apache_beam/examples/dataframe/taxiride_it_test.py::TaxirideIT::test_enrich
<https://ci-beam.apache.org/job/beam_PostCommit_Python310/ws/src/sdks/python/apache_beam/dataframe/io.py>:659: FutureWarning: WriteToFiles is experimental.
return pcoll | fileio.WriteToFiles(
apache_beam/examples/dataframe/flight_delays_it_test.py::FlightDelaysTest::test_flight_delays
apache_beam/examples/dataframe/taxiride_it_test.py::TaxirideIT::test_aggregation
apache_beam/examples/dataframe/taxiride_it_test.py::TaxirideIT::test_enrich
<https://ci-beam.apache.org/job/beam_PostCommit_Python310/ws/src/sdks/python/apache_beam/io/fileio.py>:596: BeamDeprecationWarning: options is deprecated since First stable release. References to <pipeline>.options will not be supported
p.options.view_as(GoogleCloudOptions).temp_location or
apache_beam/io/gcp/bigquery_test.py::BigQueryStreamingInsertTransformIntegrationTests::test_multiple_destinations_transform
<https://ci-beam.apache.org/job/beam_PostCommit_Python310/ws/src/sdks/python/apache_beam/io/gcp/bigquery_test.py>:1694: BeamDeprecationWarning: options is deprecated since First stable release. References to <pipeline>.options will not be supported
streaming = self.test_pipeline.options.view_as(StandardOptions).streaming
apache_beam/io/gcp/bigquery_read_it_test.py::ReadTests::test_native_source
<https://ci-beam.apache.org/job/beam_PostCommit_Python310/ws/src/sdks/python/apache_beam/io/gcp/bigquery_read_it_test.py>:170: BeamDeprecationWarning: BigQuerySource is deprecated since 2.25.0. Use ReadFromBigQuery instead.
beam.io.BigQuerySource(query=self.query, use_standard_sql=True)))
apache_beam/ml/gcp/cloud_dlp_it_test.py::CloudDLPIT::test_deidentification
<https://ci-beam.apache.org/job/beam_PostCommit_Python310/ws/src/sdks/python/apache_beam/ml/gcp/cloud_dlp_it_test.py>:74: FutureWarning: MaskDetectedDetails is experimental.
| MaskDetectedDetails(
apache_beam/ml/gcp/cloud_dlp_it_test.py::CloudDLPIT::test_inspection
<https://ci-beam.apache.org/job/beam_PostCommit_Python310/ws/src/sdks/python/apache_beam/ml/gcp/cloud_dlp_it_test.py>:85: FutureWarning: InspectForDetails is experimental.
| InspectForDetails(
apache_beam/ml/inference/sklearn_inference_it_test.py::SklearnInference::test_sklearn_regression
<https://ci-beam.apache.org/job/beam_PostCommit_Python310/ws/src/sdks/python/apache_beam/examples/inference/sklearn_japanese_housing_regression.py>:128: FutureWarning: SklearnModelHandlerPandas is experimental. No backwards-compatibility guarantees.
model_loader = SklearnModelHandlerPandas(
apache_beam/ml/inference/sklearn_inference_it_test.py::SklearnInference::test_sklearn_regression
<https://ci-beam.apache.org/job/beam_PostCommit_Python310/ws/src/build/gradleenv/2050596098/lib/python3.10/site-packages/dill/_dill.py>:472: FutureWarning: SklearnModelHandlerPandas is experimental. No backwards-compatibility guarantees.
obj = StockUnpickler.load(self)
apache_beam/io/gcp/bigquery_read_it_test.py::ReadNewTypesTests::test_native_source
<https://ci-beam.apache.org/job/beam_PostCommit_Python310/ws/src/sdks/python/apache_beam/io/gcp/bigquery_read_it_test.py>:693: BeamDeprecationWarning: BigQuerySource is deprecated since 2.25.0. Use ReadFromBigQuery instead.
beam.io.BigQuerySource(query=self.query, use_standard_sql=True)))
apache_beam/io/gcp/bigquery_read_it_test.py::ReadAllBQTests::test_read_queries
<https://ci-beam.apache.org/job/beam_PostCommit_Python310/ws/src/sdks/python/apache_beam/io/gcp/bigquery_read_it_test.py>:808: FutureWarning: ReadAllFromBigQuery is experimental.
| beam.io.ReadAllFromBigQuery())
apache_beam/io/gcp/bigquery_read_it_test.py::ReadAllBQTests::test_read_queries
<https://ci-beam.apache.org/job/beam_PostCommit_Python310/ws/src/sdks/python/apache_beam/io/gcp/bigquery.py>:2665: BeamDeprecationWarning: options is deprecated since First stable release. References to <pipeline>.options will not be supported
job_name = pcoll.pipeline.options.view_as(GoogleCloudOptions).job_name
apache_beam/io/gcp/bigquery_read_it_test.py::ReadAllBQTests::test_read_queries
<https://ci-beam.apache.org/job/beam_PostCommit_Python310/ws/src/sdks/python/apache_beam/io/gcp/bigquery.py>:2666: BeamDeprecationWarning: options is deprecated since First stable release. References to <pipeline>.options will not be supported
project = pcoll.pipeline.options.view_as(GoogleCloudOptions).project
apache_beam/io/gcp/bigquery_read_it_test.py::ReadAllBQTests::test_read_queries
<https://ci-beam.apache.org/job/beam_PostCommit_Python310/ws/src/sdks/python/apache_beam/io/gcp/bigquery.py>:2679: BeamDeprecationWarning: options is deprecated since First stable release. References to <pipeline>.options will not be supported
options=pcoll.pipeline.options,
-- Docs: https://docs.pytest.org/en/stable/how-to/capture-warnings.html
- generated xml file: <https://ci-beam.apache.org/job/beam_PostCommit_Python310/ws/src/sdks/python/pytest_postCommitIT-df-py310.xml> -
[36m[1m=========================== short test summary info ============================[0m
[31mFAILED[0m apache_beam/ml/inference/sklearn_inference_it_test.py::[1mSklearnInference::test_sklearn_regression[0m - apache_beam.runners.dataflow.dataflow_runner.DataflowRuntimeException: Dataflow pipeline failed. State: FAILED, Error:
Traceback (most recent call last):
File "apache_beam/runners/common.py", line 1418, in apache_beam.runners.common.DoFnRunner.process
File "apache_beam/runners/common.py", line 838, in apache_beam.runners.common.PerWindowInvoker.invoke_process
File "apache_beam/runners/common.py", line 984, in apache_beam.runners.common.PerWindowInvoker._invoke_process_per_window
File "/usr/local/lib/python3.10/site-packages/apache_beam/ml/inference/base.py", line 552, in process
return self._run_inference(batch, inference_args)
File "/usr/local/lib/python3.10/site-packages/apache_beam/ml/inference/base.py", line 521, in _run_inference
raise e
File "/usr/local/lib/python3.10/site-packages/apache_beam/ml/inference/base.py", line 517, in _run_inference
result_generator = self._model_handler.run_inference(
File "/usr/local/lib/python3.10/site-packages/apache_beam/ml/inference/sklearn_inference.py", line 268, in run_inference
predictions, splits = self._model_inference_fn(model, batch, inference_args)
File "/usr/local/lib/python3.10/site-packages/apache_beam/ml/inference/sklearn_inference.py", line 185, in _default_pandas_inference_fn
predictions = model.predict(vectorized_batch)
File "/usr/local/lib/python3.10/site-packages/sklearn/pipeline.py", line 480, in predict
Xt = transform.transform(Xt)
File "/usr/local/lib/python3.10/site-packages/sklearn/utils/_set_output.py", line 140, in wrapped
data_to_wrap = f(self, X, *args, **kwargs)
File "/usr/local/lib/python3.10/site-packages/sklearn/compose/_column_transformer.py", line 800, in transform
Xs = self._fit_transform(
File "/usr/local/lib/python3.10/site-packages/sklearn/compose/_column_transformer.py", line 652, in _fit_transform
transformers = list(
File "/usr/local/lib/python3.10/site-packages/sklearn/compose/_column_transformer.py", line 349, in _iter
transformers = [
File "/usr/local/lib/python3.10/site-packages/sklearn/compose/_column_transformer.py", line 350, in <listcomp>
replace_passthrough(*trans) for trans in self.transformers_
File "/usr/local/lib/python3.10/site-packages/sklearn/compose/_column_transformer.py", line 345, in replace_passthrough
if name not in self._name_to_fitted_passthrough:
AttributeError: 'ColumnTransformer' object has no attribute '_name_to_fitted_passthrough'
During handling of the above exception, another exception occurred:
Traceback (most recent call last):
File "/usr/local/lib/python3.10/site-packages/apache_beam/runners/worker/sdk_worker.py", line 295, in _execute
response = task()
File "/usr/local/lib/python3.10/site-packages/apache_beam/runners/worker/sdk_worker.py", line 370, in <lambda>
lambda: self.create_worker().do_instruction(request), request)
File "/usr/local/lib/python3.10/site-packages/apache_beam/runners/worker/sdk_worker.py", line 629, in do_instruction
return getattr(self, request_type)(
File "/usr/local/lib/python3.10/site-packages/apache_beam/runners/worker/sdk_worker.py", line 667, in process_bundle
bundle_processor.process_bundle(instruction_id))
File "/usr/local/lib/python3.10/site-packages/apache_beam/runners/worker/bundle_processor.py", line 1062, in process_bundle
input_op_by_transform_id[element.transform_id].process_encoded(
File "/usr/local/lib/python3.10/site-packages/apache_beam/runners/worker/bundle_processor.py", line 232, in process_encoded
self.output(decoded_value)
File "apache_beam/runners/worker/operations.py", line 526, in apache_beam.runners.worker.operations.Operation.output
File "apache_beam/runners/worker/operations.py", line 528, in apache_beam.runners.worker.operations.Operation.output
File "apache_beam/runners/worker/operations.py", line 237, in apache_beam.runners.worker.operations.SingletonElementConsumerSet.receive
File "apache_beam/runners/worker/operations.py", line 240, in apache_beam.runners.worker.operations.SingletonElementConsumerSet.receive
File "apache_beam/runners/worker/operations.py", line 907, in apache_beam.runners.worker.operations.DoOperation.process
File "apache_beam/runners/worker/operations.py", line 908, in apache_beam.runners.worker.operations.DoOperation.process
File "apache_beam/runners/common.py", line 1420, in apache_beam.runners.common.DoFnRunner.process
File "apache_beam/runners/common.py", line 1492, in apache_beam.runners.common.DoFnRunner._reraise_augmented
File "apache_beam/runners/common.py", line 1418, in apache_beam.runners.common.DoFnRunner.process
File "apache_beam/runners/common.py", line 624, in apache_beam.runners.common.SimpleInvoker.invoke_process
File "apache_beam/runners/common.py", line 1582, in apache_beam.runners.common._OutputHandler.handle_process_outputs
File "apache_beam/runners/common.py", line 1695, in apache_beam.runners.common._OutputHandler._write_value_to_tag
File "apache_beam/runners/worker/operations.py", line 240, in apache_beam.runners.worker.operations.SingletonElementConsumerSet.receive
File "apache_beam/runners/worker/operations.py", line 907, in apache_beam.runners.worker.operations.DoOperation.process
File "apache_beam/runners/worker/operations.py", line 908, in apache_beam.runners.worker.operations.DoOperation.process
File "apache_beam/runners/common.py", line 1420, in apache_beam.runners.common.DoFnRunner.process
File "apache_beam/runners/common.py", line 1492, in apache_beam.runners.common.DoFnRunner._reraise_augmented
File "apache_beam/runners/common.py", line 1418, in apache_beam.runners.common.DoFnRunner.process
File "apache_beam/runners/common.py", line 624, in apache_beam.runners.common.SimpleInvoker.invoke_process
File "apache_beam/runners/common.py", line 1582, in apache_beam.runners.common._OutputHandler.handle_process_outputs
File "apache_beam/runners/common.py", line 1695, in apache_beam.runners.common._OutputHandler._write_value_to_tag
File "apache_beam/runners/worker/operations.py", line 240, in apache_beam.runners.worker.operations.SingletonElementConsumerSet.receive
File "apache_beam/runners/worker/operations.py", line 907, in apache_beam.runners.worker.operations.DoOperation.process
File "apache_beam/runners/worker/operations.py", line 908, in apache_beam.runners.worker.operations.DoOperation.process
File "apache_beam/runners/common.py", line 1420, in apache_beam.runners.common.DoFnRunner.process
File "apache_beam/runners/common.py", line 1492, in apache_beam.runners.common.DoFnRunner._reraise_augmented
File "apache_beam/runners/common.py", line 1418, in apache_beam.runners.common.DoFnRunner.process
File "apache_beam/runners/common.py", line 624, in apache_beam.runners.common.SimpleInvoker.invoke_process
File "apache_beam/runners/common.py", line 1582, in apache_beam.runners.common._OutputHandler.handle_process_outputs
File "apache_beam/runners/common.py", line 1695, in apache_beam.runners.common._OutputHandler._write_value_to_tag
File "apache_beam/runners/worker/operations.py", line 240, in apache_beam.runners.worker.operations.SingletonElementConsumerSet.receive
File "apache_beam/runners/worker/operations.py", line 907, in apache_beam.runners.worker.operations.DoOperation.process
File "apache_beam/runners/worker/operations.py", line 908, in apache_beam.runners.worker.operations.DoOperation.process
File "apache_beam/runners/common.py", line 1420, in apache_beam.runners.common.DoFnRunner.process
File "apache_beam/runners/common.py", line 1492, in apache_beam.runners.common.DoFnRunner._reraise_augmented
File "apache_beam/runners/common.py", line 1418, in apache_beam.runners.common.DoFnRunner.process
File "apache_beam/runners/common.py", line 838, in apache_beam.runners.common.PerWindowInvoker.invoke_process
File "apache_beam/runners/common.py", line 982, in apache_beam.runners.common.PerWindowInvoker._invoke_process_per_window
File "apache_beam/runners/common.py", line 1582, in apache_beam.runners.common._OutputHandler.handle_process_outputs
File "apache_beam/runners/common.py", line 1697, in apache_beam.runners.common._OutputHandler._write_value_to_tag
File "apache_beam/runners/worker/operations.py", line 237, in apache_beam.runners.worker.operations.SingletonElementConsumerSet.receive
File "apache_beam/runners/worker/operations.py", line 240, in apache_beam.runners.worker.operations.SingletonElementConsumerSet.receive
File "apache_beam/runners/worker/operations.py", line 907, in apache_beam.runners.worker.operations.DoOperation.process
File "apache_beam/runners/worker/operations.py", line 908, in apache_beam.runners.worker.operations.DoOperation.process
File "apache_beam/runners/common.py", line 1420, in apache_beam.runners.common.DoFnRunner.process
File "apache_beam/runners/common.py", line 1492, in apache_beam.runners.common.DoFnRunner._reraise_augmented
File "apache_beam/runners/common.py", line 1418, in apache_beam.runners.common.DoFnRunner.process
File "apache_beam/runners/common.py", line 624, in apache_beam.runners.common.SimpleInvoker.invoke_process
File "apache_beam/runners/common.py", line 1582, in apache_beam.runners.common._OutputHandler.handle_process_outputs
File "apache_beam/runners/common.py", line 1695, in apache_beam.runners.common._OutputHandler._write_value_to_tag
File "apache_beam/runners/worker/operations.py", line 240, in apache_beam.runners.worker.operations.SingletonElementConsumerSet.receive
File "apache_beam/runners/worker/operations.py", line 907, in apache_beam.runners.worker.operations.DoOperation.process
File "apache_beam/runners/worker/operations.py", line 908, in apache_beam.runners.worker.operations.DoOperation.process
File "apache_beam/runners/common.py", line 1420, in apache_beam.runners.common.DoFnRunner.process
File "apache_beam/runners/common.py", line 1508, in apache_beam.runners.common.DoFnRunner._reraise_augmented
File "apache_beam/runners/common.py", line 1418, in apache_beam.runners.common.DoFnRunner.process
File "apache_beam/runners/common.py", line 838, in apache_beam.runners.common.PerWindowInvoker.invoke_process
File "apache_beam/runners/common.py", line 984, in apache_beam.runners.common.PerWindowInvoker._invoke_process_per_window
File "/usr/local/lib/python3.10/site-packages/apache_beam/ml/inference/base.py", line 552, in process
return self._run_inference(batch, inference_args)
File "/usr/local/lib/python3.10/site-packages/apache_beam/ml/inference/base.py", line 521, in _run_inference
raise e
File "/usr/local/lib/python3.10/site-packages/apache_beam/ml/inference/base.py", line 517, in _run_inference
result_generator = self._model_handler.run_inference(
File "/usr/local/lib/python3.10/site-packages/apache_beam/ml/inference/sklearn_inference.py", line 268, in run_inference
predictions, splits = self._model_inference_fn(model, batch, inference_args)
File "/usr/local/lib/python3.10/site-packages/apache_beam/ml/inference/sklearn_inference.py", line 185, in _default_pandas_inference_fn
predictions = model.predict(vectorized_batch)
File "/usr/local/lib/python3.10/site-packages/sklearn/pipeline.py", line 480, in predict
Xt = transform.transform(Xt)
File "/usr/local/lib/python3.10/site-packages/sklearn/utils/_set_output.py", line 140, in wrapped
data_to_wrap = f(self, X, *args, **kwargs)
File "/usr/local/lib/python3.10/site-packages/sklearn/compose/_column_transformer.py", line 800, in transform
Xs = self._fit_transform(
File "/usr/local/lib/python3.10/site-packages/sklearn/compose/_column_transformer.py", line 652, in _fit_transform
transformers = list(
File "/usr/local/lib/python3.10/site-packages/sklearn/compose/_column_transformer.py", line 349, in _iter
transformers = [
File "/usr/local/lib/python3.10/site-packages/sklearn/compose/_column_transformer.py", line 350, in <listcomp>
replace_passthrough(*trans) for trans in self.transformers_
File "/usr/local/lib/python3.10/site-packages/sklearn/compose/_column_transformer.py", line 345, in replace_passthrough
if name not in self._name_to_fitted_passthrough:
AttributeError: 'ColumnTransformer' object has no attribute '_name_to_fitted_passthrough' [while running 'RunInference all_features/BeamML_RunInference-ptransform-145']
[31m===== [31m[1m1 failed[0m, [32m82 passed[0m, [33m39 skipped[0m, [33m616 warnings[0m[31m in 11234.81s (3:07:14)[0m[31m =====[0m
> Task :sdks:python:test-suites:dataflow:py310:postCommitIT FAILED
FAILURE: Build failed with an exception.
* Where:
Script '<https://ci-beam.apache.org/job/beam_PostCommit_Python310/ws/src/sdks/python/test-suites/dataflow/common.gradle'> line: 111
* What went wrong:
Execution failed for task ':sdks:python:test-suites:dataflow:py310:postCommitIT'.
> Process 'command 'sh'' finished with non-zero exit value 1
* Try:
> Run with --stacktrace option to get the stack trace.
> Run with --info or --debug option to get more log output.
* Get more help at https://help.gradle.org
Deprecated Gradle features were used in this build, making it incompatible with Gradle 8.0.
You can use '--warning-mode all' to show the individual deprecation warnings and determine if they come from your own scripts or plugins.
See https://docs.gradle.org/7.5.1/userguide/command_line_interface.html#sec:command_line_warnings
Execution optimizations have been disabled for 1 invalid unit(s) of work during this build to ensure correctness.
Please consult deprecation warnings for more details.
BUILD FAILED in 3h 9m 15s
207 actionable tasks: 142 executed, 59 from cache, 6 up-to-date
Publishing build scan...
https://gradle.com/s/hknkq3yh2relg
Build step 'Invoke Gradle script' changed build result to FAILURE
Build step 'Invoke Gradle script' marked build as failure
---------------------------------------------------------------------
To unsubscribe, e-mail: builds-unsubscribe@beam.apache.org
For additional commands, e-mail: builds-help@beam.apache.org
Build failed in Jenkins: beam_PostCommit_Python310 #636
Posted by Apache Jenkins Server <je...@builds.apache.org>.
See <https://ci-beam.apache.org/job/beam_PostCommit_Python310/636/display/redirect>
Changes:
------------------------------------------
[...truncated 11.74 MB...]
apache_beam/io/gcp/bigquery_test.py: 3 warnings
apache_beam/io/gcp/big_query_query_to_table_it_test.py: 4 warnings
<https://ci-beam.apache.org/job/beam_PostCommit_Python310/ws/src/sdks/python/apache_beam/io/gcp/bigquery_file_loads.py>:1175: BeamDeprecationWarning: options is deprecated since First stable release. References to <pipeline>.options will not be supported
p.options.view_as(GoogleCloudOptions).job_name or 'AUTOMATIC_JOB_NAME')
apache_beam/examples/cookbook/bigquery_tornadoes_it_test.py::BigqueryTornadoesIT::test_bigquery_tornadoes_it
<https://ci-beam.apache.org/job/beam_PostCommit_Python310/ws/src/sdks/python/apache_beam/io/gcp/tests/utils.py>:100: PendingDeprecationWarning: Client.dataset is deprecated and will be removed in a future version. Use a string like 'my_project.my_dataset' or a cloud.google.bigquery.DatasetReference object, instead.
table_ref = client.dataset(dataset_id).table(table_id)
apache_beam/dataframe/io_it_test.py: 2 warnings
apache_beam/io/gcp/bigquery_json_it_test.py: 1 warning
apache_beam/io/gcp/bigquery_read_it_test.py: 9 warnings
<https://ci-beam.apache.org/job/beam_PostCommit_Python310/ws/src/sdks/python/apache_beam/io/gcp/bigquery.py>:2536: BeamDeprecationWarning: options is deprecated since First stable release. References to <pipeline>.options will not be supported
project_id = pcoll.pipeline.options.view_as(GoogleCloudOptions).project
apache_beam/dataframe/io_it_test.py: 2 warnings
apache_beam/io/gcp/bigquery_json_it_test.py: 1 warning
apache_beam/io/gcp/bigquery_read_it_test.py: 9 warnings
<https://ci-beam.apache.org/job/beam_PostCommit_Python310/ws/src/sdks/python/apache_beam/io/gcp/bigquery.py>:2557: BeamDeprecationWarning: options is deprecated since First stable release. References to <pipeline>.options will not be supported
pipeline_options=pcoll.pipeline.options,
apache_beam/examples/dataframe/flight_delays_it_test.py::FlightDelaysTest::test_flight_delays
<https://ci-beam.apache.org/job/beam_PostCommit_Python310/ws/src/sdks/python/apache_beam/examples/dataframe/flight_delays.py>:47: FutureWarning: The default value of numeric_only in DataFrame.mean is deprecated. In a future version, it will default to False. In addition, specifying 'numeric_only=None' is deprecated. Select only valid columns or specify the value of numeric_only to silence this warning.
return airline_df[at_top_airports].mean()
apache_beam/examples/dataframe/flight_delays_it_test.py::FlightDelaysTest::test_flight_delays
apache_beam/examples/dataframe/taxiride_it_test.py::TaxirideIT::test_aggregation
apache_beam/examples/dataframe/taxiride_it_test.py::TaxirideIT::test_enrich
<https://ci-beam.apache.org/job/beam_PostCommit_Python310/ws/src/sdks/python/apache_beam/dataframe/io.py>:659: FutureWarning: WriteToFiles is experimental.
return pcoll | fileio.WriteToFiles(
apache_beam/examples/dataframe/flight_delays_it_test.py::FlightDelaysTest::test_flight_delays
apache_beam/examples/dataframe/taxiride_it_test.py::TaxirideIT::test_aggregation
apache_beam/examples/dataframe/taxiride_it_test.py::TaxirideIT::test_enrich
<https://ci-beam.apache.org/job/beam_PostCommit_Python310/ws/src/sdks/python/apache_beam/io/fileio.py>:596: BeamDeprecationWarning: options is deprecated since First stable release. References to <pipeline>.options will not be supported
p.options.view_as(GoogleCloudOptions).temp_location or
apache_beam/io/gcp/bigquery_test.py::BigQueryStreamingInsertTransformIntegrationTests::test_multiple_destinations_transform
<https://ci-beam.apache.org/job/beam_PostCommit_Python310/ws/src/sdks/python/apache_beam/io/gcp/bigquery_test.py>:1694: BeamDeprecationWarning: options is deprecated since First stable release. References to <pipeline>.options will not be supported
streaming = self.test_pipeline.options.view_as(StandardOptions).streaming
apache_beam/io/gcp/bigquery_read_it_test.py::ReadTests::test_native_source
<https://ci-beam.apache.org/job/beam_PostCommit_Python310/ws/src/sdks/python/apache_beam/io/gcp/bigquery_read_it_test.py>:170: BeamDeprecationWarning: BigQuerySource is deprecated since 2.25.0. Use ReadFromBigQuery instead.
beam.io.BigQuerySource(query=self.query, use_standard_sql=True)))
apache_beam/ml/inference/sklearn_inference_it_test.py::SklearnInference::test_sklearn_regression
<https://ci-beam.apache.org/job/beam_PostCommit_Python310/ws/src/sdks/python/apache_beam/examples/inference/sklearn_japanese_housing_regression.py>:128: FutureWarning: SklearnModelHandlerPandas is experimental. No backwards-compatibility guarantees.
model_loader = SklearnModelHandlerPandas(
apache_beam/ml/inference/sklearn_inference_it_test.py::SklearnInference::test_sklearn_regression
<https://ci-beam.apache.org/job/beam_PostCommit_Python310/ws/src/build/gradleenv/2050596098/lib/python3.10/site-packages/dill/_dill.py>:472: FutureWarning: SklearnModelHandlerPandas is experimental. No backwards-compatibility guarantees.
obj = StockUnpickler.load(self)
apache_beam/ml/gcp/cloud_dlp_it_test.py::CloudDLPIT::test_deidentification
<https://ci-beam.apache.org/job/beam_PostCommit_Python310/ws/src/sdks/python/apache_beam/ml/gcp/cloud_dlp_it_test.py>:74: FutureWarning: MaskDetectedDetails is experimental.
| MaskDetectedDetails(
apache_beam/ml/gcp/cloud_dlp_it_test.py::CloudDLPIT::test_inspection
<https://ci-beam.apache.org/job/beam_PostCommit_Python310/ws/src/sdks/python/apache_beam/ml/gcp/cloud_dlp_it_test.py>:85: FutureWarning: InspectForDetails is experimental.
| InspectForDetails(
apache_beam/io/gcp/bigquery_read_it_test.py::ReadNewTypesTests::test_native_source
<https://ci-beam.apache.org/job/beam_PostCommit_Python310/ws/src/sdks/python/apache_beam/io/gcp/bigquery_read_it_test.py>:693: BeamDeprecationWarning: BigQuerySource is deprecated since 2.25.0. Use ReadFromBigQuery instead.
beam.io.BigQuerySource(query=self.query, use_standard_sql=True)))
apache_beam/io/gcp/bigquery_read_it_test.py::ReadAllBQTests::test_read_queries
<https://ci-beam.apache.org/job/beam_PostCommit_Python310/ws/src/sdks/python/apache_beam/io/gcp/bigquery_read_it_test.py>:808: FutureWarning: ReadAllFromBigQuery is experimental.
| beam.io.ReadAllFromBigQuery())
apache_beam/io/gcp/bigquery_read_it_test.py::ReadAllBQTests::test_read_queries
<https://ci-beam.apache.org/job/beam_PostCommit_Python310/ws/src/sdks/python/apache_beam/io/gcp/bigquery.py>:2665: BeamDeprecationWarning: options is deprecated since First stable release. References to <pipeline>.options will not be supported
job_name = pcoll.pipeline.options.view_as(GoogleCloudOptions).job_name
apache_beam/io/gcp/bigquery_read_it_test.py::ReadAllBQTests::test_read_queries
<https://ci-beam.apache.org/job/beam_PostCommit_Python310/ws/src/sdks/python/apache_beam/io/gcp/bigquery.py>:2666: BeamDeprecationWarning: options is deprecated since First stable release. References to <pipeline>.options will not be supported
project = pcoll.pipeline.options.view_as(GoogleCloudOptions).project
apache_beam/io/gcp/bigquery_read_it_test.py::ReadAllBQTests::test_read_queries
<https://ci-beam.apache.org/job/beam_PostCommit_Python310/ws/src/sdks/python/apache_beam/io/gcp/bigquery.py>:2679: BeamDeprecationWarning: options is deprecated since First stable release. References to <pipeline>.options will not be supported
options=pcoll.pipeline.options,
-- Docs: https://docs.pytest.org/en/stable/how-to/capture-warnings.html
- generated xml file: <https://ci-beam.apache.org/job/beam_PostCommit_Python310/ws/src/sdks/python/pytest_postCommitIT-df-py310.xml> -
[36m[1m=========================== short test summary info ============================[0m
[31mFAILED[0m apache_beam/ml/inference/sklearn_inference_it_test.py::[1mSklearnInference::test_sklearn_regression[0m - apache_beam.runners.dataflow.dataflow_runner.DataflowRuntimeException: Dataflow pipeline failed. State: FAILED, Error:
Traceback (most recent call last):
File "apache_beam/runners/common.py", line 1418, in apache_beam.runners.common.DoFnRunner.process
File "apache_beam/runners/common.py", line 838, in apache_beam.runners.common.PerWindowInvoker.invoke_process
File "apache_beam/runners/common.py", line 984, in apache_beam.runners.common.PerWindowInvoker._invoke_process_per_window
File "/usr/local/lib/python3.10/site-packages/apache_beam/ml/inference/base.py", line 552, in process
return self._run_inference(batch, inference_args)
File "/usr/local/lib/python3.10/site-packages/apache_beam/ml/inference/base.py", line 521, in _run_inference
raise e
File "/usr/local/lib/python3.10/site-packages/apache_beam/ml/inference/base.py", line 517, in _run_inference
result_generator = self._model_handler.run_inference(
File "/usr/local/lib/python3.10/site-packages/apache_beam/ml/inference/sklearn_inference.py", line 268, in run_inference
predictions, splits = self._model_inference_fn(model, batch, inference_args)
File "/usr/local/lib/python3.10/site-packages/apache_beam/ml/inference/sklearn_inference.py", line 185, in _default_pandas_inference_fn
predictions = model.predict(vectorized_batch)
File "/usr/local/lib/python3.10/site-packages/sklearn/pipeline.py", line 480, in predict
Xt = transform.transform(Xt)
File "/usr/local/lib/python3.10/site-packages/sklearn/utils/_set_output.py", line 140, in wrapped
data_to_wrap = f(self, X, *args, **kwargs)
File "/usr/local/lib/python3.10/site-packages/sklearn/compose/_column_transformer.py", line 800, in transform
Xs = self._fit_transform(
File "/usr/local/lib/python3.10/site-packages/sklearn/compose/_column_transformer.py", line 652, in _fit_transform
transformers = list(
File "/usr/local/lib/python3.10/site-packages/sklearn/compose/_column_transformer.py", line 349, in _iter
transformers = [
File "/usr/local/lib/python3.10/site-packages/sklearn/compose/_column_transformer.py", line 350, in <listcomp>
replace_passthrough(*trans) for trans in self.transformers_
File "/usr/local/lib/python3.10/site-packages/sklearn/compose/_column_transformer.py", line 345, in replace_passthrough
if name not in self._name_to_fitted_passthrough:
AttributeError: 'ColumnTransformer' object has no attribute '_name_to_fitted_passthrough'
During handling of the above exception, another exception occurred:
Traceback (most recent call last):
File "/usr/local/lib/python3.10/site-packages/apache_beam/runners/worker/sdk_worker.py", line 295, in _execute
response = task()
File "/usr/local/lib/python3.10/site-packages/apache_beam/runners/worker/sdk_worker.py", line 370, in <lambda>
lambda: self.create_worker().do_instruction(request), request)
File "/usr/local/lib/python3.10/site-packages/apache_beam/runners/worker/sdk_worker.py", line 629, in do_instruction
return getattr(self, request_type)(
File "/usr/local/lib/python3.10/site-packages/apache_beam/runners/worker/sdk_worker.py", line 667, in process_bundle
bundle_processor.process_bundle(instruction_id))
File "/usr/local/lib/python3.10/site-packages/apache_beam/runners/worker/bundle_processor.py", line 1062, in process_bundle
input_op_by_transform_id[element.transform_id].process_encoded(
File "/usr/local/lib/python3.10/site-packages/apache_beam/runners/worker/bundle_processor.py", line 232, in process_encoded
self.output(decoded_value)
File "apache_beam/runners/worker/operations.py", line 526, in apache_beam.runners.worker.operations.Operation.output
File "apache_beam/runners/worker/operations.py", line 528, in apache_beam.runners.worker.operations.Operation.output
File "apache_beam/runners/worker/operations.py", line 237, in apache_beam.runners.worker.operations.SingletonElementConsumerSet.receive
File "apache_beam/runners/worker/operations.py", line 240, in apache_beam.runners.worker.operations.SingletonElementConsumerSet.receive
File "apache_beam/runners/worker/operations.py", line 907, in apache_beam.runners.worker.operations.DoOperation.process
File "apache_beam/runners/worker/operations.py", line 908, in apache_beam.runners.worker.operations.DoOperation.process
File "apache_beam/runners/common.py", line 1420, in apache_beam.runners.common.DoFnRunner.process
File "apache_beam/runners/common.py", line 1492, in apache_beam.runners.common.DoFnRunner._reraise_augmented
File "apache_beam/runners/common.py", line 1418, in apache_beam.runners.common.DoFnRunner.process
File "apache_beam/runners/common.py", line 624, in apache_beam.runners.common.SimpleInvoker.invoke_process
File "apache_beam/runners/common.py", line 1582, in apache_beam.runners.common._OutputHandler.handle_process_outputs
File "apache_beam/runners/common.py", line 1695, in apache_beam.runners.common._OutputHandler._write_value_to_tag
File "apache_beam/runners/worker/operations.py", line 240, in apache_beam.runners.worker.operations.SingletonElementConsumerSet.receive
File "apache_beam/runners/worker/operations.py", line 907, in apache_beam.runners.worker.operations.DoOperation.process
File "apache_beam/runners/worker/operations.py", line 908, in apache_beam.runners.worker.operations.DoOperation.process
File "apache_beam/runners/common.py", line 1420, in apache_beam.runners.common.DoFnRunner.process
File "apache_beam/runners/common.py", line 1492, in apache_beam.runners.common.DoFnRunner._reraise_augmented
File "apache_beam/runners/common.py", line 1418, in apache_beam.runners.common.DoFnRunner.process
File "apache_beam/runners/common.py", line 624, in apache_beam.runners.common.SimpleInvoker.invoke_process
File "apache_beam/runners/common.py", line 1582, in apache_beam.runners.common._OutputHandler.handle_process_outputs
File "apache_beam/runners/common.py", line 1695, in apache_beam.runners.common._OutputHandler._write_value_to_tag
File "apache_beam/runners/worker/operations.py", line 240, in apache_beam.runners.worker.operations.SingletonElementConsumerSet.receive
File "apache_beam/runners/worker/operations.py", line 907, in apache_beam.runners.worker.operations.DoOperation.process
File "apache_beam/runners/worker/operations.py", line 908, in apache_beam.runners.worker.operations.DoOperation.process
File "apache_beam/runners/common.py", line 1420, in apache_beam.runners.common.DoFnRunner.process
File "apache_beam/runners/common.py", line 1492, in apache_beam.runners.common.DoFnRunner._reraise_augmented
File "apache_beam/runners/common.py", line 1418, in apache_beam.runners.common.DoFnRunner.process
File "apache_beam/runners/common.py", line 624, in apache_beam.runners.common.SimpleInvoker.invoke_process
File "apache_beam/runners/common.py", line 1582, in apache_beam.runners.common._OutputHandler.handle_process_outputs
File "apache_beam/runners/common.py", line 1695, in apache_beam.runners.common._OutputHandler._write_value_to_tag
File "apache_beam/runners/worker/operations.py", line 240, in apache_beam.runners.worker.operations.SingletonElementConsumerSet.receive
File "apache_beam/runners/worker/operations.py", line 907, in apache_beam.runners.worker.operations.DoOperation.process
File "apache_beam/runners/worker/operations.py", line 908, in apache_beam.runners.worker.operations.DoOperation.process
File "apache_beam/runners/common.py", line 1420, in apache_beam.runners.common.DoFnRunner.process
File "apache_beam/runners/common.py", line 1492, in apache_beam.runners.common.DoFnRunner._reraise_augmented
File "apache_beam/runners/common.py", line 1418, in apache_beam.runners.common.DoFnRunner.process
File "apache_beam/runners/common.py", line 838, in apache_beam.runners.common.PerWindowInvoker.invoke_process
File "apache_beam/runners/common.py", line 982, in apache_beam.runners.common.PerWindowInvoker._invoke_process_per_window
File "apache_beam/runners/common.py", line 1582, in apache_beam.runners.common._OutputHandler.handle_process_outputs
File "apache_beam/runners/common.py", line 1697, in apache_beam.runners.common._OutputHandler._write_value_to_tag
File "apache_beam/runners/worker/operations.py", line 237, in apache_beam.runners.worker.operations.SingletonElementConsumerSet.receive
File "apache_beam/runners/worker/operations.py", line 240, in apache_beam.runners.worker.operations.SingletonElementConsumerSet.receive
File "apache_beam/runners/worker/operations.py", line 907, in apache_beam.runners.worker.operations.DoOperation.process
File "apache_beam/runners/worker/operations.py", line 908, in apache_beam.runners.worker.operations.DoOperation.process
File "apache_beam/runners/common.py", line 1420, in apache_beam.runners.common.DoFnRunner.process
File "apache_beam/runners/common.py", line 1492, in apache_beam.runners.common.DoFnRunner._reraise_augmented
File "apache_beam/runners/common.py", line 1418, in apache_beam.runners.common.DoFnRunner.process
File "apache_beam/runners/common.py", line 624, in apache_beam.runners.common.SimpleInvoker.invoke_process
File "apache_beam/runners/common.py", line 1582, in apache_beam.runners.common._OutputHandler.handle_process_outputs
File "apache_beam/runners/common.py", line 1695, in apache_beam.runners.common._OutputHandler._write_value_to_tag
File "apache_beam/runners/worker/operations.py", line 240, in apache_beam.runners.worker.operations.SingletonElementConsumerSet.receive
File "apache_beam/runners/worker/operations.py", line 907, in apache_beam.runners.worker.operations.DoOperation.process
File "apache_beam/runners/worker/operations.py", line 908, in apache_beam.runners.worker.operations.DoOperation.process
File "apache_beam/runners/common.py", line 1420, in apache_beam.runners.common.DoFnRunner.process
File "apache_beam/runners/common.py", line 1508, in apache_beam.runners.common.DoFnRunner._reraise_augmented
File "apache_beam/runners/common.py", line 1418, in apache_beam.runners.common.DoFnRunner.process
File "apache_beam/runners/common.py", line 838, in apache_beam.runners.common.PerWindowInvoker.invoke_process
File "apache_beam/runners/common.py", line 984, in apache_beam.runners.common.PerWindowInvoker._invoke_process_per_window
File "/usr/local/lib/python3.10/site-packages/apache_beam/ml/inference/base.py", line 552, in process
return self._run_inference(batch, inference_args)
File "/usr/local/lib/python3.10/site-packages/apache_beam/ml/inference/base.py", line 521, in _run_inference
raise e
File "/usr/local/lib/python3.10/site-packages/apache_beam/ml/inference/base.py", line 517, in _run_inference
result_generator = self._model_handler.run_inference(
File "/usr/local/lib/python3.10/site-packages/apache_beam/ml/inference/sklearn_inference.py", line 268, in run_inference
predictions, splits = self._model_inference_fn(model, batch, inference_args)
File "/usr/local/lib/python3.10/site-packages/apache_beam/ml/inference/sklearn_inference.py", line 185, in _default_pandas_inference_fn
predictions = model.predict(vectorized_batch)
File "/usr/local/lib/python3.10/site-packages/sklearn/pipeline.py", line 480, in predict
Xt = transform.transform(Xt)
File "/usr/local/lib/python3.10/site-packages/sklearn/utils/_set_output.py", line 140, in wrapped
data_to_wrap = f(self, X, *args, **kwargs)
File "/usr/local/lib/python3.10/site-packages/sklearn/compose/_column_transformer.py", line 800, in transform
Xs = self._fit_transform(
File "/usr/local/lib/python3.10/site-packages/sklearn/compose/_column_transformer.py", line 652, in _fit_transform
transformers = list(
File "/usr/local/lib/python3.10/site-packages/sklearn/compose/_column_transformer.py", line 349, in _iter
transformers = [
File "/usr/local/lib/python3.10/site-packages/sklearn/compose/_column_transformer.py", line 350, in <listcomp>
replace_passthrough(*trans) for trans in self.transformers_
File "/usr/local/lib/python3.10/site-packages/sklearn/compose/_column_transformer.py", line 345, in replace_passthrough
if name not in self._name_to_fitted_passthrough:
AttributeError: 'ColumnTransformer' object has no attribute '_name_to_fitted_passthrough' [while running 'RunInference all_features/BeamML_RunInference-ptransform-145']
[31m===== [31m[1m1 failed[0m, [32m82 passed[0m, [33m39 skipped[0m, [33m616 warnings[0m[31m in 11733.03s (3:15:33)[0m[31m =====[0m
> Task :sdks:python:test-suites:dataflow:py310:postCommitIT FAILED
FAILURE: Build failed with an exception.
* Where:
Script '<https://ci-beam.apache.org/job/beam_PostCommit_Python310/ws/src/sdks/python/test-suites/dataflow/common.gradle'> line: 111
* What went wrong:
Execution failed for task ':sdks:python:test-suites:dataflow:py310:postCommitIT'.
> Process 'command 'sh'' finished with non-zero exit value 1
* Try:
> Run with --stacktrace option to get the stack trace.
> Run with --info or --debug option to get more log output.
* Get more help at https://help.gradle.org
Deprecated Gradle features were used in this build, making it incompatible with Gradle 8.0.
You can use '--warning-mode all' to show the individual deprecation warnings and determine if they come from your own scripts or plugins.
See https://docs.gradle.org/7.5.1/userguide/command_line_interface.html#sec:command_line_warnings
Execution optimizations have been disabled for 1 invalid unit(s) of work during this build to ensure correctness.
Please consult deprecation warnings for more details.
BUILD FAILED in 3h 17m 32s
207 actionable tasks: 142 executed, 59 from cache, 6 up-to-date
Publishing build scan...
https://gradle.com/s/2cxry6cl2sxgc
Build step 'Invoke Gradle script' changed build result to FAILURE
Build step 'Invoke Gradle script' marked build as failure
---------------------------------------------------------------------
To unsubscribe, e-mail: builds-unsubscribe@beam.apache.org
For additional commands, e-mail: builds-help@beam.apache.org
Build failed in Jenkins: beam_PostCommit_Python310 #635
Posted by Apache Jenkins Server <je...@builds.apache.org>.
See <https://ci-beam.apache.org/job/beam_PostCommit_Python310/635/display/redirect>
Changes:
------------------------------------------
[...truncated 11.78 MB...]
apache_beam/examples/complete/game/hourly_team_score_it_test.py: 1 warning
apache_beam/io/gcp/bigquery_file_loads_test.py: 3 warnings
apache_beam/io/gcp/bigquery_write_it_test.py: 3 warnings
apache_beam/io/gcp/bigquery_test.py: 3 warnings
apache_beam/io/gcp/big_query_query_to_table_it_test.py: 4 warnings
<https://ci-beam.apache.org/job/beam_PostCommit_Python310/ws/src/sdks/python/apache_beam/io/gcp/bigquery_file_loads.py>:1173: BeamDeprecationWarning: options is deprecated since First stable release. References to <pipeline>.options will not be supported
temp_location = p.options.view_as(GoogleCloudOptions).temp_location
apache_beam/examples/cookbook/bigquery_tornadoes_it_test.py: 1 warning
apache_beam/examples/complete/game/hourly_team_score_it_test.py: 1 warning
apache_beam/io/gcp/bigquery_file_loads_test.py: 3 warnings
apache_beam/io/gcp/bigquery_write_it_test.py: 3 warnings
apache_beam/io/gcp/bigquery_test.py: 3 warnings
apache_beam/io/gcp/big_query_query_to_table_it_test.py: 4 warnings
<https://ci-beam.apache.org/job/beam_PostCommit_Python310/ws/src/sdks/python/apache_beam/io/gcp/bigquery_file_loads.py>:1175: BeamDeprecationWarning: options is deprecated since First stable release. References to <pipeline>.options will not be supported
p.options.view_as(GoogleCloudOptions).job_name or 'AUTOMATIC_JOB_NAME')
apache_beam/examples/cookbook/bigquery_tornadoes_it_test.py::BigqueryTornadoesIT::test_bigquery_tornadoes_it
<https://ci-beam.apache.org/job/beam_PostCommit_Python310/ws/src/sdks/python/apache_beam/io/gcp/tests/utils.py>:100: PendingDeprecationWarning: Client.dataset is deprecated and will be removed in a future version. Use a string like 'my_project.my_dataset' or a cloud.google.bigquery.DatasetReference object, instead.
table_ref = client.dataset(dataset_id).table(table_id)
apache_beam/examples/dataframe/flight_delays_it_test.py::FlightDelaysTest::test_flight_delays
<https://ci-beam.apache.org/job/beam_PostCommit_Python310/ws/src/sdks/python/apache_beam/examples/dataframe/flight_delays.py>:47: FutureWarning: The default value of numeric_only in DataFrame.mean is deprecated. In a future version, it will default to False. In addition, specifying 'numeric_only=None' is deprecated. Select only valid columns or specify the value of numeric_only to silence this warning.
return airline_df[at_top_airports].mean()
apache_beam/examples/dataframe/flight_delays_it_test.py::FlightDelaysTest::test_flight_delays
apache_beam/examples/dataframe/taxiride_it_test.py::TaxirideIT::test_aggregation
apache_beam/examples/dataframe/taxiride_it_test.py::TaxirideIT::test_enrich
<https://ci-beam.apache.org/job/beam_PostCommit_Python310/ws/src/sdks/python/apache_beam/dataframe/io.py>:659: FutureWarning: WriteToFiles is experimental.
return pcoll | fileio.WriteToFiles(
apache_beam/examples/dataframe/flight_delays_it_test.py::FlightDelaysTest::test_flight_delays
apache_beam/examples/dataframe/taxiride_it_test.py::TaxirideIT::test_aggregation
apache_beam/examples/dataframe/taxiride_it_test.py::TaxirideIT::test_enrich
<https://ci-beam.apache.org/job/beam_PostCommit_Python310/ws/src/sdks/python/apache_beam/io/fileio.py>:596: BeamDeprecationWarning: options is deprecated since First stable release. References to <pipeline>.options will not be supported
p.options.view_as(GoogleCloudOptions).temp_location or
apache_beam/io/gcp/bigquery_test.py::BigQueryStreamingInsertTransformIntegrationTests::test_multiple_destinations_transform
<https://ci-beam.apache.org/job/beam_PostCommit_Python310/ws/src/sdks/python/apache_beam/io/gcp/bigquery_test.py>:1694: BeamDeprecationWarning: options is deprecated since First stable release. References to <pipeline>.options will not be supported
streaming = self.test_pipeline.options.view_as(StandardOptions).streaming
apache_beam/io/gcp/bigquery_read_it_test.py::ReadTests::test_native_source
<https://ci-beam.apache.org/job/beam_PostCommit_Python310/ws/src/sdks/python/apache_beam/io/gcp/bigquery_read_it_test.py>:170: BeamDeprecationWarning: BigQuerySource is deprecated since 2.25.0. Use ReadFromBigQuery instead.
beam.io.BigQuerySource(query=self.query, use_standard_sql=True)))
apache_beam/ml/gcp/cloud_dlp_it_test.py::CloudDLPIT::test_deidentification
<https://ci-beam.apache.org/job/beam_PostCommit_Python310/ws/src/sdks/python/apache_beam/ml/gcp/cloud_dlp_it_test.py>:74: FutureWarning: MaskDetectedDetails is experimental.
| MaskDetectedDetails(
apache_beam/ml/gcp/cloud_dlp_it_test.py::CloudDLPIT::test_inspection
<https://ci-beam.apache.org/job/beam_PostCommit_Python310/ws/src/sdks/python/apache_beam/ml/gcp/cloud_dlp_it_test.py>:85: FutureWarning: InspectForDetails is experimental.
| InspectForDetails(
apache_beam/ml/inference/sklearn_inference_it_test.py::SklearnInference::test_sklearn_regression
<https://ci-beam.apache.org/job/beam_PostCommit_Python310/ws/src/sdks/python/apache_beam/examples/inference/sklearn_japanese_housing_regression.py>:128: FutureWarning: SklearnModelHandlerPandas is experimental. No backwards-compatibility guarantees.
model_loader = SklearnModelHandlerPandas(
apache_beam/ml/inference/sklearn_inference_it_test.py::SklearnInference::test_sklearn_regression
<https://ci-beam.apache.org/job/beam_PostCommit_Python310/ws/src/build/gradleenv/2050596098/lib/python3.10/site-packages/dill/_dill.py>:472: FutureWarning: SklearnModelHandlerPandas is experimental. No backwards-compatibility guarantees.
obj = StockUnpickler.load(self)
apache_beam/io/gcp/bigquery_read_it_test.py::ReadNewTypesTests::test_native_source
<https://ci-beam.apache.org/job/beam_PostCommit_Python310/ws/src/sdks/python/apache_beam/io/gcp/bigquery_read_it_test.py>:693: BeamDeprecationWarning: BigQuerySource is deprecated since 2.25.0. Use ReadFromBigQuery instead.
beam.io.BigQuerySource(query=self.query, use_standard_sql=True)))
apache_beam/io/gcp/bigquery_read_it_test.py::ReadAllBQTests::test_read_queries
<https://ci-beam.apache.org/job/beam_PostCommit_Python310/ws/src/sdks/python/apache_beam/io/gcp/bigquery_read_it_test.py>:808: FutureWarning: ReadAllFromBigQuery is experimental.
| beam.io.ReadAllFromBigQuery())
apache_beam/io/gcp/bigquery_read_it_test.py::ReadAllBQTests::test_read_queries
<https://ci-beam.apache.org/job/beam_PostCommit_Python310/ws/src/sdks/python/apache_beam/io/gcp/bigquery.py>:2665: BeamDeprecationWarning: options is deprecated since First stable release. References to <pipeline>.options will not be supported
job_name = pcoll.pipeline.options.view_as(GoogleCloudOptions).job_name
apache_beam/io/gcp/bigquery_read_it_test.py::ReadAllBQTests::test_read_queries
<https://ci-beam.apache.org/job/beam_PostCommit_Python310/ws/src/sdks/python/apache_beam/io/gcp/bigquery.py>:2666: BeamDeprecationWarning: options is deprecated since First stable release. References to <pipeline>.options will not be supported
project = pcoll.pipeline.options.view_as(GoogleCloudOptions).project
apache_beam/io/gcp/bigquery_read_it_test.py::ReadAllBQTests::test_read_queries
<https://ci-beam.apache.org/job/beam_PostCommit_Python310/ws/src/sdks/python/apache_beam/io/gcp/bigquery.py>:2679: BeamDeprecationWarning: options is deprecated since First stable release. References to <pipeline>.options will not be supported
options=pcoll.pipeline.options,
-- Docs: https://docs.pytest.org/en/stable/how-to/capture-warnings.html
- generated xml file: <https://ci-beam.apache.org/job/beam_PostCommit_Python310/ws/src/sdks/python/pytest_postCommitIT-df-py310.xml> -
[36m[1m=========================== short test summary info ============================[0m
[31mFAILED[0m apache_beam/ml/inference/sklearn_inference_it_test.py::[1mSklearnInference::test_sklearn_regression[0m - apache_beam.runners.dataflow.dataflow_runner.DataflowRuntimeException: Dataflow pipeline failed. State: FAILED, Error:
Traceback (most recent call last):
File "apache_beam/runners/common.py", line 1418, in apache_beam.runners.common.DoFnRunner.process
File "apache_beam/runners/common.py", line 838, in apache_beam.runners.common.PerWindowInvoker.invoke_process
File "apache_beam/runners/common.py", line 984, in apache_beam.runners.common.PerWindowInvoker._invoke_process_per_window
File "/usr/local/lib/python3.10/site-packages/apache_beam/ml/inference/base.py", line 552, in process
return self._run_inference(batch, inference_args)
File "/usr/local/lib/python3.10/site-packages/apache_beam/ml/inference/base.py", line 521, in _run_inference
raise e
File "/usr/local/lib/python3.10/site-packages/apache_beam/ml/inference/base.py", line 517, in _run_inference
result_generator = self._model_handler.run_inference(
File "/usr/local/lib/python3.10/site-packages/apache_beam/ml/inference/sklearn_inference.py", line 268, in run_inference
predictions, splits = self._model_inference_fn(model, batch, inference_args)
File "/usr/local/lib/python3.10/site-packages/apache_beam/ml/inference/sklearn_inference.py", line 185, in _default_pandas_inference_fn
predictions = model.predict(vectorized_batch)
File "/usr/local/lib/python3.10/site-packages/sklearn/pipeline.py", line 480, in predict
Xt = transform.transform(Xt)
File "/usr/local/lib/python3.10/site-packages/sklearn/utils/_set_output.py", line 140, in wrapped
data_to_wrap = f(self, X, *args, **kwargs)
File "/usr/local/lib/python3.10/site-packages/sklearn/compose/_column_transformer.py", line 800, in transform
Xs = self._fit_transform(
File "/usr/local/lib/python3.10/site-packages/sklearn/compose/_column_transformer.py", line 652, in _fit_transform
transformers = list(
File "/usr/local/lib/python3.10/site-packages/sklearn/compose/_column_transformer.py", line 349, in _iter
transformers = [
File "/usr/local/lib/python3.10/site-packages/sklearn/compose/_column_transformer.py", line 350, in <listcomp>
replace_passthrough(*trans) for trans in self.transformers_
File "/usr/local/lib/python3.10/site-packages/sklearn/compose/_column_transformer.py", line 345, in replace_passthrough
if name not in self._name_to_fitted_passthrough:
AttributeError: 'ColumnTransformer' object has no attribute '_name_to_fitted_passthrough'
During handling of the above exception, another exception occurred:
Traceback (most recent call last):
File "/usr/local/lib/python3.10/site-packages/apache_beam/runners/worker/sdk_worker.py", line 295, in _execute
response = task()
File "/usr/local/lib/python3.10/site-packages/apache_beam/runners/worker/sdk_worker.py", line 370, in <lambda>
lambda: self.create_worker().do_instruction(request), request)
File "/usr/local/lib/python3.10/site-packages/apache_beam/runners/worker/sdk_worker.py", line 629, in do_instruction
return getattr(self, request_type)(
File "/usr/local/lib/python3.10/site-packages/apache_beam/runners/worker/sdk_worker.py", line 667, in process_bundle
bundle_processor.process_bundle(instruction_id))
File "/usr/local/lib/python3.10/site-packages/apache_beam/runners/worker/bundle_processor.py", line 1062, in process_bundle
input_op_by_transform_id[element.transform_id].process_encoded(
File "/usr/local/lib/python3.10/site-packages/apache_beam/runners/worker/bundle_processor.py", line 232, in process_encoded
self.output(decoded_value)
File "apache_beam/runners/worker/operations.py", line 526, in apache_beam.runners.worker.operations.Operation.output
File "apache_beam/runners/worker/operations.py", line 528, in apache_beam.runners.worker.operations.Operation.output
File "apache_beam/runners/worker/operations.py", line 237, in apache_beam.runners.worker.operations.SingletonElementConsumerSet.receive
File "apache_beam/runners/worker/operations.py", line 240, in apache_beam.runners.worker.operations.SingletonElementConsumerSet.receive
File "apache_beam/runners/worker/operations.py", line 907, in apache_beam.runners.worker.operations.DoOperation.process
File "apache_beam/runners/worker/operations.py", line 908, in apache_beam.runners.worker.operations.DoOperation.process
File "apache_beam/runners/common.py", line 1420, in apache_beam.runners.common.DoFnRunner.process
File "apache_beam/runners/common.py", line 1492, in apache_beam.runners.common.DoFnRunner._reraise_augmented
File "apache_beam/runners/common.py", line 1418, in apache_beam.runners.common.DoFnRunner.process
File "apache_beam/runners/common.py", line 624, in apache_beam.runners.common.SimpleInvoker.invoke_process
File "apache_beam/runners/common.py", line 1582, in apache_beam.runners.common._OutputHandler.handle_process_outputs
File "apache_beam/runners/common.py", line 1695, in apache_beam.runners.common._OutputHandler._write_value_to_tag
File "apache_beam/runners/worker/operations.py", line 240, in apache_beam.runners.worker.operations.SingletonElementConsumerSet.receive
File "apache_beam/runners/worker/operations.py", line 907, in apache_beam.runners.worker.operations.DoOperation.process
File "apache_beam/runners/worker/operations.py", line 908, in apache_beam.runners.worker.operations.DoOperation.process
File "apache_beam/runners/common.py", line 1420, in apache_beam.runners.common.DoFnRunner.process
File "apache_beam/runners/common.py", line 1492, in apache_beam.runners.common.DoFnRunner._reraise_augmented
File "apache_beam/runners/common.py", line 1418, in apache_beam.runners.common.DoFnRunner.process
File "apache_beam/runners/common.py", line 624, in apache_beam.runners.common.SimpleInvoker.invoke_process
File "apache_beam/runners/common.py", line 1582, in apache_beam.runners.common._OutputHandler.handle_process_outputs
File "apache_beam/runners/common.py", line 1695, in apache_beam.runners.common._OutputHandler._write_value_to_tag
File "apache_beam/runners/worker/operations.py", line 240, in apache_beam.runners.worker.operations.SingletonElementConsumerSet.receive
File "apache_beam/runners/worker/operations.py", line 907, in apache_beam.runners.worker.operations.DoOperation.process
File "apache_beam/runners/worker/operations.py", line 908, in apache_beam.runners.worker.operations.DoOperation.process
File "apache_beam/runners/common.py", line 1420, in apache_beam.runners.common.DoFnRunner.process
File "apache_beam/runners/common.py", line 1492, in apache_beam.runners.common.DoFnRunner._reraise_augmented
File "apache_beam/runners/common.py", line 1418, in apache_beam.runners.common.DoFnRunner.process
File "apache_beam/runners/common.py", line 624, in apache_beam.runners.common.SimpleInvoker.invoke_process
File "apache_beam/runners/common.py", line 1582, in apache_beam.runners.common._OutputHandler.handle_process_outputs
File "apache_beam/runners/common.py", line 1695, in apache_beam.runners.common._OutputHandler._write_value_to_tag
File "apache_beam/runners/worker/operations.py", line 240, in apache_beam.runners.worker.operations.SingletonElementConsumerSet.receive
File "apache_beam/runners/worker/operations.py", line 907, in apache_beam.runners.worker.operations.DoOperation.process
File "apache_beam/runners/worker/operations.py", line 908, in apache_beam.runners.worker.operations.DoOperation.process
File "apache_beam/runners/common.py", line 1420, in apache_beam.runners.common.DoFnRunner.process
File "apache_beam/runners/common.py", line 1492, in apache_beam.runners.common.DoFnRunner._reraise_augmented
File "apache_beam/runners/common.py", line 1418, in apache_beam.runners.common.DoFnRunner.process
File "apache_beam/runners/common.py", line 838, in apache_beam.runners.common.PerWindowInvoker.invoke_process
File "apache_beam/runners/common.py", line 982, in apache_beam.runners.common.PerWindowInvoker._invoke_process_per_window
File "apache_beam/runners/common.py", line 1582, in apache_beam.runners.common._OutputHandler.handle_process_outputs
File "apache_beam/runners/common.py", line 1697, in apache_beam.runners.common._OutputHandler._write_value_to_tag
File "apache_beam/runners/worker/operations.py", line 237, in apache_beam.runners.worker.operations.SingletonElementConsumerSet.receive
File "apache_beam/runners/worker/operations.py", line 240, in apache_beam.runners.worker.operations.SingletonElementConsumerSet.receive
File "apache_beam/runners/worker/operations.py", line 907, in apache_beam.runners.worker.operations.DoOperation.process
File "apache_beam/runners/worker/operations.py", line 908, in apache_beam.runners.worker.operations.DoOperation.process
File "apache_beam/runners/common.py", line 1420, in apache_beam.runners.common.DoFnRunner.process
File "apache_beam/runners/common.py", line 1492, in apache_beam.runners.common.DoFnRunner._reraise_augmented
File "apache_beam/runners/common.py", line 1418, in apache_beam.runners.common.DoFnRunner.process
File "apache_beam/runners/common.py", line 624, in apache_beam.runners.common.SimpleInvoker.invoke_process
File "apache_beam/runners/common.py", line 1582, in apache_beam.runners.common._OutputHandler.handle_process_outputs
File "apache_beam/runners/common.py", line 1695, in apache_beam.runners.common._OutputHandler._write_value_to_tag
File "apache_beam/runners/worker/operations.py", line 240, in apache_beam.runners.worker.operations.SingletonElementConsumerSet.receive
File "apache_beam/runners/worker/operations.py", line 907, in apache_beam.runners.worker.operations.DoOperation.process
File "apache_beam/runners/worker/operations.py", line 908, in apache_beam.runners.worker.operations.DoOperation.process
File "apache_beam/runners/common.py", line 1420, in apache_beam.runners.common.DoFnRunner.process
File "apache_beam/runners/common.py", line 1508, in apache_beam.runners.common.DoFnRunner._reraise_augmented
File "apache_beam/runners/common.py", line 1418, in apache_beam.runners.common.DoFnRunner.process
File "apache_beam/runners/common.py", line 838, in apache_beam.runners.common.PerWindowInvoker.invoke_process
File "apache_beam/runners/common.py", line 984, in apache_beam.runners.common.PerWindowInvoker._invoke_process_per_window
File "/usr/local/lib/python3.10/site-packages/apache_beam/ml/inference/base.py", line 552, in process
return self._run_inference(batch, inference_args)
File "/usr/local/lib/python3.10/site-packages/apache_beam/ml/inference/base.py", line 521, in _run_inference
raise e
File "/usr/local/lib/python3.10/site-packages/apache_beam/ml/inference/base.py", line 517, in _run_inference
result_generator = self._model_handler.run_inference(
File "/usr/local/lib/python3.10/site-packages/apache_beam/ml/inference/sklearn_inference.py", line 268, in run_inference
predictions, splits = self._model_inference_fn(model, batch, inference_args)
File "/usr/local/lib/python3.10/site-packages/apache_beam/ml/inference/sklearn_inference.py", line 185, in _default_pandas_inference_fn
predictions = model.predict(vectorized_batch)
File "/usr/local/lib/python3.10/site-packages/sklearn/pipeline.py", line 480, in predict
Xt = transform.transform(Xt)
File "/usr/local/lib/python3.10/site-packages/sklearn/utils/_set_output.py", line 140, in wrapped
data_to_wrap = f(self, X, *args, **kwargs)
File "/usr/local/lib/python3.10/site-packages/sklearn/compose/_column_transformer.py", line 800, in transform
Xs = self._fit_transform(
File "/usr/local/lib/python3.10/site-packages/sklearn/compose/_column_transformer.py", line 652, in _fit_transform
transformers = list(
File "/usr/local/lib/python3.10/site-packages/sklearn/compose/_column_transformer.py", line 349, in _iter
transformers = [
File "/usr/local/lib/python3.10/site-packages/sklearn/compose/_column_transformer.py", line 350, in <listcomp>
replace_passthrough(*trans) for trans in self.transformers_
File "/usr/local/lib/python3.10/site-packages/sklearn/compose/_column_transformer.py", line 345, in replace_passthrough
if name not in self._name_to_fitted_passthrough:
AttributeError: 'ColumnTransformer' object has no attribute '_name_to_fitted_passthrough' [while running 'RunInference all_features/BeamML_RunInference-ptransform-145']
[31m===== [31m[1m1 failed[0m, [32m82 passed[0m, [33m39 skipped[0m, [33m616 warnings[0m[31m in 10724.99s (2:58:44)[0m[31m =====[0m
> Task :sdks:python:test-suites:dataflow:py310:postCommitIT FAILED
FAILURE: Build failed with an exception.
* Where:
Script '<https://ci-beam.apache.org/job/beam_PostCommit_Python310/ws/src/sdks/python/test-suites/dataflow/common.gradle'> line: 111
* What went wrong:
Execution failed for task ':sdks:python:test-suites:dataflow:py310:postCommitIT'.
> Process 'command 'sh'' finished with non-zero exit value 1
* Try:
> Run with --stacktrace option to get the stack trace.
> Run with --info or --debug option to get more log output.
* Get more help at https://help.gradle.org
Deprecated Gradle features were used in this build, making it incompatible with Gradle 8.0.
You can use '--warning-mode all' to show the individual deprecation warnings and determine if they come from your own scripts or plugins.
See https://docs.gradle.org/7.5.1/userguide/command_line_interface.html#sec:command_line_warnings
Execution optimizations have been disabled for 1 invalid unit(s) of work during this build to ensure correctness.
Please consult deprecation warnings for more details.
BUILD FAILED in 3h 51s
207 actionable tasks: 144 executed, 57 from cache, 6 up-to-date
Publishing build scan...
https://gradle.com/s/3j6n5foak3eyq
Build step 'Invoke Gradle script' changed build result to FAILURE
Build step 'Invoke Gradle script' marked build as failure
---------------------------------------------------------------------
To unsubscribe, e-mail: builds-unsubscribe@beam.apache.org
For additional commands, e-mail: builds-help@beam.apache.org
Build failed in Jenkins: beam_PostCommit_Python310 #634
Posted by Apache Jenkins Server <je...@builds.apache.org>.
See <https://ci-beam.apache.org/job/beam_PostCommit_Python310/634/display/redirect>
Changes:
------------------------------------------
[...truncated 11.77 MB...]
apache_beam/examples/complete/game/hourly_team_score_it_test.py: 1 warning
apache_beam/io/gcp/big_query_query_to_table_it_test.py: 4 warnings
apache_beam/io/gcp/bigquery_write_it_test.py: 3 warnings
apache_beam/io/gcp/bigquery_test.py: 3 warnings
apache_beam/io/gcp/bigquery_file_loads_test.py: 3 warnings
<https://ci-beam.apache.org/job/beam_PostCommit_Python310/ws/src/sdks/python/apache_beam/io/gcp/bigquery_file_loads.py>:1173: BeamDeprecationWarning: options is deprecated since First stable release. References to <pipeline>.options will not be supported
temp_location = p.options.view_as(GoogleCloudOptions).temp_location
apache_beam/examples/cookbook/bigquery_tornadoes_it_test.py: 1 warning
apache_beam/examples/complete/game/hourly_team_score_it_test.py: 1 warning
apache_beam/io/gcp/big_query_query_to_table_it_test.py: 4 warnings
apache_beam/io/gcp/bigquery_write_it_test.py: 3 warnings
apache_beam/io/gcp/bigquery_test.py: 3 warnings
apache_beam/io/gcp/bigquery_file_loads_test.py: 3 warnings
<https://ci-beam.apache.org/job/beam_PostCommit_Python310/ws/src/sdks/python/apache_beam/io/gcp/bigquery_file_loads.py>:1175: BeamDeprecationWarning: options is deprecated since First stable release. References to <pipeline>.options will not be supported
p.options.view_as(GoogleCloudOptions).job_name or 'AUTOMATIC_JOB_NAME')
apache_beam/examples/cookbook/bigquery_tornadoes_it_test.py::BigqueryTornadoesIT::test_bigquery_tornadoes_it
<https://ci-beam.apache.org/job/beam_PostCommit_Python310/ws/src/sdks/python/apache_beam/io/gcp/tests/utils.py>:100: PendingDeprecationWarning: Client.dataset is deprecated and will be removed in a future version. Use a string like 'my_project.my_dataset' or a cloud.google.bigquery.DatasetReference object, instead.
table_ref = client.dataset(dataset_id).table(table_id)
apache_beam/examples/dataframe/flight_delays_it_test.py::FlightDelaysTest::test_flight_delays
<https://ci-beam.apache.org/job/beam_PostCommit_Python310/ws/src/sdks/python/apache_beam/examples/dataframe/flight_delays.py>:47: FutureWarning: The default value of numeric_only in DataFrame.mean is deprecated. In a future version, it will default to False. In addition, specifying 'numeric_only=None' is deprecated. Select only valid columns or specify the value of numeric_only to silence this warning.
return airline_df[at_top_airports].mean()
apache_beam/examples/dataframe/flight_delays_it_test.py::FlightDelaysTest::test_flight_delays
apache_beam/examples/dataframe/taxiride_it_test.py::TaxirideIT::test_aggregation
apache_beam/examples/dataframe/taxiride_it_test.py::TaxirideIT::test_enrich
<https://ci-beam.apache.org/job/beam_PostCommit_Python310/ws/src/sdks/python/apache_beam/dataframe/io.py>:659: FutureWarning: WriteToFiles is experimental.
return pcoll | fileio.WriteToFiles(
apache_beam/examples/dataframe/flight_delays_it_test.py::FlightDelaysTest::test_flight_delays
apache_beam/examples/dataframe/taxiride_it_test.py::TaxirideIT::test_aggregation
apache_beam/examples/dataframe/taxiride_it_test.py::TaxirideIT::test_enrich
<https://ci-beam.apache.org/job/beam_PostCommit_Python310/ws/src/sdks/python/apache_beam/io/fileio.py>:596: BeamDeprecationWarning: options is deprecated since First stable release. References to <pipeline>.options will not be supported
p.options.view_as(GoogleCloudOptions).temp_location or
apache_beam/io/gcp/bigquery_test.py::BigQueryStreamingInsertTransformIntegrationTests::test_multiple_destinations_transform
<https://ci-beam.apache.org/job/beam_PostCommit_Python310/ws/src/sdks/python/apache_beam/io/gcp/bigquery_test.py>:1694: BeamDeprecationWarning: options is deprecated since First stable release. References to <pipeline>.options will not be supported
streaming = self.test_pipeline.options.view_as(StandardOptions).streaming
apache_beam/io/gcp/bigquery_read_it_test.py::ReadTests::test_native_source
<https://ci-beam.apache.org/job/beam_PostCommit_Python310/ws/src/sdks/python/apache_beam/io/gcp/bigquery_read_it_test.py>:170: BeamDeprecationWarning: BigQuerySource is deprecated since 2.25.0. Use ReadFromBigQuery instead.
beam.io.BigQuerySource(query=self.query, use_standard_sql=True)))
apache_beam/ml/gcp/cloud_dlp_it_test.py::CloudDLPIT::test_deidentification
<https://ci-beam.apache.org/job/beam_PostCommit_Python310/ws/src/sdks/python/apache_beam/ml/gcp/cloud_dlp_it_test.py>:74: FutureWarning: MaskDetectedDetails is experimental.
| MaskDetectedDetails(
apache_beam/ml/gcp/cloud_dlp_it_test.py::CloudDLPIT::test_inspection
<https://ci-beam.apache.org/job/beam_PostCommit_Python310/ws/src/sdks/python/apache_beam/ml/gcp/cloud_dlp_it_test.py>:85: FutureWarning: InspectForDetails is experimental.
| InspectForDetails(
apache_beam/ml/inference/sklearn_inference_it_test.py::SklearnInference::test_sklearn_regression
<https://ci-beam.apache.org/job/beam_PostCommit_Python310/ws/src/sdks/python/apache_beam/examples/inference/sklearn_japanese_housing_regression.py>:128: FutureWarning: SklearnModelHandlerPandas is experimental. No backwards-compatibility guarantees.
model_loader = SklearnModelHandlerPandas(
apache_beam/ml/inference/sklearn_inference_it_test.py::SklearnInference::test_sklearn_regression
<https://ci-beam.apache.org/job/beam_PostCommit_Python310/ws/src/build/gradleenv/2050596098/lib/python3.10/site-packages/dill/_dill.py>:472: FutureWarning: SklearnModelHandlerPandas is experimental. No backwards-compatibility guarantees.
obj = StockUnpickler.load(self)
apache_beam/io/gcp/bigquery_read_it_test.py::ReadNewTypesTests::test_native_source
<https://ci-beam.apache.org/job/beam_PostCommit_Python310/ws/src/sdks/python/apache_beam/io/gcp/bigquery_read_it_test.py>:693: BeamDeprecationWarning: BigQuerySource is deprecated since 2.25.0. Use ReadFromBigQuery instead.
beam.io.BigQuerySource(query=self.query, use_standard_sql=True)))
apache_beam/io/gcp/bigquery_read_it_test.py::ReadAllBQTests::test_read_queries
<https://ci-beam.apache.org/job/beam_PostCommit_Python310/ws/src/sdks/python/apache_beam/io/gcp/bigquery_read_it_test.py>:808: FutureWarning: ReadAllFromBigQuery is experimental.
| beam.io.ReadAllFromBigQuery())
apache_beam/io/gcp/bigquery_read_it_test.py::ReadAllBQTests::test_read_queries
<https://ci-beam.apache.org/job/beam_PostCommit_Python310/ws/src/sdks/python/apache_beam/io/gcp/bigquery.py>:2665: BeamDeprecationWarning: options is deprecated since First stable release. References to <pipeline>.options will not be supported
job_name = pcoll.pipeline.options.view_as(GoogleCloudOptions).job_name
apache_beam/io/gcp/bigquery_read_it_test.py::ReadAllBQTests::test_read_queries
<https://ci-beam.apache.org/job/beam_PostCommit_Python310/ws/src/sdks/python/apache_beam/io/gcp/bigquery.py>:2666: BeamDeprecationWarning: options is deprecated since First stable release. References to <pipeline>.options will not be supported
project = pcoll.pipeline.options.view_as(GoogleCloudOptions).project
apache_beam/io/gcp/bigquery_read_it_test.py::ReadAllBQTests::test_read_queries
<https://ci-beam.apache.org/job/beam_PostCommit_Python310/ws/src/sdks/python/apache_beam/io/gcp/bigquery.py>:2679: BeamDeprecationWarning: options is deprecated since First stable release. References to <pipeline>.options will not be supported
options=pcoll.pipeline.options,
-- Docs: https://docs.pytest.org/en/stable/how-to/capture-warnings.html
- generated xml file: <https://ci-beam.apache.org/job/beam_PostCommit_Python310/ws/src/sdks/python/pytest_postCommitIT-df-py310.xml> -
[36m[1m=========================== short test summary info ============================[0m
[31mFAILED[0m apache_beam/ml/inference/sklearn_inference_it_test.py::[1mSklearnInference::test_sklearn_regression[0m - apache_beam.runners.dataflow.dataflow_runner.DataflowRuntimeException: Dataflow pipeline failed. State: FAILED, Error:
Traceback (most recent call last):
File "apache_beam/runners/common.py", line 1418, in apache_beam.runners.common.DoFnRunner.process
File "apache_beam/runners/common.py", line 838, in apache_beam.runners.common.PerWindowInvoker.invoke_process
File "apache_beam/runners/common.py", line 984, in apache_beam.runners.common.PerWindowInvoker._invoke_process_per_window
File "/usr/local/lib/python3.10/site-packages/apache_beam/ml/inference/base.py", line 552, in process
return self._run_inference(batch, inference_args)
File "/usr/local/lib/python3.10/site-packages/apache_beam/ml/inference/base.py", line 521, in _run_inference
raise e
File "/usr/local/lib/python3.10/site-packages/apache_beam/ml/inference/base.py", line 517, in _run_inference
result_generator = self._model_handler.run_inference(
File "/usr/local/lib/python3.10/site-packages/apache_beam/ml/inference/sklearn_inference.py", line 268, in run_inference
predictions, splits = self._model_inference_fn(model, batch, inference_args)
File "/usr/local/lib/python3.10/site-packages/apache_beam/ml/inference/sklearn_inference.py", line 185, in _default_pandas_inference_fn
predictions = model.predict(vectorized_batch)
File "/usr/local/lib/python3.10/site-packages/sklearn/pipeline.py", line 480, in predict
Xt = transform.transform(Xt)
File "/usr/local/lib/python3.10/site-packages/sklearn/utils/_set_output.py", line 140, in wrapped
data_to_wrap = f(self, X, *args, **kwargs)
File "/usr/local/lib/python3.10/site-packages/sklearn/compose/_column_transformer.py", line 800, in transform
Xs = self._fit_transform(
File "/usr/local/lib/python3.10/site-packages/sklearn/compose/_column_transformer.py", line 652, in _fit_transform
transformers = list(
File "/usr/local/lib/python3.10/site-packages/sklearn/compose/_column_transformer.py", line 349, in _iter
transformers = [
File "/usr/local/lib/python3.10/site-packages/sklearn/compose/_column_transformer.py", line 350, in <listcomp>
replace_passthrough(*trans) for trans in self.transformers_
File "/usr/local/lib/python3.10/site-packages/sklearn/compose/_column_transformer.py", line 345, in replace_passthrough
if name not in self._name_to_fitted_passthrough:
AttributeError: 'ColumnTransformer' object has no attribute '_name_to_fitted_passthrough'
During handling of the above exception, another exception occurred:
Traceback (most recent call last):
File "/usr/local/lib/python3.10/site-packages/apache_beam/runners/worker/sdk_worker.py", line 295, in _execute
response = task()
File "/usr/local/lib/python3.10/site-packages/apache_beam/runners/worker/sdk_worker.py", line 370, in <lambda>
lambda: self.create_worker().do_instruction(request), request)
File "/usr/local/lib/python3.10/site-packages/apache_beam/runners/worker/sdk_worker.py", line 629, in do_instruction
return getattr(self, request_type)(
File "/usr/local/lib/python3.10/site-packages/apache_beam/runners/worker/sdk_worker.py", line 667, in process_bundle
bundle_processor.process_bundle(instruction_id))
File "/usr/local/lib/python3.10/site-packages/apache_beam/runners/worker/bundle_processor.py", line 1062, in process_bundle
input_op_by_transform_id[element.transform_id].process_encoded(
File "/usr/local/lib/python3.10/site-packages/apache_beam/runners/worker/bundle_processor.py", line 232, in process_encoded
self.output(decoded_value)
File "apache_beam/runners/worker/operations.py", line 526, in apache_beam.runners.worker.operations.Operation.output
File "apache_beam/runners/worker/operations.py", line 528, in apache_beam.runners.worker.operations.Operation.output
File "apache_beam/runners/worker/operations.py", line 237, in apache_beam.runners.worker.operations.SingletonElementConsumerSet.receive
File "apache_beam/runners/worker/operations.py", line 240, in apache_beam.runners.worker.operations.SingletonElementConsumerSet.receive
File "apache_beam/runners/worker/operations.py", line 907, in apache_beam.runners.worker.operations.DoOperation.process
File "apache_beam/runners/worker/operations.py", line 908, in apache_beam.runners.worker.operations.DoOperation.process
File "apache_beam/runners/common.py", line 1420, in apache_beam.runners.common.DoFnRunner.process
File "apache_beam/runners/common.py", line 1492, in apache_beam.runners.common.DoFnRunner._reraise_augmented
File "apache_beam/runners/common.py", line 1418, in apache_beam.runners.common.DoFnRunner.process
File "apache_beam/runners/common.py", line 624, in apache_beam.runners.common.SimpleInvoker.invoke_process
File "apache_beam/runners/common.py", line 1582, in apache_beam.runners.common._OutputHandler.handle_process_outputs
File "apache_beam/runners/common.py", line 1695, in apache_beam.runners.common._OutputHandler._write_value_to_tag
File "apache_beam/runners/worker/operations.py", line 240, in apache_beam.runners.worker.operations.SingletonElementConsumerSet.receive
File "apache_beam/runners/worker/operations.py", line 907, in apache_beam.runners.worker.operations.DoOperation.process
File "apache_beam/runners/worker/operations.py", line 908, in apache_beam.runners.worker.operations.DoOperation.process
File "apache_beam/runners/common.py", line 1420, in apache_beam.runners.common.DoFnRunner.process
File "apache_beam/runners/common.py", line 1492, in apache_beam.runners.common.DoFnRunner._reraise_augmented
File "apache_beam/runners/common.py", line 1418, in apache_beam.runners.common.DoFnRunner.process
File "apache_beam/runners/common.py", line 624, in apache_beam.runners.common.SimpleInvoker.invoke_process
File "apache_beam/runners/common.py", line 1582, in apache_beam.runners.common._OutputHandler.handle_process_outputs
File "apache_beam/runners/common.py", line 1695, in apache_beam.runners.common._OutputHandler._write_value_to_tag
File "apache_beam/runners/worker/operations.py", line 240, in apache_beam.runners.worker.operations.SingletonElementConsumerSet.receive
File "apache_beam/runners/worker/operations.py", line 907, in apache_beam.runners.worker.operations.DoOperation.process
File "apache_beam/runners/worker/operations.py", line 908, in apache_beam.runners.worker.operations.DoOperation.process
File "apache_beam/runners/common.py", line 1420, in apache_beam.runners.common.DoFnRunner.process
File "apache_beam/runners/common.py", line 1492, in apache_beam.runners.common.DoFnRunner._reraise_augmented
File "apache_beam/runners/common.py", line 1418, in apache_beam.runners.common.DoFnRunner.process
File "apache_beam/runners/common.py", line 624, in apache_beam.runners.common.SimpleInvoker.invoke_process
File "apache_beam/runners/common.py", line 1582, in apache_beam.runners.common._OutputHandler.handle_process_outputs
File "apache_beam/runners/common.py", line 1695, in apache_beam.runners.common._OutputHandler._write_value_to_tag
File "apache_beam/runners/worker/operations.py", line 240, in apache_beam.runners.worker.operations.SingletonElementConsumerSet.receive
File "apache_beam/runners/worker/operations.py", line 907, in apache_beam.runners.worker.operations.DoOperation.process
File "apache_beam/runners/worker/operations.py", line 908, in apache_beam.runners.worker.operations.DoOperation.process
File "apache_beam/runners/common.py", line 1420, in apache_beam.runners.common.DoFnRunner.process
File "apache_beam/runners/common.py", line 1492, in apache_beam.runners.common.DoFnRunner._reraise_augmented
File "apache_beam/runners/common.py", line 1418, in apache_beam.runners.common.DoFnRunner.process
File "apache_beam/runners/common.py", line 838, in apache_beam.runners.common.PerWindowInvoker.invoke_process
File "apache_beam/runners/common.py", line 982, in apache_beam.runners.common.PerWindowInvoker._invoke_process_per_window
File "apache_beam/runners/common.py", line 1582, in apache_beam.runners.common._OutputHandler.handle_process_outputs
File "apache_beam/runners/common.py", line 1697, in apache_beam.runners.common._OutputHandler._write_value_to_tag
File "apache_beam/runners/worker/operations.py", line 237, in apache_beam.runners.worker.operations.SingletonElementConsumerSet.receive
File "apache_beam/runners/worker/operations.py", line 240, in apache_beam.runners.worker.operations.SingletonElementConsumerSet.receive
File "apache_beam/runners/worker/operations.py", line 907, in apache_beam.runners.worker.operations.DoOperation.process
File "apache_beam/runners/worker/operations.py", line 908, in apache_beam.runners.worker.operations.DoOperation.process
File "apache_beam/runners/common.py", line 1420, in apache_beam.runners.common.DoFnRunner.process
File "apache_beam/runners/common.py", line 1492, in apache_beam.runners.common.DoFnRunner._reraise_augmented
File "apache_beam/runners/common.py", line 1418, in apache_beam.runners.common.DoFnRunner.process
File "apache_beam/runners/common.py", line 624, in apache_beam.runners.common.SimpleInvoker.invoke_process
File "apache_beam/runners/common.py", line 1582, in apache_beam.runners.common._OutputHandler.handle_process_outputs
File "apache_beam/runners/common.py", line 1695, in apache_beam.runners.common._OutputHandler._write_value_to_tag
File "apache_beam/runners/worker/operations.py", line 240, in apache_beam.runners.worker.operations.SingletonElementConsumerSet.receive
File "apache_beam/runners/worker/operations.py", line 907, in apache_beam.runners.worker.operations.DoOperation.process
File "apache_beam/runners/worker/operations.py", line 908, in apache_beam.runners.worker.operations.DoOperation.process
File "apache_beam/runners/common.py", line 1420, in apache_beam.runners.common.DoFnRunner.process
File "apache_beam/runners/common.py", line 1508, in apache_beam.runners.common.DoFnRunner._reraise_augmented
File "apache_beam/runners/common.py", line 1418, in apache_beam.runners.common.DoFnRunner.process
File "apache_beam/runners/common.py", line 838, in apache_beam.runners.common.PerWindowInvoker.invoke_process
File "apache_beam/runners/common.py", line 984, in apache_beam.runners.common.PerWindowInvoker._invoke_process_per_window
File "/usr/local/lib/python3.10/site-packages/apache_beam/ml/inference/base.py", line 552, in process
return self._run_inference(batch, inference_args)
File "/usr/local/lib/python3.10/site-packages/apache_beam/ml/inference/base.py", line 521, in _run_inference
raise e
File "/usr/local/lib/python3.10/site-packages/apache_beam/ml/inference/base.py", line 517, in _run_inference
result_generator = self._model_handler.run_inference(
File "/usr/local/lib/python3.10/site-packages/apache_beam/ml/inference/sklearn_inference.py", line 268, in run_inference
predictions, splits = self._model_inference_fn(model, batch, inference_args)
File "/usr/local/lib/python3.10/site-packages/apache_beam/ml/inference/sklearn_inference.py", line 185, in _default_pandas_inference_fn
predictions = model.predict(vectorized_batch)
File "/usr/local/lib/python3.10/site-packages/sklearn/pipeline.py", line 480, in predict
Xt = transform.transform(Xt)
File "/usr/local/lib/python3.10/site-packages/sklearn/utils/_set_output.py", line 140, in wrapped
data_to_wrap = f(self, X, *args, **kwargs)
File "/usr/local/lib/python3.10/site-packages/sklearn/compose/_column_transformer.py", line 800, in transform
Xs = self._fit_transform(
File "/usr/local/lib/python3.10/site-packages/sklearn/compose/_column_transformer.py", line 652, in _fit_transform
transformers = list(
File "/usr/local/lib/python3.10/site-packages/sklearn/compose/_column_transformer.py", line 349, in _iter
transformers = [
File "/usr/local/lib/python3.10/site-packages/sklearn/compose/_column_transformer.py", line 350, in <listcomp>
replace_passthrough(*trans) for trans in self.transformers_
File "/usr/local/lib/python3.10/site-packages/sklearn/compose/_column_transformer.py", line 345, in replace_passthrough
if name not in self._name_to_fitted_passthrough:
AttributeError: 'ColumnTransformer' object has no attribute '_name_to_fitted_passthrough' [while running 'RunInference all_features/BeamML_RunInference-ptransform-155']
[31m===== [31m[1m1 failed[0m, [32m82 passed[0m, [33m39 skipped[0m, [33m616 warnings[0m[31m in 11529.37s (3:12:09)[0m[31m =====[0m
> Task :sdks:python:test-suites:dataflow:py310:postCommitIT FAILED
FAILURE: Build failed with an exception.
* Where:
Script '<https://ci-beam.apache.org/job/beam_PostCommit_Python310/ws/src/sdks/python/test-suites/dataflow/common.gradle'> line: 111
* What went wrong:
Execution failed for task ':sdks:python:test-suites:dataflow:py310:postCommitIT'.
> Process 'command 'sh'' finished with non-zero exit value 1
* Try:
> Run with --stacktrace option to get the stack trace.
> Run with --info or --debug option to get more log output.
* Get more help at https://help.gradle.org
Deprecated Gradle features were used in this build, making it incompatible with Gradle 8.0.
You can use '--warning-mode all' to show the individual deprecation warnings and determine if they come from your own scripts or plugins.
See https://docs.gradle.org/7.5.1/userguide/command_line_interface.html#sec:command_line_warnings
Execution optimizations have been disabled for 1 invalid unit(s) of work during this build to ensure correctness.
Please consult deprecation warnings for more details.
BUILD FAILED in 3h 14m 20s
207 actionable tasks: 142 executed, 59 from cache, 6 up-to-date
Publishing build scan...
https://gradle.com/s/skhdochgkslbu
Build step 'Invoke Gradle script' changed build result to FAILURE
Build step 'Invoke Gradle script' marked build as failure
---------------------------------------------------------------------
To unsubscribe, e-mail: builds-unsubscribe@beam.apache.org
For additional commands, e-mail: builds-help@beam.apache.org
Build failed in Jenkins: beam_PostCommit_Python310 #633
Posted by Apache Jenkins Server <je...@builds.apache.org>.
See <https://ci-beam.apache.org/job/beam_PostCommit_Python310/633/display/redirect>
Changes:
------------------------------------------
[...truncated 11.76 MB...]
apache_beam/io/gcp/bigquery_test.py: 3 warnings
apache_beam/io/gcp/bigquery_write_it_test.py: 3 warnings
<https://ci-beam.apache.org/job/beam_PostCommit_Python310/ws/src/sdks/python/apache_beam/io/gcp/bigquery_file_loads.py>:1175: BeamDeprecationWarning: options is deprecated since First stable release. References to <pipeline>.options will not be supported
p.options.view_as(GoogleCloudOptions).job_name or 'AUTOMATIC_JOB_NAME')
apache_beam/examples/cookbook/bigquery_tornadoes_it_test.py::BigqueryTornadoesIT::test_bigquery_tornadoes_it
<https://ci-beam.apache.org/job/beam_PostCommit_Python310/ws/src/sdks/python/apache_beam/io/gcp/tests/utils.py>:100: PendingDeprecationWarning: Client.dataset is deprecated and will be removed in a future version. Use a string like 'my_project.my_dataset' or a cloud.google.bigquery.DatasetReference object, instead.
table_ref = client.dataset(dataset_id).table(table_id)
apache_beam/dataframe/io_it_test.py: 2 warnings
apache_beam/io/gcp/bigquery_json_it_test.py: 1 warning
apache_beam/io/gcp/bigquery_read_it_test.py: 9 warnings
<https://ci-beam.apache.org/job/beam_PostCommit_Python310/ws/src/sdks/python/apache_beam/io/gcp/bigquery.py>:2536: BeamDeprecationWarning: options is deprecated since First stable release. References to <pipeline>.options will not be supported
project_id = pcoll.pipeline.options.view_as(GoogleCloudOptions).project
apache_beam/dataframe/io_it_test.py: 2 warnings
apache_beam/io/gcp/bigquery_json_it_test.py: 1 warning
apache_beam/io/gcp/bigquery_read_it_test.py: 9 warnings
<https://ci-beam.apache.org/job/beam_PostCommit_Python310/ws/src/sdks/python/apache_beam/io/gcp/bigquery.py>:2557: BeamDeprecationWarning: options is deprecated since First stable release. References to <pipeline>.options will not be supported
pipeline_options=pcoll.pipeline.options,
apache_beam/examples/dataframe/flight_delays_it_test.py::FlightDelaysTest::test_flight_delays
<https://ci-beam.apache.org/job/beam_PostCommit_Python310/ws/src/sdks/python/apache_beam/examples/dataframe/flight_delays.py>:47: FutureWarning: The default value of numeric_only in DataFrame.mean is deprecated. In a future version, it will default to False. In addition, specifying 'numeric_only=None' is deprecated. Select only valid columns or specify the value of numeric_only to silence this warning.
return airline_df[at_top_airports].mean()
apache_beam/examples/dataframe/flight_delays_it_test.py::FlightDelaysTest::test_flight_delays
apache_beam/examples/dataframe/taxiride_it_test.py::TaxirideIT::test_aggregation
apache_beam/examples/dataframe/taxiride_it_test.py::TaxirideIT::test_enrich
<https://ci-beam.apache.org/job/beam_PostCommit_Python310/ws/src/sdks/python/apache_beam/dataframe/io.py>:659: FutureWarning: WriteToFiles is experimental.
return pcoll | fileio.WriteToFiles(
apache_beam/examples/dataframe/flight_delays_it_test.py::FlightDelaysTest::test_flight_delays
apache_beam/examples/dataframe/taxiride_it_test.py::TaxirideIT::test_aggregation
apache_beam/examples/dataframe/taxiride_it_test.py::TaxirideIT::test_enrich
<https://ci-beam.apache.org/job/beam_PostCommit_Python310/ws/src/sdks/python/apache_beam/io/fileio.py>:596: BeamDeprecationWarning: options is deprecated since First stable release. References to <pipeline>.options will not be supported
p.options.view_as(GoogleCloudOptions).temp_location or
apache_beam/io/gcp/bigquery_test.py::BigQueryStreamingInsertTransformIntegrationTests::test_multiple_destinations_transform
<https://ci-beam.apache.org/job/beam_PostCommit_Python310/ws/src/sdks/python/apache_beam/io/gcp/bigquery_test.py>:1694: BeamDeprecationWarning: options is deprecated since First stable release. References to <pipeline>.options will not be supported
streaming = self.test_pipeline.options.view_as(StandardOptions).streaming
apache_beam/io/gcp/bigquery_read_it_test.py::ReadTests::test_native_source
<https://ci-beam.apache.org/job/beam_PostCommit_Python310/ws/src/sdks/python/apache_beam/io/gcp/bigquery_read_it_test.py>:170: BeamDeprecationWarning: BigQuerySource is deprecated since 2.25.0. Use ReadFromBigQuery instead.
beam.io.BigQuerySource(query=self.query, use_standard_sql=True)))
apache_beam/ml/inference/sklearn_inference_it_test.py::SklearnInference::test_sklearn_regression
<https://ci-beam.apache.org/job/beam_PostCommit_Python310/ws/src/sdks/python/apache_beam/examples/inference/sklearn_japanese_housing_regression.py>:128: FutureWarning: SklearnModelHandlerPandas is experimental. No backwards-compatibility guarantees.
model_loader = SklearnModelHandlerPandas(
apache_beam/ml/inference/sklearn_inference_it_test.py::SklearnInference::test_sklearn_regression
<https://ci-beam.apache.org/job/beam_PostCommit_Python310/ws/src/build/gradleenv/2050596098/lib/python3.10/site-packages/dill/_dill.py>:472: FutureWarning: SklearnModelHandlerPandas is experimental. No backwards-compatibility guarantees.
obj = StockUnpickler.load(self)
apache_beam/ml/gcp/cloud_dlp_it_test.py::CloudDLPIT::test_deidentification
<https://ci-beam.apache.org/job/beam_PostCommit_Python310/ws/src/sdks/python/apache_beam/ml/gcp/cloud_dlp_it_test.py>:74: FutureWarning: MaskDetectedDetails is experimental.
| MaskDetectedDetails(
apache_beam/ml/gcp/cloud_dlp_it_test.py::CloudDLPIT::test_inspection
<https://ci-beam.apache.org/job/beam_PostCommit_Python310/ws/src/sdks/python/apache_beam/ml/gcp/cloud_dlp_it_test.py>:85: FutureWarning: InspectForDetails is experimental.
| InspectForDetails(
apache_beam/io/gcp/bigquery_read_it_test.py::ReadNewTypesTests::test_native_source
<https://ci-beam.apache.org/job/beam_PostCommit_Python310/ws/src/sdks/python/apache_beam/io/gcp/bigquery_read_it_test.py>:693: BeamDeprecationWarning: BigQuerySource is deprecated since 2.25.0. Use ReadFromBigQuery instead.
beam.io.BigQuerySource(query=self.query, use_standard_sql=True)))
apache_beam/io/gcp/bigquery_read_it_test.py::ReadAllBQTests::test_read_queries
<https://ci-beam.apache.org/job/beam_PostCommit_Python310/ws/src/sdks/python/apache_beam/io/gcp/bigquery_read_it_test.py>:808: FutureWarning: ReadAllFromBigQuery is experimental.
| beam.io.ReadAllFromBigQuery())
apache_beam/io/gcp/bigquery_read_it_test.py::ReadAllBQTests::test_read_queries
<https://ci-beam.apache.org/job/beam_PostCommit_Python310/ws/src/sdks/python/apache_beam/io/gcp/bigquery.py>:2665: BeamDeprecationWarning: options is deprecated since First stable release. References to <pipeline>.options will not be supported
job_name = pcoll.pipeline.options.view_as(GoogleCloudOptions).job_name
apache_beam/io/gcp/bigquery_read_it_test.py::ReadAllBQTests::test_read_queries
<https://ci-beam.apache.org/job/beam_PostCommit_Python310/ws/src/sdks/python/apache_beam/io/gcp/bigquery.py>:2666: BeamDeprecationWarning: options is deprecated since First stable release. References to <pipeline>.options will not be supported
project = pcoll.pipeline.options.view_as(GoogleCloudOptions).project
apache_beam/io/gcp/bigquery_read_it_test.py::ReadAllBQTests::test_read_queries
<https://ci-beam.apache.org/job/beam_PostCommit_Python310/ws/src/sdks/python/apache_beam/io/gcp/bigquery.py>:2679: BeamDeprecationWarning: options is deprecated since First stable release. References to <pipeline>.options will not be supported
options=pcoll.pipeline.options,
-- Docs: https://docs.pytest.org/en/stable/how-to/capture-warnings.html
- generated xml file: <https://ci-beam.apache.org/job/beam_PostCommit_Python310/ws/src/sdks/python/pytest_postCommitIT-df-py310.xml> -
[36m[1m=========================== short test summary info ============================[0m
[31mFAILED[0m apache_beam/ml/inference/sklearn_inference_it_test.py::[1mSklearnInference::test_sklearn_regression[0m - apache_beam.runners.dataflow.dataflow_runner.DataflowRuntimeException: Dataflow pipeline failed. State: FAILED, Error:
Traceback (most recent call last):
File "apache_beam/runners/common.py", line 1418, in apache_beam.runners.common.DoFnRunner.process
File "apache_beam/runners/common.py", line 838, in apache_beam.runners.common.PerWindowInvoker.invoke_process
File "apache_beam/runners/common.py", line 984, in apache_beam.runners.common.PerWindowInvoker._invoke_process_per_window
File "/usr/local/lib/python3.10/site-packages/apache_beam/ml/inference/base.py", line 552, in process
return self._run_inference(batch, inference_args)
File "/usr/local/lib/python3.10/site-packages/apache_beam/ml/inference/base.py", line 521, in _run_inference
raise e
File "/usr/local/lib/python3.10/site-packages/apache_beam/ml/inference/base.py", line 517, in _run_inference
result_generator = self._model_handler.run_inference(
File "/usr/local/lib/python3.10/site-packages/apache_beam/ml/inference/sklearn_inference.py", line 268, in run_inference
predictions, splits = self._model_inference_fn(model, batch, inference_args)
File "/usr/local/lib/python3.10/site-packages/apache_beam/ml/inference/sklearn_inference.py", line 185, in _default_pandas_inference_fn
predictions = model.predict(vectorized_batch)
File "/usr/local/lib/python3.10/site-packages/sklearn/pipeline.py", line 480, in predict
Xt = transform.transform(Xt)
File "/usr/local/lib/python3.10/site-packages/sklearn/utils/_set_output.py", line 140, in wrapped
data_to_wrap = f(self, X, *args, **kwargs)
File "/usr/local/lib/python3.10/site-packages/sklearn/compose/_column_transformer.py", line 800, in transform
Xs = self._fit_transform(
File "/usr/local/lib/python3.10/site-packages/sklearn/compose/_column_transformer.py", line 652, in _fit_transform
transformers = list(
File "/usr/local/lib/python3.10/site-packages/sklearn/compose/_column_transformer.py", line 349, in _iter
transformers = [
File "/usr/local/lib/python3.10/site-packages/sklearn/compose/_column_transformer.py", line 350, in <listcomp>
replace_passthrough(*trans) for trans in self.transformers_
File "/usr/local/lib/python3.10/site-packages/sklearn/compose/_column_transformer.py", line 345, in replace_passthrough
if name not in self._name_to_fitted_passthrough:
AttributeError: 'ColumnTransformer' object has no attribute '_name_to_fitted_passthrough'
During handling of the above exception, another exception occurred:
Traceback (most recent call last):
File "/usr/local/lib/python3.10/site-packages/apache_beam/runners/worker/sdk_worker.py", line 295, in _execute
response = task()
File "/usr/local/lib/python3.10/site-packages/apache_beam/runners/worker/sdk_worker.py", line 370, in <lambda>
lambda: self.create_worker().do_instruction(request), request)
File "/usr/local/lib/python3.10/site-packages/apache_beam/runners/worker/sdk_worker.py", line 629, in do_instruction
return getattr(self, request_type)(
File "/usr/local/lib/python3.10/site-packages/apache_beam/runners/worker/sdk_worker.py", line 667, in process_bundle
bundle_processor.process_bundle(instruction_id))
File "/usr/local/lib/python3.10/site-packages/apache_beam/runners/worker/bundle_processor.py", line 1062, in process_bundle
input_op_by_transform_id[element.transform_id].process_encoded(
File "/usr/local/lib/python3.10/site-packages/apache_beam/runners/worker/bundle_processor.py", line 232, in process_encoded
self.output(decoded_value)
File "apache_beam/runners/worker/operations.py", line 526, in apache_beam.runners.worker.operations.Operation.output
File "apache_beam/runners/worker/operations.py", line 528, in apache_beam.runners.worker.operations.Operation.output
File "apache_beam/runners/worker/operations.py", line 237, in apache_beam.runners.worker.operations.SingletonElementConsumerSet.receive
File "apache_beam/runners/worker/operations.py", line 240, in apache_beam.runners.worker.operations.SingletonElementConsumerSet.receive
File "apache_beam/runners/worker/operations.py", line 907, in apache_beam.runners.worker.operations.DoOperation.process
File "apache_beam/runners/worker/operations.py", line 908, in apache_beam.runners.worker.operations.DoOperation.process
File "apache_beam/runners/common.py", line 1420, in apache_beam.runners.common.DoFnRunner.process
File "apache_beam/runners/common.py", line 1492, in apache_beam.runners.common.DoFnRunner._reraise_augmented
File "apache_beam/runners/common.py", line 1418, in apache_beam.runners.common.DoFnRunner.process
File "apache_beam/runners/common.py", line 624, in apache_beam.runners.common.SimpleInvoker.invoke_process
File "apache_beam/runners/common.py", line 1582, in apache_beam.runners.common._OutputHandler.handle_process_outputs
File "apache_beam/runners/common.py", line 1695, in apache_beam.runners.common._OutputHandler._write_value_to_tag
File "apache_beam/runners/worker/operations.py", line 240, in apache_beam.runners.worker.operations.SingletonElementConsumerSet.receive
File "apache_beam/runners/worker/operations.py", line 907, in apache_beam.runners.worker.operations.DoOperation.process
File "apache_beam/runners/worker/operations.py", line 908, in apache_beam.runners.worker.operations.DoOperation.process
File "apache_beam/runners/common.py", line 1420, in apache_beam.runners.common.DoFnRunner.process
File "apache_beam/runners/common.py", line 1492, in apache_beam.runners.common.DoFnRunner._reraise_augmented
File "apache_beam/runners/common.py", line 1418, in apache_beam.runners.common.DoFnRunner.process
File "apache_beam/runners/common.py", line 624, in apache_beam.runners.common.SimpleInvoker.invoke_process
File "apache_beam/runners/common.py", line 1582, in apache_beam.runners.common._OutputHandler.handle_process_outputs
File "apache_beam/runners/common.py", line 1695, in apache_beam.runners.common._OutputHandler._write_value_to_tag
File "apache_beam/runners/worker/operations.py", line 240, in apache_beam.runners.worker.operations.SingletonElementConsumerSet.receive
File "apache_beam/runners/worker/operations.py", line 907, in apache_beam.runners.worker.operations.DoOperation.process
File "apache_beam/runners/worker/operations.py", line 908, in apache_beam.runners.worker.operations.DoOperation.process
File "apache_beam/runners/common.py", line 1420, in apache_beam.runners.common.DoFnRunner.process
File "apache_beam/runners/common.py", line 1492, in apache_beam.runners.common.DoFnRunner._reraise_augmented
File "apache_beam/runners/common.py", line 1418, in apache_beam.runners.common.DoFnRunner.process
File "apache_beam/runners/common.py", line 624, in apache_beam.runners.common.SimpleInvoker.invoke_process
File "apache_beam/runners/common.py", line 1582, in apache_beam.runners.common._OutputHandler.handle_process_outputs
File "apache_beam/runners/common.py", line 1695, in apache_beam.runners.common._OutputHandler._write_value_to_tag
File "apache_beam/runners/worker/operations.py", line 240, in apache_beam.runners.worker.operations.SingletonElementConsumerSet.receive
File "apache_beam/runners/worker/operations.py", line 907, in apache_beam.runners.worker.operations.DoOperation.process
File "apache_beam/runners/worker/operations.py", line 908, in apache_beam.runners.worker.operations.DoOperation.process
File "apache_beam/runners/common.py", line 1420, in apache_beam.runners.common.DoFnRunner.process
File "apache_beam/runners/common.py", line 1492, in apache_beam.runners.common.DoFnRunner._reraise_augmented
File "apache_beam/runners/common.py", line 1418, in apache_beam.runners.common.DoFnRunner.process
File "apache_beam/runners/common.py", line 838, in apache_beam.runners.common.PerWindowInvoker.invoke_process
File "apache_beam/runners/common.py", line 982, in apache_beam.runners.common.PerWindowInvoker._invoke_process_per_window
File "apache_beam/runners/common.py", line 1582, in apache_beam.runners.common._OutputHandler.handle_process_outputs
File "apache_beam/runners/common.py", line 1697, in apache_beam.runners.common._OutputHandler._write_value_to_tag
File "apache_beam/runners/worker/operations.py", line 237, in apache_beam.runners.worker.operations.SingletonElementConsumerSet.receive
File "apache_beam/runners/worker/operations.py", line 240, in apache_beam.runners.worker.operations.SingletonElementConsumerSet.receive
File "apache_beam/runners/worker/operations.py", line 907, in apache_beam.runners.worker.operations.DoOperation.process
File "apache_beam/runners/worker/operations.py", line 908, in apache_beam.runners.worker.operations.DoOperation.process
File "apache_beam/runners/common.py", line 1420, in apache_beam.runners.common.DoFnRunner.process
File "apache_beam/runners/common.py", line 1492, in apache_beam.runners.common.DoFnRunner._reraise_augmented
File "apache_beam/runners/common.py", line 1418, in apache_beam.runners.common.DoFnRunner.process
File "apache_beam/runners/common.py", line 624, in apache_beam.runners.common.SimpleInvoker.invoke_process
File "apache_beam/runners/common.py", line 1582, in apache_beam.runners.common._OutputHandler.handle_process_outputs
File "apache_beam/runners/common.py", line 1695, in apache_beam.runners.common._OutputHandler._write_value_to_tag
File "apache_beam/runners/worker/operations.py", line 240, in apache_beam.runners.worker.operations.SingletonElementConsumerSet.receive
File "apache_beam/runners/worker/operations.py", line 907, in apache_beam.runners.worker.operations.DoOperation.process
File "apache_beam/runners/worker/operations.py", line 908, in apache_beam.runners.worker.operations.DoOperation.process
File "apache_beam/runners/common.py", line 1420, in apache_beam.runners.common.DoFnRunner.process
File "apache_beam/runners/common.py", line 1508, in apache_beam.runners.common.DoFnRunner._reraise_augmented
File "apache_beam/runners/common.py", line 1418, in apache_beam.runners.common.DoFnRunner.process
File "apache_beam/runners/common.py", line 838, in apache_beam.runners.common.PerWindowInvoker.invoke_process
File "apache_beam/runners/common.py", line 984, in apache_beam.runners.common.PerWindowInvoker._invoke_process_per_window
File "/usr/local/lib/python3.10/site-packages/apache_beam/ml/inference/base.py", line 552, in process
return self._run_inference(batch, inference_args)
File "/usr/local/lib/python3.10/site-packages/apache_beam/ml/inference/base.py", line 521, in _run_inference
raise e
File "/usr/local/lib/python3.10/site-packages/apache_beam/ml/inference/base.py", line 517, in _run_inference
result_generator = self._model_handler.run_inference(
File "/usr/local/lib/python3.10/site-packages/apache_beam/ml/inference/sklearn_inference.py", line 268, in run_inference
predictions, splits = self._model_inference_fn(model, batch, inference_args)
File "/usr/local/lib/python3.10/site-packages/apache_beam/ml/inference/sklearn_inference.py", line 185, in _default_pandas_inference_fn
predictions = model.predict(vectorized_batch)
File "/usr/local/lib/python3.10/site-packages/sklearn/pipeline.py", line 480, in predict
Xt = transform.transform(Xt)
File "/usr/local/lib/python3.10/site-packages/sklearn/utils/_set_output.py", line 140, in wrapped
data_to_wrap = f(self, X, *args, **kwargs)
File "/usr/local/lib/python3.10/site-packages/sklearn/compose/_column_transformer.py", line 800, in transform
Xs = self._fit_transform(
File "/usr/local/lib/python3.10/site-packages/sklearn/compose/_column_transformer.py", line 652, in _fit_transform
transformers = list(
File "/usr/local/lib/python3.10/site-packages/sklearn/compose/_column_transformer.py", line 349, in _iter
transformers = [
File "/usr/local/lib/python3.10/site-packages/sklearn/compose/_column_transformer.py", line 350, in <listcomp>
replace_passthrough(*trans) for trans in self.transformers_
File "/usr/local/lib/python3.10/site-packages/sklearn/compose/_column_transformer.py", line 345, in replace_passthrough
if name not in self._name_to_fitted_passthrough:
AttributeError: 'ColumnTransformer' object has no attribute '_name_to_fitted_passthrough' [while running 'RunInference all_features/BeamML_RunInference-ptransform-145']
[31m===== [31m[1m1 failed[0m, [32m82 passed[0m, [33m39 skipped[0m, [33m616 warnings[0m[31m in 11768.42s (3:16:08)[0m[31m =====[0m
> Task :sdks:python:test-suites:dataflow:py310:postCommitIT FAILED
FAILURE: Build failed with an exception.
* Where:
Script '<https://ci-beam.apache.org/job/beam_PostCommit_Python310/ws/src/sdks/python/test-suites/dataflow/common.gradle'> line: 111
* What went wrong:
Execution failed for task ':sdks:python:test-suites:dataflow:py310:postCommitIT'.
> Process 'command 'sh'' finished with non-zero exit value 1
* Try:
> Run with --stacktrace option to get the stack trace.
> Run with --info or --debug option to get more log output.
* Get more help at https://help.gradle.org
Deprecated Gradle features were used in this build, making it incompatible with Gradle 8.0.
You can use '--warning-mode all' to show the individual deprecation warnings and determine if they come from your own scripts or plugins.
See https://docs.gradle.org/7.5.1/userguide/command_line_interface.html#sec:command_line_warnings
Execution optimizations have been disabled for 1 invalid unit(s) of work during this build to ensure correctness.
Please consult deprecation warnings for more details.
BUILD FAILED in 3h 18m 5s
207 actionable tasks: 142 executed, 59 from cache, 6 up-to-date
Publishing build scan...
https://gradle.com/s/zweyobbfhptsw
Build step 'Invoke Gradle script' changed build result to FAILURE
Build step 'Invoke Gradle script' marked build as failure
---------------------------------------------------------------------
To unsubscribe, e-mail: builds-unsubscribe@beam.apache.org
For additional commands, e-mail: builds-help@beam.apache.org
Build failed in Jenkins: beam_PostCommit_Python310 #632
Posted by Apache Jenkins Server <je...@builds.apache.org>.
See <https://ci-beam.apache.org/job/beam_PostCommit_Python310/632/display/redirect>
Changes:
------------------------------------------
[...truncated 11.61 MB...]
message: "Done consuming work."
log_location: "/usr/local/lib/python3.10/site-packages/apache_beam/runners/worker/sdk_worker.py:285"
thread: "MainThread"
INFO:root:severity: INFO
timestamp {
seconds: 1679779502
nanos: 336667537
}
message: "Python sdk harness exiting."
log_location: "/usr/local/lib/python3.10/site-packages/apache_beam/runners/worker/sdk_worker_main.py:205"
thread: "MainThread"
INFO:apache_beam.runners.portability.local_job_service:Completed job in 35.15465521812439 seconds with state DONE.
INFO:root:Completed job in 35.15465521812439 seconds with state DONE.
INFO:apache_beam.runners.portability.portable_runner:Job state changed to DONE
> Task :sdks:python:test-suites:portable:py310:portableWordCountSparkRunnerBatch
INFO:apache_beam.runners.worker.worker_pool_main:Listening for workers at localhost:41721
INFO:root:Default Python SDK image for environment is apache/beam_python3.10_sdk:2.47.0.dev
INFO:apache_beam.runners.portability.fn_api_runner.translations:==================== <function pack_combiners at 0x7f1a3c8ca8c0> ====================
INFO:apache_beam.runners.portability.fn_api_runner.translations:==================== <function lift_combiners at 0x7f1a3c8ca950> ====================
INFO:apache_beam.runners.portability.fn_api_runner.translations:==================== <function sort_stages at 0x7f1a3c8cb0a0> ====================
INFO:apache_beam.utils.subprocess_server:Starting service with ['java' '-jar' '<https://ci-beam.apache.org/job/beam_PostCommit_Python310/ws/src/runners/spark/3/job-server/build/libs/beam-runners-spark-3-job-server-2.47.0-SNAPSHOT.jar'> '--spark-master-url' 'local[4]' '--artifacts-dir' '/tmp/beam-tempx0ytwaif/artifactsx59jsb2l' '--job-port' '39739' '--artifact-port' '0' '--expansion-port' '0']
INFO:apache_beam.utils.subprocess_server:23/03/25 21:25:20 WARN software.amazon.awssdk.regions.internal.util.EC2MetadataUtils: Unable to retrieve the requested metadata.
INFO:apache_beam.utils.subprocess_server:23/03/25 21:25:20 INFO org.apache.beam.runners.jobsubmission.JobServerDriver: ArtifactStagingService started on localhost:34733
INFO:apache_beam.utils.subprocess_server:23/03/25 21:25:20 INFO org.apache.beam.runners.jobsubmission.JobServerDriver: Java ExpansionService started on localhost:41587
INFO:apache_beam.utils.subprocess_server:23/03/25 21:25:21 INFO org.apache.beam.runners.jobsubmission.JobServerDriver: JobService started on localhost:39739
INFO:apache_beam.utils.subprocess_server:23/03/25 21:25:21 INFO org.apache.beam.runners.jobsubmission.JobServerDriver: Job server now running, terminate with Ctrl+C
WARNING:root:Waiting for grpc channel to be ready at localhost:39739.
INFO:apache_beam.utils.subprocess_server:23/03/25 21:25:22 INFO org.apache.beam.runners.fnexecution.artifact.ArtifactStagingService: Staging artifacts for job_8b70f6a5-7ed1-4ff8-a89f-5f98e11e6460.
INFO:apache_beam.utils.subprocess_server:23/03/25 21:25:22 INFO org.apache.beam.runners.fnexecution.artifact.ArtifactStagingService: Resolving artifacts for job_8b70f6a5-7ed1-4ff8-a89f-5f98e11e6460.ref_Environment_default_environment_1.
INFO:apache_beam.utils.subprocess_server:23/03/25 21:25:22 INFO org.apache.beam.runners.fnexecution.artifact.ArtifactStagingService: Getting 1 artifacts for job_8b70f6a5-7ed1-4ff8-a89f-5f98e11e6460.null.
INFO:apache_beam.utils.subprocess_server:23/03/25 21:25:22 INFO org.apache.beam.runners.fnexecution.artifact.ArtifactStagingService: Artifacts fully staged for job_8b70f6a5-7ed1-4ff8-a89f-5f98e11e6460.
INFO:apache_beam.utils.subprocess_server:23/03/25 21:25:22 INFO org.apache.beam.runners.spark.SparkJobInvoker: Invoking job BeamApp-jenkins-0325212522-c1eb6f3_ae5e7fe5-2ea4-4ecd-b6a2-b7a3bb658c9c
INFO:apache_beam.utils.subprocess_server:23/03/25 21:25:22 INFO org.apache.beam.runners.jobsubmission.JobInvocation: Starting job invocation BeamApp-jenkins-0325212522-c1eb6f3_ae5e7fe5-2ea4-4ecd-b6a2-b7a3bb658c9c
INFO:apache_beam.runners.portability.portable_runner:Environment "LOOPBACK" has started a component necessary for the execution. Be sure to run the pipeline using
with Pipeline() as p:
p.apply(..)
This ensures that the pipeline finishes before this program exits.
INFO:apache_beam.runners.portability.portable_runner:Job state changed to STOPPED
INFO:apache_beam.runners.portability.portable_runner:Job state changed to STARTING
INFO:apache_beam.runners.portability.portable_runner:Job state changed to RUNNING
INFO:apache_beam.utils.subprocess_server:23/03/25 21:25:23 INFO org.apache.beam.runners.spark.translation.SparkContextFactory: Creating a brand new Spark Context.
INFO:apache_beam.utils.subprocess_server:23/03/25 21:25:23 WARN org.apache.hadoop.util.NativeCodeLoader: Unable to load native-hadoop library for your platform... using builtin-java classes where applicable
INFO:apache_beam.utils.subprocess_server:23/03/25 21:25:24 INFO org.sparkproject.jetty.util.log: Logging initialized @8303ms to org.sparkproject.jetty.util.log.Slf4jLog
INFO:apache_beam.utils.subprocess_server:23/03/25 21:25:24 INFO org.sparkproject.jetty.server.Server: jetty-9.4.40.v20210413; built: 2021-04-13T20:42:42.668Z; git: b881a572662e1943a14ae12e7e1207989f218b74; jvm 1.8.0_362-8u362-ga-0ubuntu1~20.04.1-b09
INFO:apache_beam.utils.subprocess_server:23/03/25 21:25:24 INFO org.sparkproject.jetty.server.Server: Started @8557ms
INFO:apache_beam.utils.subprocess_server:23/03/25 21:25:25 INFO org.sparkproject.jetty.server.AbstractConnector: Started ServerConnector@37e571eb{HTTP/1.1, (http/1.1)}{127.0.0.1:4040}
INFO:apache_beam.utils.subprocess_server:23/03/25 21:25:25 INFO org.sparkproject.jetty.server.handler.ContextHandler: Started o.s.j.s.ServletContextHandler@c56dae8{/jobs,null,AVAILABLE,@Spark}
INFO:apache_beam.utils.subprocess_server:23/03/25 21:25:25 INFO org.sparkproject.jetty.server.handler.ContextHandler: Started o.s.j.s.ServletContextHandler@56b3f301{/jobs/json,null,AVAILABLE,@Spark}
INFO:apache_beam.utils.subprocess_server:23/03/25 21:25:25 INFO org.sparkproject.jetty.server.handler.ContextHandler: Started o.s.j.s.ServletContextHandler@5f5b8fd2{/jobs/job,null,AVAILABLE,@Spark}
INFO:apache_beam.utils.subprocess_server:23/03/25 21:25:25 INFO org.sparkproject.jetty.server.handler.ContextHandler: Started o.s.j.s.ServletContextHandler@52428a58{/jobs/job/json,null,AVAILABLE,@Spark}
INFO:apache_beam.utils.subprocess_server:23/03/25 21:25:25 INFO org.sparkproject.jetty.server.handler.ContextHandler: Started o.s.j.s.ServletContextHandler@40a1c6db{/stages,null,AVAILABLE,@Spark}
INFO:apache_beam.utils.subprocess_server:23/03/25 21:25:25 INFO org.sparkproject.jetty.server.handler.ContextHandler: Started o.s.j.s.ServletContextHandler@48ba62de{/stages/json,null,AVAILABLE,@Spark}
INFO:apache_beam.utils.subprocess_server:23/03/25 21:25:25 INFO org.sparkproject.jetty.server.handler.ContextHandler: Started o.s.j.s.ServletContextHandler@72a5851c{/stages/stage,null,AVAILABLE,@Spark}
INFO:apache_beam.utils.subprocess_server:23/03/25 21:25:25 INFO org.sparkproject.jetty.server.handler.ContextHandler: Started o.s.j.s.ServletContextHandler@4f04d92{/stages/stage/json,null,AVAILABLE,@Spark}
INFO:apache_beam.utils.subprocess_server:23/03/25 21:25:25 INFO org.sparkproject.jetty.server.handler.ContextHandler: Started o.s.j.s.ServletContextHandler@260a2df8{/stages/pool,null,AVAILABLE,@Spark}
INFO:apache_beam.utils.subprocess_server:23/03/25 21:25:25 INFO org.sparkproject.jetty.server.handler.ContextHandler: Started o.s.j.s.ServletContextHandler@6781643c{/stages/pool/json,null,AVAILABLE,@Spark}
INFO:apache_beam.utils.subprocess_server:23/03/25 21:25:25 INFO org.sparkproject.jetty.server.handler.ContextHandler: Started o.s.j.s.ServletContextHandler@798f4aee{/storage,null,AVAILABLE,@Spark}
INFO:apache_beam.utils.subprocess_server:23/03/25 21:25:25 INFO org.sparkproject.jetty.server.handler.ContextHandler: Started o.s.j.s.ServletContextHandler@2d2a01a2{/storage/json,null,AVAILABLE,@Spark}
INFO:apache_beam.utils.subprocess_server:23/03/25 21:25:25 INFO org.sparkproject.jetty.server.handler.ContextHandler: Started o.s.j.s.ServletContextHandler@4e95f8d1{/storage/rdd,null,AVAILABLE,@Spark}
INFO:apache_beam.utils.subprocess_server:23/03/25 21:25:25 INFO org.sparkproject.jetty.server.handler.ContextHandler: Started o.s.j.s.ServletContextHandler@433052c6{/storage/rdd/json,null,AVAILABLE,@Spark}
INFO:apache_beam.utils.subprocess_server:23/03/25 21:25:25 INFO org.sparkproject.jetty.server.handler.ContextHandler: Started o.s.j.s.ServletContextHandler@1f6cd605{/environment,null,AVAILABLE,@Spark}
INFO:apache_beam.utils.subprocess_server:23/03/25 21:25:25 INFO org.sparkproject.jetty.server.handler.ContextHandler: Started o.s.j.s.ServletContextHandler@3311cb99{/environment/json,null,AVAILABLE,@Spark}
INFO:apache_beam.utils.subprocess_server:23/03/25 21:25:25 INFO org.sparkproject.jetty.server.handler.ContextHandler: Started o.s.j.s.ServletContextHandler@4330773f{/executors,null,AVAILABLE,@Spark}
INFO:apache_beam.utils.subprocess_server:23/03/25 21:25:25 INFO org.sparkproject.jetty.server.handler.ContextHandler: Started o.s.j.s.ServletContextHandler@3cffc598{/executors/json,null,AVAILABLE,@Spark}
INFO:apache_beam.utils.subprocess_server:23/03/25 21:25:25 INFO org.sparkproject.jetty.server.handler.ContextHandler: Started o.s.j.s.ServletContextHandler@6c27324e{/executors/threadDump,null,AVAILABLE,@Spark}
INFO:apache_beam.utils.subprocess_server:23/03/25 21:25:25 INFO org.sparkproject.jetty.server.handler.ContextHandler: Started o.s.j.s.ServletContextHandler@531daed6{/executors/threadDump/json,null,AVAILABLE,@Spark}
INFO:apache_beam.utils.subprocess_server:23/03/25 21:25:25 INFO org.sparkproject.jetty.server.handler.ContextHandler: Started o.s.j.s.ServletContextHandler@5b459ea7{/static,null,AVAILABLE,@Spark}
INFO:apache_beam.utils.subprocess_server:23/03/25 21:25:25 INFO org.sparkproject.jetty.server.handler.ContextHandler: Started o.s.j.s.ServletContextHandler@505d7e2b{/,null,AVAILABLE,@Spark}
INFO:apache_beam.utils.subprocess_server:23/03/25 21:25:25 INFO org.sparkproject.jetty.server.handler.ContextHandler: Started o.s.j.s.ServletContextHandler@5ccb4e9f{/api,null,AVAILABLE,@Spark}
INFO:apache_beam.utils.subprocess_server:23/03/25 21:25:25 INFO org.sparkproject.jetty.server.handler.ContextHandler: Started o.s.j.s.ServletContextHandler@230e41{/jobs/job/kill,null,AVAILABLE,@Spark}
INFO:apache_beam.utils.subprocess_server:23/03/25 21:25:25 INFO org.sparkproject.jetty.server.handler.ContextHandler: Started o.s.j.s.ServletContextHandler@6e594d11{/stages/stage/kill,null,AVAILABLE,@Spark}
INFO:apache_beam.utils.subprocess_server:23/03/25 21:25:25 INFO org.sparkproject.jetty.server.handler.ContextHandler: Started o.s.j.s.ServletContextHandler@105a1142{/metrics/json,null,AVAILABLE,@Spark}
INFO:apache_beam.utils.subprocess_server:23/03/25 21:25:25 INFO org.apache.beam.runners.spark.metrics.MetricsAccumulator: Instantiated metrics accumulator: MetricQueryResults()
INFO:apache_beam.utils.subprocess_server:23/03/25 21:25:25 WARN software.amazon.awssdk.regions.internal.util.EC2MetadataUtils: Unable to retrieve the requested metadata.
INFO:apache_beam.utils.subprocess_server:23/03/25 21:25:25 INFO org.apache.beam.runners.spark.SparkPipelineRunner: Running job BeamApp-jenkins-0325212522-c1eb6f3_ae5e7fe5-2ea4-4ecd-b6a2-b7a3bb658c9c on Spark master local[4]
INFO:apache_beam.utils.subprocess_server:23/03/25 21:25:26 WARN software.amazon.awssdk.regions.internal.util.EC2MetadataUtils: Unable to retrieve the requested metadata.
INFO:apache_beam.utils.subprocess_server:23/03/25 21:25:26 WARN software.amazon.awssdk.regions.internal.util.EC2MetadataUtils: Unable to retrieve the requested metadata.
INFO:apache_beam.utils.subprocess_server:23/03/25 21:25:26 WARN software.amazon.awssdk.regions.internal.util.EC2MetadataUtils: Unable to retrieve the requested metadata.
INFO:apache_beam.utils.subprocess_server:23/03/25 21:25:26 WARN software.amazon.awssdk.regions.internal.util.EC2MetadataUtils: Unable to retrieve the requested metadata.
INFO:apache_beam.runners.worker.statecache:Creating state cache with size 0
INFO:apache_beam.runners.worker.sdk_worker:Creating insecure control channel for localhost:42155.
INFO:apache_beam.runners.worker.sdk_worker:Control channel established.
INFO:apache_beam.runners.worker.sdk_worker:Initializing SDKHarness with unbounded number of workers.
INFO:apache_beam.utils.subprocess_server:23/03/25 21:25:27 INFO org.apache.beam.runners.fnexecution.control.FnApiControlClientPoolService: Beam Fn Control client connected with id 1-1
INFO:apache_beam.utils.subprocess_server:23/03/25 21:25:27 INFO org.apache.beam.runners.fnexecution.control.FnApiControlClientPoolService: getProcessBundleDescriptor request with id 1-2
INFO:apache_beam.runners.worker.sdk_worker:Creating insecure state channel for localhost:44553.
INFO:apache_beam.runners.worker.sdk_worker:State channel established.
INFO:root:Default Python SDK image for environment is apache/beam_python3.10_sdk:2.47.0.dev
INFO:apache_beam.runners.worker.data_plane:Creating client data channel for localhost:40947
INFO:apache_beam.utils.subprocess_server:23/03/25 21:25:27 INFO org.apache.beam.runners.fnexecution.data.GrpcDataService: Beam Fn Data client connected.
INFO:apache_beam.utils.subprocess_server:23/03/25 21:25:27 INFO org.apache.beam.runners.fnexecution.control.FnApiControlClientPoolService: getProcessBundleDescriptor request with id 1-3
INFO:root:Default Python SDK image for environment is apache/beam_python3.10_sdk:2.47.0.dev
INFO:apache_beam.utils.subprocess_server:23/03/25 21:25:27 WARN software.amazon.awssdk.regions.internal.util.EC2MetadataUtils: Unable to retrieve the requested metadata.
INFO:apache_beam.utils.subprocess_server:23/03/25 21:25:27 WARN software.amazon.awssdk.regions.internal.util.EC2MetadataUtils: Unable to retrieve the requested metadata.
INFO:apache_beam.utils.subprocess_server:23/03/25 21:25:27 WARN software.amazon.awssdk.regions.internal.util.EC2MetadataUtils: Unable to retrieve the requested metadata.
INFO:apache_beam.utils.subprocess_server:23/03/25 21:25:27 WARN software.amazon.awssdk.regions.internal.util.EC2MetadataUtils: Unable to retrieve the requested metadata.
INFO:apache_beam.utils.subprocess_server:23/03/25 21:25:27 INFO org.apache.beam.runners.fnexecution.control.FnApiControlClientPoolService: getProcessBundleDescriptor request with id 1-4
INFO:root:Default Python SDK image for environment is apache/beam_python3.10_sdk:2.47.0.dev
INFO:apache_beam.utils.subprocess_server:23/03/25 21:25:27 INFO org.apache.beam.runners.fnexecution.control.FnApiControlClientPoolService: getProcessBundleDescriptor request with id 1-5
INFO:root:Default Python SDK image for environment is apache/beam_python3.10_sdk:2.47.0.dev
INFO:apache_beam.utils.subprocess_server:23/03/25 21:25:28 WARN software.amazon.awssdk.regions.internal.util.EC2MetadataUtils: Unable to retrieve the requested metadata.
INFO:apache_beam.utils.subprocess_server:23/03/25 21:25:28 WARN software.amazon.awssdk.regions.internal.util.EC2MetadataUtils: Unable to retrieve the requested metadata.
INFO:apache_beam.utils.subprocess_server:23/03/25 21:25:28 WARN software.amazon.awssdk.regions.internal.util.EC2MetadataUtils: Unable to retrieve the requested metadata.
INFO:apache_beam.utils.subprocess_server:23/03/25 21:25:28 WARN software.amazon.awssdk.regions.internal.util.EC2MetadataUtils: Unable to retrieve the requested metadata.
INFO:apache_beam.utils.subprocess_server:23/03/25 21:25:28 INFO org.apache.beam.runners.fnexecution.control.FnApiControlClientPoolService: getProcessBundleDescriptor request with id 1-7
INFO:apache_beam.utils.subprocess_server:23/03/25 21:25:28 INFO org.apache.beam.runners.fnexecution.control.FnApiControlClientPoolService: getProcessBundleDescriptor request with id 1-8
INFO:apache_beam.utils.subprocess_server:23/03/25 21:25:28 INFO org.apache.beam.runners.fnexecution.control.FnApiControlClientPoolService: getProcessBundleDescriptor request with id 1-6
INFO:apache_beam.utils.subprocess_server:23/03/25 21:25:28 INFO org.apache.beam.runners.fnexecution.control.FnApiControlClientPoolService: getProcessBundleDescriptor request with id 1-9
INFO:root:Default Python SDK image for environment is apache/beam_python3.10_sdk:2.47.0.dev
INFO:root:Default Python SDK image for environment is apache/beam_python3.10_sdk:2.47.0.dev
INFO:root:Default Python SDK image for environment is apache/beam_python3.10_sdk:2.47.0.dev
INFO:root:Default Python SDK image for environment is apache/beam_python3.10_sdk:2.47.0.dev
INFO:apache_beam.utils.subprocess_server:23/03/25 21:25:28 INFO org.apache.beam.runners.fnexecution.control.FnApiControlClientPoolService: getProcessBundleDescriptor request with id 1-11
INFO:root:Default Python SDK image for environment is apache/beam_python3.10_sdk:2.47.0.dev
INFO:apache_beam.utils.subprocess_server:23/03/25 21:25:28 INFO org.apache.beam.runners.fnexecution.control.FnApiControlClientPoolService: getProcessBundleDescriptor request with id 1-10
INFO:root:Default Python SDK image for environment is apache/beam_python3.10_sdk:2.47.0.dev
INFO:apache_beam.utils.subprocess_server:23/03/25 21:25:28 INFO org.apache.beam.runners.fnexecution.control.FnApiControlClientPoolService: getProcessBundleDescriptor request with id 1-12
INFO:apache_beam.utils.subprocess_server:23/03/25 21:25:28 INFO org.apache.beam.runners.fnexecution.control.FnApiControlClientPoolService: getProcessBundleDescriptor request with id 1-13
INFO:root:Default Python SDK image for environment is apache/beam_python3.10_sdk:2.47.0.dev
INFO:root:Default Python SDK image for environment is apache/beam_python3.10_sdk:2.47.0.dev
INFO:apache_beam.utils.subprocess_server:23/03/25 21:25:28 WARN software.amazon.awssdk.regions.internal.util.EC2MetadataUtils: Unable to retrieve the requested metadata.
INFO:apache_beam.utils.subprocess_server:23/03/25 21:25:28 WARN software.amazon.awssdk.regions.internal.util.EC2MetadataUtils: Unable to retrieve the requested metadata.
INFO:apache_beam.utils.subprocess_server:23/03/25 21:25:28 WARN software.amazon.awssdk.regions.internal.util.EC2MetadataUtils: Unable to retrieve the requested metadata.
INFO:apache_beam.utils.subprocess_server:23/03/25 21:25:28 WARN software.amazon.awssdk.regions.internal.util.EC2MetadataUtils: Unable to retrieve the requested metadata.
INFO:apache_beam.utils.subprocess_server:23/03/25 21:25:28 INFO org.apache.beam.runners.fnexecution.control.FnApiControlClientPoolService: getProcessBundleDescriptor request with id 1-14
INFO:root:Default Python SDK image for environment is apache/beam_python3.10_sdk:2.47.0.dev
INFO:apache_beam.utils.subprocess_server:23/03/25 21:25:28 WARN software.amazon.awssdk.regions.internal.util.EC2MetadataUtils: Unable to retrieve the requested metadata.
INFO:apache_beam.utils.subprocess_server:23/03/25 21:25:28 WARN software.amazon.awssdk.regions.internal.util.EC2MetadataUtils: Unable to retrieve the requested metadata.
INFO:apache_beam.utils.subprocess_server:23/03/25 21:25:28 WARN software.amazon.awssdk.regions.internal.util.EC2MetadataUtils: Unable to retrieve the requested metadata.
INFO:apache_beam.utils.subprocess_server:23/03/25 21:25:28 WARN software.amazon.awssdk.regions.internal.util.EC2MetadataUtils: Unable to retrieve the requested metadata.
INFO:apache_beam.utils.subprocess_server:23/03/25 21:25:28 INFO org.apache.beam.runners.fnexecution.control.FnApiControlClientPoolService: getProcessBundleDescriptor request with id 1-15
INFO:root:Default Python SDK image for environment is apache/beam_python3.10_sdk:2.47.0.dev
INFO:apache_beam.utils.subprocess_server:23/03/25 21:25:28 INFO org.apache.beam.runners.spark.SparkPipelineRunner: Job BeamApp-jenkins-0325212522-c1eb6f3_ae5e7fe5-2ea4-4ecd-b6a2-b7a3bb658c9c: Pipeline translated successfully. Computing outputs
INFO:apache_beam.utils.subprocess_server:23/03/25 21:25:28 WARN software.amazon.awssdk.regions.internal.util.EC2MetadataUtils: Unable to retrieve the requested metadata.
INFO:apache_beam.utils.subprocess_server:23/03/25 21:25:28 WARN software.amazon.awssdk.regions.internal.util.EC2MetadataUtils: Unable to retrieve the requested metadata.
INFO:apache_beam.utils.subprocess_server:23/03/25 21:25:28 WARN software.amazon.awssdk.regions.internal.util.EC2MetadataUtils: Unable to retrieve the requested metadata.
INFO:apache_beam.utils.subprocess_server:23/03/25 21:25:28 WARN software.amazon.awssdk.regions.internal.util.EC2MetadataUtils: Unable to retrieve the requested metadata.
INFO:apache_beam.utils.subprocess_server:23/03/25 21:25:28 INFO org.apache.beam.runners.fnexecution.control.FnApiControlClientPoolService: getProcessBundleDescriptor request with id 1-16
INFO:root:Default Python SDK image for environment is apache/beam_python3.10_sdk:2.47.0.dev
INFO:apache_beam.io.filebasedsink:Starting finalize_write threads with num_shards: 4 (skipped: 0), batches: 4, num_threads: 4
INFO:apache_beam.io.filebasedsink:Renamed 4 shards in 0.01 seconds.
INFO:apache_beam.utils.subprocess_server:23/03/25 21:25:28 INFO org.apache.beam.runners.spark.SparkPipelineRunner: Job BeamApp-jenkins-0325212522-c1eb6f3_ae5e7fe5-2ea4-4ecd-b6a2-b7a3bb658c9c finished.
INFO:apache_beam.utils.subprocess_server:23/03/25 21:25:28 INFO org.sparkproject.jetty.server.AbstractConnector: Stopped Spark@37e571eb{HTTP/1.1, (http/1.1)}{127.0.0.1:4040}
INFO:apache_beam.runners.portability.portable_runner:Job state changed to DONE
Exception in thread read_state:
Exception in thread run_worker_1-1:
Traceback (most recent call last):
File "/usr/lib/python3.10/threading.py", line 1009, in _bootstrap_inner
Traceback (most recent call last):
File "/usr/lib/python3.10/threading.py", line 1009, in _bootstrap_inner
self.run()
File "/usr/lib/python3.10/threading.py", line 946, in run
self._target(*self._args, **self._kwargs)
File "<https://ci-beam.apache.org/job/beam_PostCommit_Python310/ws/src/sdks/python/apache_beam/runners/worker/sdk_worker.py",> line 262, in run
self.run()
for work_request in self._control_stub.Control(get_responses()):
File "/usr/lib/python3.10/threading.py", line 946, in run
File "<https://ci-beam.apache.org/job/beam_PostCommit_Python310/ws/src/build/gradleenv/-1720702907/lib/python3.10/site-packages/grpc/_channel.py",> line 426, in __next__
ERROR:apache_beam.runners.worker.data_plane:Failed to read inputs in the data plane.
Traceback (most recent call last):
File "<https://ci-beam.apache.org/job/beam_PostCommit_Python310/ws/src/sdks/python/apache_beam/runners/worker/data_plane.py",> line 654, in _read_inputs
for elements in elements_iterator:
File "<https://ci-beam.apache.org/job/beam_PostCommit_Python310/ws/src/build/gradleenv/-1720702907/lib/python3.10/site-packages/grpc/_channel.py",> line 426, in __next__
return self._next()
File "<https://ci-beam.apache.org/job/beam_PostCommit_Python310/ws/src/build/gradleenv/-1720702907/lib/python3.10/site-packages/grpc/_channel.py",> line 826, in _next
raise self
grpc._channel._MultiThreadedRendezvous: <_MultiThreadedRendezvous of RPC that terminated with:
status = StatusCode.UNAVAILABLE
details = "recvmsg:Connection reset by peer"
debug_error_string = "UNKNOWN:Error received from peer ipv6:%5B::1%5D:40947 {created_time:"2023-03-25T21:25:29.323890409+00:00", grpc_status:14, grpc_message:"recvmsg:Connection reset by peer"}"
>
self._target(*self._args, **self._kwargs)
File "<https://ci-beam.apache.org/job/beam_PostCommit_Python310/ws/src/sdks/python/apache_beam/runners/worker/sdk_worker.py",> line 1039, in pull_responses
Exception in thread read_grpc_client_inputs:
return self._next()
Traceback (most recent call last):
File "/usr/lib/python3.10/threading.py", line 1009, in _bootstrap_inner
File "<https://ci-beam.apache.org/job/beam_PostCommit_Python310/ws/src/build/gradleenv/-1720702907/lib/python3.10/site-packages/grpc/_channel.py",> line 826, in _next
for response in responses:
self.run()
File "/usr/lib/python3.10/threading.py", line 946, in run
File "<https://ci-beam.apache.org/job/beam_PostCommit_Python310/ws/src/build/gradleenv/-1720702907/lib/python3.10/site-packages/grpc/_channel.py",> line 426, in __next__
self._target(*self._args, **self._kwargs)
File "<https://ci-beam.apache.org/job/beam_PostCommit_Python310/ws/src/sdks/python/apache_beam/runners/worker/data_plane.py",> line 671, in <lambda>
raise self
return self._next()
target=lambda: self._read_inputs(elements_iterator),
grpc._channel._MultiThreadedRendezvous: <_MultiThreadedRendezvous of RPC that terminated with:
status = StatusCode.UNAVAILABLE
details = "Socket closed"
debug_error_string = "UNKNOWN:Error received from peer ipv6:%5B::1%5D:42155 {grpc_message:"Socket closed", grpc_status:14, created_time:"2023-03-25T21:25:29.323904666+00:00"}"
> File "<https://ci-beam.apache.org/job/beam_PostCommit_Python310/ws/src/sdks/python/apache_beam/runners/worker/data_plane.py",> line 654, in _read_inputs
File "<https://ci-beam.apache.org/job/beam_PostCommit_Python310/ws/src/build/gradleenv/-1720702907/lib/python3.10/site-packages/grpc/_channel.py",> line 826, in _next
for elements in elements_iterator:
File "<https://ci-beam.apache.org/job/beam_PostCommit_Python310/ws/src/build/gradleenv/-1720702907/lib/python3.10/site-packages/grpc/_channel.py",> line 426, in __next__
raise self
grpc._channel._MultiThreadedRendezvous: <_MultiThreadedRendezvous of RPC that terminated with:
status = StatusCode.UNAVAILABLE
details = "recvmsg:Connection reset by peer"
debug_error_string = "UNKNOWN:Error received from peer ipv6:%5B::1%5D:44553 {created_time:"2023-03-25T21:25:29.323863254+00:00", grpc_status:14, grpc_message:"recvmsg:Connection reset by peer"}"
>
return self._next()
File "<https://ci-beam.apache.org/job/beam_PostCommit_Python310/ws/src/build/gradleenv/-1720702907/lib/python3.10/site-packages/grpc/_channel.py",> line 826, in _next
raise self
grpc._channel._MultiThreadedRendezvous: <_MultiThreadedRendezvous of RPC that terminated with:
status = StatusCode.UNAVAILABLE
details = "recvmsg:Connection reset by peer"
debug_error_string = "UNKNOWN:Error received from peer ipv6:%5B::1%5D:40947 {created_time:"2023-03-25T21:25:29.323890409+00:00", grpc_status:14, grpc_message:"recvmsg:Connection reset by peer"}"
>
> Task :sdks:python:test-suites:portable:py310:postCommitPy310
> Task :sdks:python:test-suites:dataflow:py310:postCommitIT FAILED
FAILURE: Build failed with an exception.
* Where:
Script '<https://ci-beam.apache.org/job/beam_PostCommit_Python310/ws/src/sdks/python/test-suites/dataflow/common.gradle'> line: 111
* What went wrong:
Execution failed for task ':sdks:python:test-suites:dataflow:py310:postCommitIT'.
> Process 'command 'sh'' finished with non-zero exit value 1
* Try:
> Run with --stacktrace option to get the stack trace.
> Run with --info or --debug option to get more log output.
* Get more help at https://help.gradle.org
Deprecated Gradle features were used in this build, making it incompatible with Gradle 8.0.
You can use '--warning-mode all' to show the individual deprecation warnings and determine if they come from your own scripts or plugins.
See https://docs.gradle.org/7.5.1/userguide/command_line_interface.html#sec:command_line_warnings
Execution optimizations have been disabled for 1 invalid unit(s) of work during this build to ensure correctness.
Please consult deprecation warnings for more details.
BUILD FAILED in 3h 19m 28s
207 actionable tasks: 142 executed, 59 from cache, 6 up-to-date
Publishing build scan...
https://gradle.com/s/p232i6thnxyso
Build step 'Invoke Gradle script' changed build result to FAILURE
Build step 'Invoke Gradle script' marked build as failure
---------------------------------------------------------------------
To unsubscribe, e-mail: builds-unsubscribe@beam.apache.org
For additional commands, e-mail: builds-help@beam.apache.org