You are viewing a plain text version of this content. The canonical link for it is here.
Posted to dev@kafka.apache.org by Apache Jenkins Server <je...@builds.apache.org> on 2019/09/24 22:48:28 UTC
Build failed in Jenkins: kafka-2.3-jdk8 #111
See <https://builds.apache.org/job/kafka-2.3-jdk8/111/display/redirect?page=changes>
Changes:
[matthias] HOTFIX: fix Kafka Streams upgrade note for broker backward compatibility
------------------------------------------
[...truncated 2.74 MB...]
kafka.controller.PartitionLeaderElectionAlgorithmsTest > testReassignPartitionLeaderElection PASSED
kafka.controller.PartitionLeaderElectionAlgorithmsTest > testOfflinePartitionLeaderElection STARTED
kafka.controller.PartitionLeaderElectionAlgorithmsTest > testOfflinePartitionLeaderElection PASSED
kafka.controller.PartitionLeaderElectionAlgorithmsTest > testPreferredReplicaPartitionLeaderElection STARTED
kafka.controller.PartitionLeaderElectionAlgorithmsTest > testPreferredReplicaPartitionLeaderElection PASSED
kafka.controller.PartitionLeaderElectionAlgorithmsTest > testReassignPartitionLeaderElectionWithEmptyIsr STARTED
kafka.controller.PartitionLeaderElectionAlgorithmsTest > testReassignPartitionLeaderElectionWithEmptyIsr PASSED
kafka.controller.PartitionLeaderElectionAlgorithmsTest > testControlledShutdownPartitionLeaderElectionAllIsrSimultaneouslyShutdown STARTED
kafka.controller.PartitionLeaderElectionAlgorithmsTest > testControlledShutdownPartitionLeaderElectionAllIsrSimultaneouslyShutdown PASSED
kafka.controller.PartitionLeaderElectionAlgorithmsTest > testOfflinePartitionLeaderElectionLastIsrOfflineUncleanLeaderElectionEnabled STARTED
kafka.controller.PartitionLeaderElectionAlgorithmsTest > testOfflinePartitionLeaderElectionLastIsrOfflineUncleanLeaderElectionEnabled PASSED
kafka.controller.PartitionLeaderElectionAlgorithmsTest > testPreferredReplicaPartitionLeaderElectionPreferredReplicaNotInIsrNotLive STARTED
kafka.controller.PartitionLeaderElectionAlgorithmsTest > testPreferredReplicaPartitionLeaderElectionPreferredReplicaNotInIsrNotLive PASSED
kafka.controller.PartitionLeaderElectionAlgorithmsTest > testOfflinePartitionLeaderElectionLastIsrOfflineUncleanLeaderElectionDisabled STARTED
kafka.controller.PartitionLeaderElectionAlgorithmsTest > testOfflinePartitionLeaderElectionLastIsrOfflineUncleanLeaderElectionDisabled PASSED
kafka.controller.ControllerChannelManagerTest > testUpdateMetadataInterBrokerProtocolVersion STARTED
kafka.controller.ControllerChannelManagerTest > testUpdateMetadataInterBrokerProtocolVersion PASSED
kafka.controller.ControllerChannelManagerTest > testLeaderAndIsrRequestIsNew STARTED
kafka.controller.ControllerChannelManagerTest > testLeaderAndIsrRequestIsNew PASSED
kafka.controller.ControllerChannelManagerTest > testStopReplicaRequestsWhileTopicQueuedForDeletion STARTED
kafka.controller.ControllerChannelManagerTest > testStopReplicaRequestsWhileTopicQueuedForDeletion PASSED
kafka.controller.ControllerChannelManagerTest > testLeaderAndIsrRequestSentToLiveOrShuttingDownBrokers STARTED
kafka.controller.ControllerChannelManagerTest > testLeaderAndIsrRequestSentToLiveOrShuttingDownBrokers PASSED
kafka.controller.ControllerChannelManagerTest > testStopReplicaInterBrokerProtocolVersion STARTED
kafka.controller.ControllerChannelManagerTest > testStopReplicaInterBrokerProtocolVersion PASSED
kafka.controller.ControllerChannelManagerTest > testStopReplicaSentOnlyToLiveAndShuttingDownBrokers STARTED
kafka.controller.ControllerChannelManagerTest > testStopReplicaSentOnlyToLiveAndShuttingDownBrokers PASSED
kafka.controller.ControllerChannelManagerTest > testStopReplicaGroupsByBroker STARTED
kafka.controller.ControllerChannelManagerTest > testStopReplicaGroupsByBroker PASSED
kafka.controller.ControllerChannelManagerTest > testUpdateMetadataDoesNotIncludePartitionsWithoutLeaderAndIsr STARTED
kafka.controller.ControllerChannelManagerTest > testUpdateMetadataDoesNotIncludePartitionsWithoutLeaderAndIsr PASSED
kafka.controller.ControllerChannelManagerTest > testMixedDeleteAndNotDeleteStopReplicaRequests STARTED
kafka.controller.ControllerChannelManagerTest > testMixedDeleteAndNotDeleteStopReplicaRequests PASSED
kafka.controller.ControllerChannelManagerTest > testLeaderAndIsrInterBrokerProtocolVersion STARTED
kafka.controller.ControllerChannelManagerTest > testLeaderAndIsrInterBrokerProtocolVersion PASSED
kafka.controller.ControllerChannelManagerTest > testUpdateMetadataRequestSent STARTED
kafka.controller.ControllerChannelManagerTest > testUpdateMetadataRequestSent PASSED
kafka.controller.ControllerChannelManagerTest > testUpdateMetadataRequestDuringTopicDeletion STARTED
kafka.controller.ControllerChannelManagerTest > testUpdateMetadataRequestDuringTopicDeletion PASSED
kafka.controller.ControllerChannelManagerTest > testUpdateMetadataIncludesLiveOrShuttingDownBrokers STARTED
kafka.controller.ControllerChannelManagerTest > testUpdateMetadataIncludesLiveOrShuttingDownBrokers PASSED
kafka.controller.ControllerChannelManagerTest > testStopReplicaRequestSent STARTED
kafka.controller.ControllerChannelManagerTest > testStopReplicaRequestSent PASSED
kafka.controller.ControllerChannelManagerTest > testStopReplicaRequestsWhileTopicDeletionStarted STARTED
kafka.controller.ControllerChannelManagerTest > testStopReplicaRequestsWhileTopicDeletionStarted PASSED
kafka.controller.ControllerChannelManagerTest > testLeaderAndIsrRequestSent STARTED
kafka.controller.ControllerChannelManagerTest > testLeaderAndIsrRequestSent PASSED
kafka.controller.TopicDeletionManagerTest > testBrokerFailureAfterDeletionStarted STARTED
kafka.controller.TopicDeletionManagerTest > testBrokerFailureAfterDeletionStarted PASSED
kafka.controller.TopicDeletionManagerTest > testInitialization STARTED
kafka.controller.TopicDeletionManagerTest > testInitialization PASSED
kafka.controller.TopicDeletionManagerTest > testBasicDeletion STARTED
kafka.controller.TopicDeletionManagerTest > testBasicDeletion PASSED
kafka.controller.TopicDeletionManagerTest > testDeletionWithBrokerOffline STARTED
kafka.controller.TopicDeletionManagerTest > testDeletionWithBrokerOffline PASSED
kafka.controller.ControllerFailoverTest > testHandleIllegalStateException STARTED
kafka.controller.ControllerFailoverTest > testHandleIllegalStateException PASSED
kafka.common.ZkNodeChangeNotificationListenerTest > testProcessNotification STARTED
kafka.common.ZkNodeChangeNotificationListenerTest > testProcessNotification PASSED
kafka.common.ZkNodeChangeNotificationListenerTest > testSwallowsProcessorException STARTED
kafka.common.ZkNodeChangeNotificationListenerTest > testSwallowsProcessorException PASSED
kafka.common.InterBrokerSendThreadTest > shouldCreateClientRequestAndSendWhenNodeIsReady STARTED
kafka.common.InterBrokerSendThreadTest > shouldCreateClientRequestAndSendWhenNodeIsReady PASSED
kafka.common.InterBrokerSendThreadTest > testFailingExpiredRequests STARTED
kafka.common.InterBrokerSendThreadTest > testFailingExpiredRequests PASSED
kafka.common.InterBrokerSendThreadTest > shouldCallCompletionHandlerWithDisconnectedResponseWhenNodeNotReady STARTED
kafka.common.InterBrokerSendThreadTest > shouldCallCompletionHandlerWithDisconnectedResponseWhenNodeNotReady PASSED
kafka.common.InterBrokerSendThreadTest > shouldNotSendAnythingWhenNoRequests STARTED
kafka.common.InterBrokerSendThreadTest > shouldNotSendAnythingWhenNoRequests PASSED
kafka.KafkaTest > testConnectionsMaxReauthMsExplicit STARTED
kafka.KafkaTest > testConnectionsMaxReauthMsExplicit PASSED
kafka.KafkaTest > testKafkaSslPasswordsWithSymbols STARTED
kafka.KafkaTest > testKafkaSslPasswordsWithSymbols PASSED
kafka.KafkaTest > testConnectionsMaxReauthMsDefault STARTED
kafka.KafkaTest > testConnectionsMaxReauthMsDefault PASSED
kafka.KafkaTest > testKafkaSslPasswords STARTED
kafka.KafkaTest > testKafkaSslPasswords PASSED
kafka.KafkaTest > testGetKafkaConfigFromArgs STARTED
kafka.KafkaTest > testGetKafkaConfigFromArgs PASSED
kafka.KafkaTest > testGetKafkaConfigFromArgsNonArgsAtTheEnd STARTED
kafka.KafkaTest > testGetKafkaConfigFromArgsNonArgsAtTheEnd PASSED
kafka.KafkaTest > testGetKafkaConfigFromArgsNonArgsOnly STARTED
kafka.KafkaTest > testGetKafkaConfigFromArgsNonArgsOnly PASSED
kafka.KafkaTest > testGetKafkaConfigFromArgsNonArgsAtTheBegging STARTED
kafka.KafkaTest > testGetKafkaConfigFromArgsNonArgsAtTheBegging PASSED
integration.kafka.api.ConsumerTopicCreationTest > testAutoTopicCreation[brokerTopicCreation=true, consumerTopicCreation=true] STARTED
integration.kafka.api.ConsumerTopicCreationTest > testAutoTopicCreation[brokerTopicCreation=true, consumerTopicCreation=true] PASSED
integration.kafka.api.ConsumerTopicCreationTest > testAutoTopicCreation[brokerTopicCreation=true, consumerTopicCreation=false] STARTED
integration.kafka.api.ConsumerTopicCreationTest > testAutoTopicCreation[brokerTopicCreation=true, consumerTopicCreation=false] PASSED
integration.kafka.api.ConsumerTopicCreationTest > testAutoTopicCreation[brokerTopicCreation=false, consumerTopicCreation=true] STARTED
integration.kafka.api.ConsumerTopicCreationTest > testAutoTopicCreation[brokerTopicCreation=false, consumerTopicCreation=true] PASSED
integration.kafka.api.ConsumerTopicCreationTest > testAutoTopicCreation[brokerTopicCreation=false, consumerTopicCreation=false] STARTED
integration.kafka.api.ConsumerTopicCreationTest > testAutoTopicCreation[brokerTopicCreation=false, consumerTopicCreation=false] PASSED
unit.kafka.utils.ThrottlerTest > testThrottleDesiredRate STARTED
unit.kafka.utils.ThrottlerTest > testThrottleDesiredRate PASSED
2399 tests completed, 2 failed, 2 skipped
> Task :kafka-2.3-jdk8:core:test FAILED
> Task :testScala_2_11 FAILED
FAILURE: Build completed with 3 failures.
1: Task failed with an exception.
-----------
* What went wrong:
Execution failed for task ':streams:test'.
> There were failing tests. See the report at: file://<https://builds.apache.org/job/kafka-2.3-jdk8/ws/streams/build/reports/tests/test/index.html>
* Try:
Run with --stacktrace option to get the stack trace. Run with --info or --debug option to get more log output. Run with --scan to get full insights.
==============================================================================
2: Task failed with an exception.
-----------
* What went wrong:
Execution failed for task ':kafka-2.3-jdk8:core:test'.
> There were failing tests. See the report at: file://<https://builds.apache.org/job/kafka-2.3-jdk8/ws/core/build/reports/tests/test/index.html>
* Try:
Run with --stacktrace option to get the stack trace. Run with --info or --debug option to get more log output. Run with --scan to get full insights.
==============================================================================
3: Task failed with an exception.
-----------
* What went wrong:
Execution failed for task ':kafka-2.3-jdk8:core:test'.
> There were failing tests. See the report at: file://<https://builds.apache.org/job/kafka-2.3-jdk8/ws/core/build/reports/tests/test/index.html>
* Try:
Run with --stacktrace option to get the stack trace. Run with --info or --debug option to get more log output. Run with --scan to get full insights.
==============================================================================
* Get more help at https://help.gradle.org
Deprecated Gradle features were used in this build, making it incompatible with Gradle 6.0.
Use '--warning-mode all' to show the individual deprecation warnings.
See https://docs.gradle.org/5.4.1/userguide/command_line_interface.html#sec:command_line_warnings
BUILD FAILED in 4h 53m 36s
133 actionable tasks: 107 executed, 26 up-to-date
Build step 'Execute shell' marked build as failure
[FINDBUGS] Collecting findbugs analysis files...
Setting GRADLE_4_10_3_HOME=/home/jenkins/tools/gradle/4.10.3
[FINDBUGS] Searching for all files in <https://builds.apache.org/job/kafka-2.3-jdk8/ws/> that match the pattern **/build/reports/findbugs/*.xml
[FINDBUGS] No files found. Configuration error?
Setting GRADLE_4_10_3_HOME=/home/jenkins/tools/gradle/4.10.3
No credentials specified
Setting GRADLE_4_10_3_HOME=/home/jenkins/tools/gradle/4.10.3
<Git Blamer> Using GitBlamer to create author and commit information for all warnings.
<Git Blamer> GIT_COMMIT=39bba62de11d8f0928cd3322aeb5276f93eb5dfb, workspace=<https://builds.apache.org/job/kafka-2.3-jdk8/ws/>
[FINDBUGS] Computing warning deltas based on reference build #110
Recording test results
Setting GRADLE_4_10_3_HOME=/home/jenkins/tools/gradle/4.10.3
Setting GRADLE_4_10_3_HOME=/home/jenkins/tools/gradle/4.10.3
Jenkins build is back to normal : kafka-2.3-jdk8 #117
Posted by Apache Jenkins Server <je...@builds.apache.org>.
See <https://builds.apache.org/job/kafka-2.3-jdk8/117/display/redirect>
Build failed in Jenkins: kafka-2.3-jdk8 #116
Posted by Apache Jenkins Server <je...@builds.apache.org>.
See <https://builds.apache.org/job/kafka-2.3-jdk8/116/display/redirect?page=changes>
Changes:
[mumrah] Minor: fix a few flaky test failures
------------------------------------------
[...truncated 1.25 MB...]
kafka.api.ApiVersionTest > testMinSupportedVersionFor PASSED
kafka.api.ApiVersionTest > testShortVersion STARTED
kafka.api.ApiVersionTest > testShortVersion PASSED
kafka.api.ApiVersionTest > testApply STARTED
kafka.api.ApiVersionTest > testApply PASSED
kafka.api.ApiVersionTest > testApiVersionValidator STARTED
kafka.api.ApiVersionTest > testApiVersionValidator PASSED
kafka.api.PlaintextEndToEndAuthorizationTest > testListenerName STARTED
kafka.api.PlaintextEndToEndAuthorizationTest > testListenerName PASSED
kafka.api.PlaintextEndToEndAuthorizationTest > testNoConsumeWithoutDescribeAclViaSubscribe STARTED
kafka.api.PlaintextEndToEndAuthorizationTest > testNoConsumeWithoutDescribeAclViaSubscribe PASSED
kafka.api.PlaintextEndToEndAuthorizationTest > testProduceConsumeWithPrefixedAcls STARTED
kafka.api.PlaintextEndToEndAuthorizationTest > testProduceConsumeWithPrefixedAcls PASSED
kafka.api.PlaintextEndToEndAuthorizationTest > testProduceConsumeViaAssign STARTED
kafka.api.PlaintextEndToEndAuthorizationTest > testProduceConsumeViaAssign PASSED
kafka.api.PlaintextEndToEndAuthorizationTest > testNoConsumeWithDescribeAclViaAssign STARTED
kafka.api.PlaintextEndToEndAuthorizationTest > testNoConsumeWithDescribeAclViaAssign PASSED
kafka.api.PlaintextEndToEndAuthorizationTest > testProduceConsumeTopicAutoCreateTopicCreateAcl STARTED
kafka.api.PlaintextEndToEndAuthorizationTest > testProduceConsumeTopicAutoCreateTopicCreateAcl PASSED
kafka.api.PlaintextEndToEndAuthorizationTest > testProduceConsumeWithWildcardAcls STARTED
kafka.api.PlaintextEndToEndAuthorizationTest > testProduceConsumeWithWildcardAcls PASSED
kafka.api.PlaintextEndToEndAuthorizationTest > testNoConsumeWithDescribeAclViaSubscribe STARTED
kafka.api.PlaintextEndToEndAuthorizationTest > testNoConsumeWithDescribeAclViaSubscribe PASSED
kafka.api.PlaintextEndToEndAuthorizationTest > testNoConsumeWithoutDescribeAclViaAssign STARTED
kafka.api.PlaintextEndToEndAuthorizationTest > testNoConsumeWithoutDescribeAclViaAssign PASSED
kafka.api.PlaintextEndToEndAuthorizationTest > testNoGroupAcl STARTED
kafka.api.PlaintextEndToEndAuthorizationTest > testNoGroupAcl PASSED
kafka.api.PlaintextEndToEndAuthorizationTest > testNoProduceWithDescribeAcl STARTED
kafka.api.PlaintextEndToEndAuthorizationTest > testNoProduceWithDescribeAcl PASSED
kafka.api.PlaintextEndToEndAuthorizationTest > testNoDescribeProduceOrConsumeWithoutTopicDescribeAcl STARTED
kafka.api.PlaintextEndToEndAuthorizationTest > testNoDescribeProduceOrConsumeWithoutTopicDescribeAcl PASSED
kafka.api.PlaintextEndToEndAuthorizationTest > testProduceConsumeViaSubscribe STARTED
kafka.api.PlaintextEndToEndAuthorizationTest > testProduceConsumeViaSubscribe PASSED
kafka.api.SaslOAuthBearerSslEndToEndAuthorizationTest > testTwoConsumersWithDifferentSaslCredentials STARTED
kafka.api.SaslOAuthBearerSslEndToEndAuthorizationTest > testTwoConsumersWithDifferentSaslCredentials PASSED
kafka.api.SaslOAuthBearerSslEndToEndAuthorizationTest > testNoConsumeWithoutDescribeAclViaSubscribe STARTED
kafka.api.SaslOAuthBearerSslEndToEndAuthorizationTest > testNoConsumeWithoutDescribeAclViaSubscribe PASSED
kafka.api.SaslOAuthBearerSslEndToEndAuthorizationTest > testProduceConsumeWithPrefixedAcls STARTED
kafka.api.SaslOAuthBearerSslEndToEndAuthorizationTest > testProduceConsumeWithPrefixedAcls PASSED
kafka.api.SaslOAuthBearerSslEndToEndAuthorizationTest > testProduceConsumeViaAssign STARTED
kafka.api.SaslOAuthBearerSslEndToEndAuthorizationTest > testProduceConsumeViaAssign PASSED
kafka.api.SaslOAuthBearerSslEndToEndAuthorizationTest > testNoConsumeWithDescribeAclViaAssign STARTED
kafka.api.SaslOAuthBearerSslEndToEndAuthorizationTest > testNoConsumeWithDescribeAclViaAssign PASSED
kafka.api.SaslOAuthBearerSslEndToEndAuthorizationTest > testProduceConsumeTopicAutoCreateTopicCreateAcl STARTED
kafka.api.SaslOAuthBearerSslEndToEndAuthorizationTest > testProduceConsumeTopicAutoCreateTopicCreateAcl PASSED
kafka.api.SaslOAuthBearerSslEndToEndAuthorizationTest > testProduceConsumeWithWildcardAcls STARTED
kafka.api.SaslOAuthBearerSslEndToEndAuthorizationTest > testProduceConsumeWithWildcardAcls PASSED
kafka.api.SaslOAuthBearerSslEndToEndAuthorizationTest > testNoConsumeWithDescribeAclViaSubscribe STARTED
kafka.api.SaslOAuthBearerSslEndToEndAuthorizationTest > testNoConsumeWithDescribeAclViaSubscribe PASSED
kafka.api.SaslOAuthBearerSslEndToEndAuthorizationTest > testNoConsumeWithoutDescribeAclViaAssign STARTED
kafka.api.SaslOAuthBearerSslEndToEndAuthorizationTest > testNoConsumeWithoutDescribeAclViaAssign PASSED
kafka.api.SaslOAuthBearerSslEndToEndAuthorizationTest > testNoGroupAcl STARTED
kafka.api.SaslOAuthBearerSslEndToEndAuthorizationTest > testNoGroupAcl PASSED
kafka.api.SaslOAuthBearerSslEndToEndAuthorizationTest > testNoProduceWithDescribeAcl STARTED
kafka.api.SaslOAuthBearerSslEndToEndAuthorizationTest > testNoProduceWithDescribeAcl PASSED
kafka.api.SaslOAuthBearerSslEndToEndAuthorizationTest > testNoDescribeProduceOrConsumeWithoutTopicDescribeAcl STARTED
kafka.api.SaslOAuthBearerSslEndToEndAuthorizationTest > testNoDescribeProduceOrConsumeWithoutTopicDescribeAcl PASSED
kafka.api.SaslOAuthBearerSslEndToEndAuthorizationTest > testProduceConsumeViaSubscribe STARTED
kafka.api.SaslOAuthBearerSslEndToEndAuthorizationTest > testProduceConsumeViaSubscribe PASSED
kafka.api.TransactionsTest > testBasicTransactions STARTED
kafka.api.TransactionsTest > testBasicTransactions PASSED
kafka.api.TransactionsTest > testFencingOnSendOffsets STARTED
kafka.api.TransactionsTest > testFencingOnSendOffsets PASSED
kafka.api.TransactionsTest > testFencingOnAddPartitions STARTED
kafka.api.TransactionsTest > testFencingOnAddPartitions PASSED
kafka.api.TransactionsTest > testFencingOnTransactionExpiration STARTED
kafka.api.TransactionsTest > testFencingOnTransactionExpiration PASSED
kafka.api.TransactionsTest > testDelayedFetchIncludesAbortedTransaction STARTED
kafka.api.TransactionsTest > testDelayedFetchIncludesAbortedTransaction PASSED
kafka.api.TransactionsTest > testOffsetMetadataInSendOffsetsToTransaction STARTED
kafka.api.TransactionsTest > testOffsetMetadataInSendOffsetsToTransaction PASSED
kafka.api.TransactionsTest > testConsecutivelyRunInitTransactions STARTED
kafka.api.TransactionsTest > testConsecutivelyRunInitTransactions PASSED
kafka.api.TransactionsTest > testReadCommittedConsumerShouldNotSeeUndecidedData STARTED
kafka.api.TransactionsTest > testReadCommittedConsumerShouldNotSeeUndecidedData PASSED
kafka.api.TransactionsTest > testFencingOnSend STARTED
kafka.api.TransactionsTest > testFencingOnSend PASSED
kafka.api.TransactionsTest > testFencingOnCommit STARTED
kafka.api.TransactionsTest > testFencingOnCommit PASSED
kafka.api.TransactionsTest > testMultipleMarkersOneLeader STARTED
kafka.api.TransactionsTest > testMultipleMarkersOneLeader PASSED
kafka.api.TransactionsTest > testCommitTransactionTimeout STARTED
Build timed out (after 360 minutes). Marking the build as failed.
kafka.api.TransactionsTest > testCommitTransactionTimeout PASSED
kafka.api.TransactionsTest > testSendOffsets STARTED
Build was aborted
[FINDBUGS] Collecting findbugs analysis files...
Setting GRADLE_4_10_3_HOME=/home/jenkins/tools/gradle/4.10.3
[FINDBUGS] Searching for all files in <https://builds.apache.org/job/kafka-2.3-jdk8/ws/> that match the pattern **/build/reports/findbugs/*.xml
[FINDBUGS] No files found. Configuration error?
Setting GRADLE_4_10_3_HOME=/home/jenkins/tools/gradle/4.10.3
No credentials specified
Setting GRADLE_4_10_3_HOME=/home/jenkins/tools/gradle/4.10.3
<Git Blamer> Using GitBlamer to create author and commit information for all warnings.
<Git Blamer> GIT_COMMIT=ea56cfc3a9b96de3d194e7d13ef8c3af0961cef4, workspace=<https://builds.apache.org/job/kafka-2.3-jdk8/ws/>
[FINDBUGS] Computing warning deltas based on reference build #110
Recording test results
Setting GRADLE_4_10_3_HOME=/home/jenkins/tools/gradle/4.10.3
kafka.api.TransactionsTest > testSendOffsets SKIPPED
> Task :kafka-2.3-jdk8:core:test FAILED
> Task :testScala_2_11 FAILED
FAILURE: Build completed with 3 failures.
1: Task failed with an exception.
-----------
* What went wrong:
Execution failed for task ':streams:test'.
> There were failing tests. See the report at: file://<https://builds.apache.org/job/kafka-2.3-jdk8/ws/streams/build/reports/tests/test/index.html>
* Try:
Run with --stacktrace option to get the stack trace. Run with --info or --debug option to get more log output. Run with --scan to get full insights.
==============================================================================
2: Task failed with an exception.
-----------
* What went wrong:
Execution failed for task ':kafka-2.3-jdk8:core:test'.
> There were failing tests. See the report at: file://<https://builds.apache.org/job/kafka-2.3-jdk8/ws/core/build/reports/tests/test/index.html>
* Try:
Run with --stacktrace option to get the stack trace. Run with --info or --debug option to get more log output. Run with --scan to get full insights.
==============================================================================
3: Task failed with an exception.
-----------
* What went wrong:
Execution failed for task ':kafka-2.3-jdk8:core:test'.
> Process 'Gradle Test Executor 13' finished with non-zero exit value 143
This problem might be caused by incorrect test process configuration.
Please refer to the test execution section in the User Manual at https://docs.gradle.org/5.4.1/userguide/java_testing.html#sec:test_execution
* Try:
Run with --stacktrace option to get the stack trace. Run with --info or --debug option to get more log output. Run with --scan to get full insights.
==============================================================================
* Get more help at https://help.gradle.org
Deprecated Gradle features were used in this build, making it incompatible with Gradle 6.0.
Use '--warning-mode all' to show the individual deprecation warnings.
See https://docs.gradle.org/5.4.1/userguide/command_line_interface.html#sec:command_line_warnings
BUILD FAILED in 6h 0m 49s
125 actionable tasks: 99 executed, 26 up-to-date
FAILURE: Build failed with an exception.
* What went wrong:
Process 'Gradle Worker Daemon 2' finished with non-zero exit value 143
* Try:
Run with --stacktrace option to get the stack trace. Run with --info or --debug option to get more log output. Run with --scan to get full insights.
* Get more help at https://help.gradle.org
Deprecated Gradle features were used in this build, making it incompatible with Gradle 6.0.
Use '--warning-mode all' to show the individual deprecation warnings.
See https://docs.gradle.org/5.4.1/userguide/command_line_interface.html#sec:command_line_warnings
BUILD FAILED in 6h 0m 49s
Setting GRADLE_4_10_3_HOME=/home/jenkins/tools/gradle/4.10.3
Not sending mail to unregistered user ismael@juma.me.uk
Not sending mail to unregistered user mumrah@gmail.com
Build failed in Jenkins: kafka-2.3-jdk8 #115
Posted by Apache Jenkins Server <je...@builds.apache.org>.
See <https://builds.apache.org/job/kafka-2.3-jdk8/115/display/redirect>
Changes:
------------------------------------------
[...truncated 2.98 MB...]
kafka.security.auth.SimpleAclAuthorizerTest > testAddAclsOnLiteralResource PASSED
kafka.security.auth.SimpleAclAuthorizerTest > testAuthorizeThrowsOnNoneLiteralResource STARTED
kafka.security.auth.SimpleAclAuthorizerTest > testAuthorizeThrowsOnNoneLiteralResource PASSED
kafka.security.auth.SimpleAclAuthorizerTest > testGetAclsPrincipal STARTED
kafka.security.auth.SimpleAclAuthorizerTest > testGetAclsPrincipal PASSED
kafka.security.auth.SimpleAclAuthorizerTest > testAddAclsOnPrefiexedResource STARTED
kafka.security.auth.SimpleAclAuthorizerTest > testAddAclsOnPrefiexedResource PASSED
kafka.security.auth.SimpleAclAuthorizerTest > testWritesExtendedAclChangeEventIfInterBrokerProtocolNotSet STARTED
kafka.security.auth.SimpleAclAuthorizerTest > testWritesExtendedAclChangeEventIfInterBrokerProtocolNotSet PASSED
kafka.security.auth.SimpleAclAuthorizerTest > testAccessAllowedIfAllowAclExistsOnWildcardResource STARTED
kafka.security.auth.SimpleAclAuthorizerTest > testAccessAllowedIfAllowAclExistsOnWildcardResource PASSED
kafka.security.auth.SimpleAclAuthorizerTest > testLoadCache STARTED
kafka.security.auth.SimpleAclAuthorizerTest > testLoadCache PASSED
kafka.security.auth.PermissionTypeTest > testJavaConversions STARTED
kafka.security.auth.PermissionTypeTest > testJavaConversions PASSED
kafka.security.auth.PermissionTypeTest > testFromString STARTED
kafka.security.auth.PermissionTypeTest > testFromString PASSED
kafka.security.auth.ResourceTypeTest > testJavaConversions STARTED
kafka.security.auth.ResourceTypeTest > testJavaConversions PASSED
kafka.security.auth.ResourceTypeTest > testFromString STARTED
kafka.security.auth.ResourceTypeTest > testFromString PASSED
kafka.security.auth.ZkAuthorizationTest > testIsZkSecurityEnabled STARTED
kafka.security.auth.ZkAuthorizationTest > testIsZkSecurityEnabled PASSED
kafka.security.auth.ZkAuthorizationTest > testKafkaZkClient STARTED
kafka.security.auth.ZkAuthorizationTest > testKafkaZkClient PASSED
kafka.security.auth.ZkAuthorizationTest > testZkAntiMigration STARTED
kafka.security.auth.ZkAuthorizationTest > testZkAntiMigration PASSED
kafka.security.auth.ZkAuthorizationTest > testConsumerOffsetPathAcls STARTED
kafka.security.auth.ZkAuthorizationTest > testConsumerOffsetPathAcls PASSED
kafka.security.auth.ZkAuthorizationTest > testZkMigration STARTED
kafka.security.auth.ZkAuthorizationTest > testZkMigration PASSED
kafka.security.auth.ZkAuthorizationTest > testChroot STARTED
kafka.security.auth.ZkAuthorizationTest > testChroot PASSED
kafka.security.auth.ZkAuthorizationTest > testDelete STARTED
kafka.security.auth.ZkAuthorizationTest > testDelete PASSED
kafka.security.auth.ZkAuthorizationTest > testDeleteRecursive STARTED
kafka.security.auth.ZkAuthorizationTest > testDeleteRecursive PASSED
kafka.security.auth.ResourceTest > shouldParseOldTwoPartString STARTED
kafka.security.auth.ResourceTest > shouldParseOldTwoPartString PASSED
kafka.security.auth.ResourceTest > shouldParseOldTwoPartWithEmbeddedSeparators STARTED
kafka.security.auth.ResourceTest > shouldParseOldTwoPartWithEmbeddedSeparators PASSED
kafka.security.auth.ResourceTest > shouldThrowOnTwoPartStringWithUnknownResourceType STARTED
kafka.security.auth.ResourceTest > shouldThrowOnTwoPartStringWithUnknownResourceType PASSED
kafka.security.auth.ResourceTest > shouldThrowOnBadResourceTypeSeparator STARTED
kafka.security.auth.ResourceTest > shouldThrowOnBadResourceTypeSeparator PASSED
kafka.security.auth.ResourceTest > shouldParseThreePartString STARTED
kafka.security.auth.ResourceTest > shouldParseThreePartString PASSED
kafka.security.auth.ResourceTest > shouldRoundTripViaString STARTED
kafka.security.auth.ResourceTest > shouldRoundTripViaString PASSED
kafka.security.auth.ResourceTest > shouldParseThreePartWithEmbeddedSeparators STARTED
kafka.security.auth.ResourceTest > shouldParseThreePartWithEmbeddedSeparators PASSED
kafka.security.token.delegation.DelegationTokenManagerTest > testPeriodicTokenExpiry STARTED
kafka.security.token.delegation.DelegationTokenManagerTest > testPeriodicTokenExpiry PASSED
kafka.security.token.delegation.DelegationTokenManagerTest > testTokenRequestsWithDelegationTokenDisabled STARTED
kafka.security.token.delegation.DelegationTokenManagerTest > testTokenRequestsWithDelegationTokenDisabled PASSED
kafka.security.token.delegation.DelegationTokenManagerTest > testDescribeToken STARTED
kafka.security.token.delegation.DelegationTokenManagerTest > testDescribeToken PASSED
kafka.security.token.delegation.DelegationTokenManagerTest > testCreateToken STARTED
kafka.security.token.delegation.DelegationTokenManagerTest > testCreateToken PASSED
kafka.security.token.delegation.DelegationTokenManagerTest > testExpireToken STARTED
kafka.security.token.delegation.DelegationTokenManagerTest > testExpireToken PASSED
kafka.security.token.delegation.DelegationTokenManagerTest > testRenewToken STARTED
kafka.security.token.delegation.DelegationTokenManagerTest > testRenewToken PASSED
kafka.security.token.delegation.DelegationTokenManagerTest > testRemoveTokenHmac STARTED
kafka.security.token.delegation.DelegationTokenManagerTest > testRemoveTokenHmac PASSED
kafka.network.DynamicConnectionQuotaTest > testDynamicConnectionQuota STARTED
kafka.network.DynamicConnectionQuotaTest > testDynamicConnectionQuota PASSED
kafka.network.DynamicConnectionQuotaTest > testDynamicListenerConnectionQuota STARTED
kafka.network.DynamicConnectionQuotaTest > testDynamicListenerConnectionQuota PASSED
kafka.common.ZkNodeChangeNotificationListenerTest > testProcessNotification STARTED
kafka.common.ZkNodeChangeNotificationListenerTest > testProcessNotification PASSED
kafka.common.ZkNodeChangeNotificationListenerTest > testSwallowsProcessorException STARTED
kafka.common.ZkNodeChangeNotificationListenerTest > testSwallowsProcessorException PASSED
kafka.common.InterBrokerSendThreadTest > shouldCreateClientRequestAndSendWhenNodeIsReady STARTED
kafka.common.InterBrokerSendThreadTest > shouldCreateClientRequestAndSendWhenNodeIsReady PASSED
kafka.common.InterBrokerSendThreadTest > testFailingExpiredRequests STARTED
kafka.common.InterBrokerSendThreadTest > testFailingExpiredRequests PASSED
kafka.common.InterBrokerSendThreadTest > shouldCallCompletionHandlerWithDisconnectedResponseWhenNodeNotReady STARTED
kafka.common.InterBrokerSendThreadTest > shouldCallCompletionHandlerWithDisconnectedResponseWhenNodeNotReady PASSED
kafka.common.InterBrokerSendThreadTest > shouldNotSendAnythingWhenNoRequests STARTED
kafka.common.InterBrokerSendThreadTest > shouldNotSendAnythingWhenNoRequests PASSED
kafka.KafkaTest > testConnectionsMaxReauthMsExplicit STARTED
kafka.KafkaTest > testConnectionsMaxReauthMsExplicit PASSED
kafka.KafkaTest > testKafkaSslPasswordsWithSymbols STARTED
kafka.KafkaTest > testKafkaSslPasswordsWithSymbols PASSED
kafka.KafkaTest > testConnectionsMaxReauthMsDefault STARTED
kafka.KafkaTest > testConnectionsMaxReauthMsDefault PASSED
kafka.KafkaTest > testKafkaSslPasswords STARTED
kafka.KafkaTest > testKafkaSslPasswords PASSED
kafka.KafkaTest > testGetKafkaConfigFromArgs STARTED
kafka.KafkaTest > testGetKafkaConfigFromArgs PASSED
kafka.KafkaTest > testGetKafkaConfigFromArgsNonArgsAtTheEnd STARTED
kafka.KafkaTest > testGetKafkaConfigFromArgsNonArgsAtTheEnd PASSED
kafka.KafkaTest > testGetKafkaConfigFromArgsNonArgsOnly STARTED
kafka.KafkaTest > testGetKafkaConfigFromArgsNonArgsOnly PASSED
kafka.KafkaTest > testGetKafkaConfigFromArgsNonArgsAtTheBegging STARTED
kafka.KafkaTest > testGetKafkaConfigFromArgsNonArgsAtTheBegging PASSED
unit.kafka.utils.ThrottlerTest > testThrottleDesiredRate STARTED
unit.kafka.utils.ThrottlerTest > testThrottleDesiredRate PASSED
2401 tests completed, 2 failed, 2 skipped
> Task :kafka-2.3-jdk8:core:test FAILED
> Task :testScala_2_12 FAILED
FAILURE: Build completed with 2 failures.
1: Task failed with an exception.
-----------
* What went wrong:
Execution failed for task ':kafka-2.3-jdk8:core:test'.
> There were failing tests. See the report at: file://<https://builds.apache.org/job/kafka-2.3-jdk8/ws/core/build/reports/tests/test/index.html>
* Try:
Run with --stacktrace option to get the stack trace. Run with --info or --debug option to get more log output. Run with --scan to get full insights.
==============================================================================
2: Task failed with an exception.
-----------
* What went wrong:
Execution failed for task ':kafka-2.3-jdk8:core:test'.
> There were failing tests. See the report at: file://<https://builds.apache.org/job/kafka-2.3-jdk8/ws/core/build/reports/tests/test/index.html>
* Try:
Run with --stacktrace option to get the stack trace. Run with --info or --debug option to get more log output. Run with --scan to get full insights.
==============================================================================
* Get more help at https://help.gradle.org
Deprecated Gradle features were used in this build, making it incompatible with Gradle 6.0.
Use '--warning-mode all' to show the individual deprecation warnings.
See https://docs.gradle.org/5.4.1/userguide/command_line_interface.html#sec:command_line_warnings
BUILD FAILED in 3h 49m 31s
141 actionable tasks: 115 executed, 26 up-to-date
Build step 'Execute shell' marked build as failure
[FINDBUGS] Collecting findbugs analysis files...
Setting GRADLE_4_10_3_HOME=/home/jenkins/tools/gradle/4.10.3
[FINDBUGS] Searching for all files in <https://builds.apache.org/job/kafka-2.3-jdk8/ws/> that match the pattern **/build/reports/findbugs/*.xml
[FINDBUGS] No files found. Configuration error?
Setting GRADLE_4_10_3_HOME=/home/jenkins/tools/gradle/4.10.3
No credentials specified
Setting GRADLE_4_10_3_HOME=/home/jenkins/tools/gradle/4.10.3
<Git Blamer> Using GitBlamer to create author and commit information for all warnings.
<Git Blamer> GIT_COMMIT=080178add5ee2c811e1ec425793d0f619da8d4b6, workspace=<https://builds.apache.org/job/kafka-2.3-jdk8/ws/>
[FINDBUGS] Computing warning deltas based on reference build #110
Recording test results
Setting GRADLE_4_10_3_HOME=/home/jenkins/tools/gradle/4.10.3
Setting GRADLE_4_10_3_HOME=/home/jenkins/tools/gradle/4.10.3
Not sending mail to unregistered user ismael@juma.me.uk
Not sending mail to unregistered user mumrah@gmail.com
Build failed in Jenkins: kafka-2.3-jdk8 #114
Posted by Apache Jenkins Server <je...@builds.apache.org>.
See <https://builds.apache.org/job/kafka-2.3-jdk8/114/display/redirect>
Changes:
------------------------------------------
[...truncated 2.94 MB...]
kafka.security.auth.SimpleAclAuthorizerTest > testAddAclsOnLiteralResource PASSED
kafka.security.auth.SimpleAclAuthorizerTest > testAuthorizeThrowsOnNoneLiteralResource STARTED
kafka.security.auth.SimpleAclAuthorizerTest > testAuthorizeThrowsOnNoneLiteralResource PASSED
kafka.security.auth.SimpleAclAuthorizerTest > testGetAclsPrincipal STARTED
kafka.security.auth.SimpleAclAuthorizerTest > testGetAclsPrincipal PASSED
kafka.security.auth.SimpleAclAuthorizerTest > testAddAclsOnPrefiexedResource STARTED
kafka.security.auth.SimpleAclAuthorizerTest > testAddAclsOnPrefiexedResource PASSED
kafka.security.auth.SimpleAclAuthorizerTest > testWritesExtendedAclChangeEventIfInterBrokerProtocolNotSet STARTED
kafka.security.auth.SimpleAclAuthorizerTest > testWritesExtendedAclChangeEventIfInterBrokerProtocolNotSet PASSED
kafka.security.auth.SimpleAclAuthorizerTest > testAccessAllowedIfAllowAclExistsOnWildcardResource STARTED
kafka.security.auth.SimpleAclAuthorizerTest > testAccessAllowedIfAllowAclExistsOnWildcardResource PASSED
kafka.security.auth.SimpleAclAuthorizerTest > testLoadCache STARTED
kafka.security.auth.SimpleAclAuthorizerTest > testLoadCache PASSED
kafka.security.auth.PermissionTypeTest > testJavaConversions STARTED
kafka.security.auth.PermissionTypeTest > testJavaConversions PASSED
kafka.security.auth.PermissionTypeTest > testFromString STARTED
kafka.security.auth.PermissionTypeTest > testFromString PASSED
kafka.security.auth.ResourceTypeTest > testJavaConversions STARTED
kafka.security.auth.ResourceTypeTest > testJavaConversions PASSED
kafka.security.auth.ResourceTypeTest > testFromString STARTED
kafka.security.auth.ResourceTypeTest > testFromString PASSED
kafka.security.auth.ZkAuthorizationTest > testIsZkSecurityEnabled STARTED
kafka.security.auth.ZkAuthorizationTest > testIsZkSecurityEnabled PASSED
kafka.security.auth.ZkAuthorizationTest > testKafkaZkClient STARTED
kafka.security.auth.ZkAuthorizationTest > testKafkaZkClient PASSED
kafka.security.auth.ZkAuthorizationTest > testZkAntiMigration STARTED
kafka.security.auth.ZkAuthorizationTest > testZkAntiMigration PASSED
kafka.security.auth.ZkAuthorizationTest > testConsumerOffsetPathAcls STARTED
kafka.security.auth.ZkAuthorizationTest > testConsumerOffsetPathAcls PASSED
kafka.security.auth.ZkAuthorizationTest > testZkMigration STARTED
kafka.security.auth.ZkAuthorizationTest > testZkMigration PASSED
kafka.security.auth.ZkAuthorizationTest > testChroot STARTED
kafka.security.auth.ZkAuthorizationTest > testChroot PASSED
kafka.security.auth.ZkAuthorizationTest > testDelete STARTED
kafka.security.auth.ZkAuthorizationTest > testDelete PASSED
kafka.security.auth.ZkAuthorizationTest > testDeleteRecursive STARTED
kafka.security.auth.ZkAuthorizationTest > testDeleteRecursive PASSED
kafka.security.auth.ResourceTest > shouldParseOldTwoPartString STARTED
kafka.security.auth.ResourceTest > shouldParseOldTwoPartString PASSED
kafka.security.auth.ResourceTest > shouldParseOldTwoPartWithEmbeddedSeparators STARTED
kafka.security.auth.ResourceTest > shouldParseOldTwoPartWithEmbeddedSeparators PASSED
kafka.security.auth.ResourceTest > shouldThrowOnTwoPartStringWithUnknownResourceType STARTED
kafka.security.auth.ResourceTest > shouldThrowOnTwoPartStringWithUnknownResourceType PASSED
kafka.security.auth.ResourceTest > shouldThrowOnBadResourceTypeSeparator STARTED
kafka.security.auth.ResourceTest > shouldThrowOnBadResourceTypeSeparator PASSED
kafka.security.auth.ResourceTest > shouldParseThreePartString STARTED
kafka.security.auth.ResourceTest > shouldParseThreePartString PASSED
kafka.security.auth.ResourceTest > shouldRoundTripViaString STARTED
kafka.security.auth.ResourceTest > shouldRoundTripViaString PASSED
kafka.security.auth.ResourceTest > shouldParseThreePartWithEmbeddedSeparators STARTED
kafka.security.auth.ResourceTest > shouldParseThreePartWithEmbeddedSeparators PASSED
kafka.security.token.delegation.DelegationTokenManagerTest > testPeriodicTokenExpiry STARTED
kafka.security.token.delegation.DelegationTokenManagerTest > testPeriodicTokenExpiry PASSED
kafka.security.token.delegation.DelegationTokenManagerTest > testTokenRequestsWithDelegationTokenDisabled STARTED
kafka.security.token.delegation.DelegationTokenManagerTest > testTokenRequestsWithDelegationTokenDisabled PASSED
kafka.security.token.delegation.DelegationTokenManagerTest > testDescribeToken STARTED
kafka.security.token.delegation.DelegationTokenManagerTest > testDescribeToken PASSED
kafka.security.token.delegation.DelegationTokenManagerTest > testCreateToken STARTED
kafka.security.token.delegation.DelegationTokenManagerTest > testCreateToken PASSED
kafka.security.token.delegation.DelegationTokenManagerTest > testExpireToken STARTED
kafka.security.token.delegation.DelegationTokenManagerTest > testExpireToken PASSED
kafka.security.token.delegation.DelegationTokenManagerTest > testRenewToken STARTED
kafka.security.token.delegation.DelegationTokenManagerTest > testRenewToken PASSED
kafka.security.token.delegation.DelegationTokenManagerTest > testRemoveTokenHmac STARTED
kafka.security.token.delegation.DelegationTokenManagerTest > testRemoveTokenHmac PASSED
kafka.network.DynamicConnectionQuotaTest > testDynamicConnectionQuota STARTED
kafka.network.DynamicConnectionQuotaTest > testDynamicConnectionQuota PASSED
kafka.network.DynamicConnectionQuotaTest > testDynamicListenerConnectionQuota STARTED
kafka.network.DynamicConnectionQuotaTest > testDynamicListenerConnectionQuota PASSED
kafka.common.ZkNodeChangeNotificationListenerTest > testProcessNotification STARTED
kafka.common.ZkNodeChangeNotificationListenerTest > testProcessNotification PASSED
kafka.common.ZkNodeChangeNotificationListenerTest > testSwallowsProcessorException STARTED
kafka.common.ZkNodeChangeNotificationListenerTest > testSwallowsProcessorException PASSED
kafka.common.InterBrokerSendThreadTest > shouldCreateClientRequestAndSendWhenNodeIsReady STARTED
kafka.common.InterBrokerSendThreadTest > shouldCreateClientRequestAndSendWhenNodeIsReady PASSED
kafka.common.InterBrokerSendThreadTest > testFailingExpiredRequests STARTED
kafka.common.InterBrokerSendThreadTest > testFailingExpiredRequests PASSED
kafka.common.InterBrokerSendThreadTest > shouldCallCompletionHandlerWithDisconnectedResponseWhenNodeNotReady STARTED
kafka.common.InterBrokerSendThreadTest > shouldCallCompletionHandlerWithDisconnectedResponseWhenNodeNotReady PASSED
kafka.common.InterBrokerSendThreadTest > shouldNotSendAnythingWhenNoRequests STARTED
kafka.common.InterBrokerSendThreadTest > shouldNotSendAnythingWhenNoRequests PASSED
kafka.KafkaTest > testConnectionsMaxReauthMsExplicit STARTED
kafka.KafkaTest > testConnectionsMaxReauthMsExplicit PASSED
kafka.KafkaTest > testKafkaSslPasswordsWithSymbols STARTED
kafka.KafkaTest > testKafkaSslPasswordsWithSymbols PASSED
kafka.KafkaTest > testConnectionsMaxReauthMsDefault STARTED
kafka.KafkaTest > testConnectionsMaxReauthMsDefault PASSED
kafka.KafkaTest > testKafkaSslPasswords STARTED
kafka.KafkaTest > testKafkaSslPasswords PASSED
kafka.KafkaTest > testGetKafkaConfigFromArgs STARTED
kafka.KafkaTest > testGetKafkaConfigFromArgs PASSED
kafka.KafkaTest > testGetKafkaConfigFromArgsNonArgsAtTheEnd STARTED
kafka.KafkaTest > testGetKafkaConfigFromArgsNonArgsAtTheEnd PASSED
kafka.KafkaTest > testGetKafkaConfigFromArgsNonArgsOnly STARTED
kafka.KafkaTest > testGetKafkaConfigFromArgsNonArgsOnly PASSED
kafka.KafkaTest > testGetKafkaConfigFromArgsNonArgsAtTheBegging STARTED
kafka.KafkaTest > testGetKafkaConfigFromArgsNonArgsAtTheBegging PASSED
unit.kafka.utils.ThrottlerTest > testThrottleDesiredRate STARTED
unit.kafka.utils.ThrottlerTest > testThrottleDesiredRate PASSED
2401 tests completed, 2 failed, 2 skipped
> Task :kafka-2.3-jdk8:core:test FAILED
> Task :testScala_2_11 FAILED
FAILURE: Build completed with 2 failures.
1: Task failed with an exception.
-----------
* What went wrong:
Execution failed for task ':kafka-2.3-jdk8:core:test'.
> There were failing tests. See the report at: file://<https://builds.apache.org/job/kafka-2.3-jdk8/ws/core/build/reports/tests/test/index.html>
* Try:
Run with --stacktrace option to get the stack trace. Run with --info or --debug option to get more log output. Run with --scan to get full insights.
==============================================================================
2: Task failed with an exception.
-----------
* What went wrong:
Execution failed for task ':kafka-2.3-jdk8:core:test'.
> There were failing tests. See the report at: file://<https://builds.apache.org/job/kafka-2.3-jdk8/ws/core/build/reports/tests/test/index.html>
* Try:
Run with --stacktrace option to get the stack trace. Run with --info or --debug option to get more log output. Run with --scan to get full insights.
==============================================================================
* Get more help at https://help.gradle.org
Deprecated Gradle features were used in this build, making it incompatible with Gradle 6.0.
Use '--warning-mode all' to show the individual deprecation warnings.
See https://docs.gradle.org/5.4.1/userguide/command_line_interface.html#sec:command_line_warnings
BUILD FAILED in 3h 41m 44s
141 actionable tasks: 115 executed, 26 up-to-date
Build step 'Execute shell' marked build as failure
[FINDBUGS] Collecting findbugs analysis files...
Setting GRADLE_4_10_3_HOME=/home/jenkins/tools/gradle/4.10.3
[FINDBUGS] Searching for all files in <https://builds.apache.org/job/kafka-2.3-jdk8/ws/> that match the pattern **/build/reports/findbugs/*.xml
[FINDBUGS] No files found. Configuration error?
Setting GRADLE_4_10_3_HOME=/home/jenkins/tools/gradle/4.10.3
No credentials specified
Setting GRADLE_4_10_3_HOME=/home/jenkins/tools/gradle/4.10.3
<Git Blamer> Using GitBlamer to create author and commit information for all warnings.
<Git Blamer> GIT_COMMIT=080178add5ee2c811e1ec425793d0f619da8d4b6, workspace=<https://builds.apache.org/job/kafka-2.3-jdk8/ws/>
[FINDBUGS] Computing warning deltas based on reference build #110
Recording test results
Setting GRADLE_4_10_3_HOME=/home/jenkins/tools/gradle/4.10.3
Setting GRADLE_4_10_3_HOME=/home/jenkins/tools/gradle/4.10.3
Not sending mail to unregistered user ismael@juma.me.uk
Not sending mail to unregistered user mumrah@gmail.com
Build failed in Jenkins: kafka-2.3-jdk8 #113
Posted by Apache Jenkins Server <je...@builds.apache.org>.
See <https://builds.apache.org/job/kafka-2.3-jdk8/113/display/redirect?page=changes>
Changes:
[mumrah] KAFKA-8896: Check group state before completing delayed heartbeat
------------------------------------------
[...truncated 2.94 MB...]
kafka.log.ProducerStateManagerTest > testAppendTxnMarkerWithNoProducerState PASSED
kafka.log.ProducerStateManagerTest > testOldEpochForControlRecord STARTED
kafka.log.ProducerStateManagerTest > testOldEpochForControlRecord PASSED
kafka.log.ProducerStateManagerTest > testTruncateAndReloadRemovesOutOfRangeSnapshots STARTED
kafka.log.ProducerStateManagerTest > testTruncateAndReloadRemovesOutOfRangeSnapshots PASSED
kafka.log.ProducerStateManagerTest > testStartOffset STARTED
kafka.log.ProducerStateManagerTest > testStartOffset PASSED
kafka.log.ProducerStateManagerTest > testProducerSequenceInvalidWrapAround STARTED
kafka.log.ProducerStateManagerTest > testProducerSequenceInvalidWrapAround PASSED
kafka.log.ProducerStateManagerTest > testTruncateHead STARTED
kafka.log.ProducerStateManagerTest > testTruncateHead PASSED
kafka.log.ProducerStateManagerTest > testNonTransactionalAppendWithOngoingTransaction STARTED
kafka.log.ProducerStateManagerTest > testNonTransactionalAppendWithOngoingTransaction PASSED
kafka.log.ProducerStateManagerTest > testSkipSnapshotIfOffsetUnchanged STARTED
kafka.log.ProducerStateManagerTest > testSkipSnapshotIfOffsetUnchanged PASSED
kafka.log.BrokerCompressionTest > testBrokerSideCompression[0] STARTED
kafka.log.BrokerCompressionTest > testBrokerSideCompression[0] PASSED
kafka.log.BrokerCompressionTest > testBrokerSideCompression[1] STARTED
kafka.log.BrokerCompressionTest > testBrokerSideCompression[1] PASSED
kafka.log.BrokerCompressionTest > testBrokerSideCompression[2] STARTED
kafka.log.BrokerCompressionTest > testBrokerSideCompression[2] PASSED
kafka.log.BrokerCompressionTest > testBrokerSideCompression[3] STARTED
kafka.log.BrokerCompressionTest > testBrokerSideCompression[3] PASSED
kafka.log.BrokerCompressionTest > testBrokerSideCompression[4] STARTED
kafka.log.BrokerCompressionTest > testBrokerSideCompression[4] PASSED
kafka.log.BrokerCompressionTest > testBrokerSideCompression[5] STARTED
kafka.log.BrokerCompressionTest > testBrokerSideCompression[5] PASSED
kafka.log.BrokerCompressionTest > testBrokerSideCompression[6] STARTED
kafka.log.BrokerCompressionTest > testBrokerSideCompression[6] PASSED
kafka.log.BrokerCompressionTest > testBrokerSideCompression[7] STARTED
kafka.log.BrokerCompressionTest > testBrokerSideCompression[7] PASSED
kafka.log.BrokerCompressionTest > testBrokerSideCompression[8] STARTED
kafka.log.BrokerCompressionTest > testBrokerSideCompression[8] PASSED
kafka.log.BrokerCompressionTest > testBrokerSideCompression[9] STARTED
kafka.log.BrokerCompressionTest > testBrokerSideCompression[9] PASSED
kafka.log.BrokerCompressionTest > testBrokerSideCompression[10] STARTED
kafka.log.BrokerCompressionTest > testBrokerSideCompression[10] PASSED
kafka.log.BrokerCompressionTest > testBrokerSideCompression[11] STARTED
kafka.log.BrokerCompressionTest > testBrokerSideCompression[11] PASSED
kafka.log.BrokerCompressionTest > testBrokerSideCompression[12] STARTED
kafka.log.BrokerCompressionTest > testBrokerSideCompression[12] PASSED
kafka.log.BrokerCompressionTest > testBrokerSideCompression[13] STARTED
kafka.log.BrokerCompressionTest > testBrokerSideCompression[13] PASSED
kafka.log.BrokerCompressionTest > testBrokerSideCompression[14] STARTED
kafka.log.BrokerCompressionTest > testBrokerSideCompression[14] PASSED
kafka.log.BrokerCompressionTest > testBrokerSideCompression[15] STARTED
kafka.log.BrokerCompressionTest > testBrokerSideCompression[15] PASSED
kafka.log.BrokerCompressionTest > testBrokerSideCompression[16] STARTED
kafka.log.BrokerCompressionTest > testBrokerSideCompression[16] PASSED
kafka.log.BrokerCompressionTest > testBrokerSideCompression[17] STARTED
kafka.log.BrokerCompressionTest > testBrokerSideCompression[17] PASSED
kafka.log.BrokerCompressionTest > testBrokerSideCompression[18] STARTED
kafka.log.BrokerCompressionTest > testBrokerSideCompression[18] PASSED
kafka.log.BrokerCompressionTest > testBrokerSideCompression[19] STARTED
kafka.log.BrokerCompressionTest > testBrokerSideCompression[19] PASSED
kafka.log.BrokerCompressionTest > testBrokerSideCompression[20] STARTED
kafka.log.BrokerCompressionTest > testBrokerSideCompression[20] PASSED
kafka.log.BrokerCompressionTest > testBrokerSideCompression[21] STARTED
kafka.log.BrokerCompressionTest > testBrokerSideCompression[21] PASSED
kafka.log.BrokerCompressionTest > testBrokerSideCompression[22] STARTED
kafka.log.BrokerCompressionTest > testBrokerSideCompression[22] PASSED
kafka.log.BrokerCompressionTest > testBrokerSideCompression[23] STARTED
kafka.log.BrokerCompressionTest > testBrokerSideCompression[23] PASSED
kafka.log.BrokerCompressionTest > testBrokerSideCompression[24] STARTED
kafka.log.BrokerCompressionTest > testBrokerSideCompression[24] PASSED
kafka.log.BrokerCompressionTest > testBrokerSideCompression[25] STARTED
kafka.log.BrokerCompressionTest > testBrokerSideCompression[25] PASSED
kafka.log.BrokerCompressionTest > testBrokerSideCompression[26] STARTED
kafka.log.BrokerCompressionTest > testBrokerSideCompression[26] PASSED
kafka.log.BrokerCompressionTest > testBrokerSideCompression[27] STARTED
kafka.log.BrokerCompressionTest > testBrokerSideCompression[27] PASSED
kafka.log.BrokerCompressionTest > testBrokerSideCompression[28] STARTED
kafka.log.BrokerCompressionTest > testBrokerSideCompression[28] PASSED
kafka.log.BrokerCompressionTest > testBrokerSideCompression[29] STARTED
kafka.log.BrokerCompressionTest > testBrokerSideCompression[29] PASSED
kafka.log.OffsetIndexTest > lookupExtremeCases STARTED
kafka.log.OffsetIndexTest > lookupExtremeCases PASSED
kafka.log.OffsetIndexTest > appendTooMany STARTED
kafka.log.OffsetIndexTest > appendTooMany PASSED
kafka.log.OffsetIndexTest > testEntry STARTED
kafka.log.OffsetIndexTest > testEntry PASSED
kafka.log.OffsetIndexTest > testSanityLastOffsetEqualToBaseOffset STARTED
kafka.log.OffsetIndexTest > testSanityLastOffsetEqualToBaseOffset PASSED
kafka.log.OffsetIndexTest > forceUnmapTest STARTED
kafka.log.OffsetIndexTest > forceUnmapTest PASSED
kafka.log.OffsetIndexTest > testFetchUpperBoundOffset STARTED
kafka.log.OffsetIndexTest > testFetchUpperBoundOffset PASSED
kafka.log.OffsetIndexTest > randomLookupTest STARTED
kafka.log.OffsetIndexTest > randomLookupTest PASSED
kafka.log.OffsetIndexTest > testEntryOverflow STARTED
kafka.log.OffsetIndexTest > testEntryOverflow PASSED
kafka.log.OffsetIndexTest > testReopen STARTED
kafka.log.OffsetIndexTest > testReopen PASSED
kafka.log.OffsetIndexTest > appendOutOfOrder STARTED
kafka.log.OffsetIndexTest > appendOutOfOrder PASSED
kafka.log.OffsetIndexTest > truncate STARTED
kafka.log.OffsetIndexTest > truncate PASSED
unit.kafka.utils.ThrottlerTest > testThrottleDesiredRate STARTED
unit.kafka.utils.ThrottlerTest > testThrottleDesiredRate PASSED
2401 tests completed, 2 failed, 2 skipped
> Task :kafka-2.3-jdk8:core:test FAILED
> Task :testScala_2_11 FAILED
FAILURE: Build completed with 2 failures.
1: Task failed with an exception.
-----------
* What went wrong:
Execution failed for task ':kafka-2.3-jdk8:core:test'.
> There were failing tests. See the report at: file://<https://builds.apache.org/job/kafka-2.3-jdk8/ws/core/build/reports/tests/test/index.html>
* Try:
Run with --stacktrace option to get the stack trace. Run with --info or --debug option to get more log output. Run with --scan to get full insights.
==============================================================================
2: Task failed with an exception.
-----------
* What went wrong:
Execution failed for task ':kafka-2.3-jdk8:core:test'.
> There were failing tests. See the report at: file://<https://builds.apache.org/job/kafka-2.3-jdk8/ws/core/build/reports/tests/test/index.html>
* Try:
Run with --stacktrace option to get the stack trace. Run with --info or --debug option to get more log output. Run with --scan to get full insights.
==============================================================================
* Get more help at https://help.gradle.org
Deprecated Gradle features were used in this build, making it incompatible with Gradle 6.0.
Use '--warning-mode all' to show the individual deprecation warnings.
See https://docs.gradle.org/5.4.1/userguide/command_line_interface.html#sec:command_line_warnings
BUILD FAILED in 3h 54m 31s
141 actionable tasks: 115 executed, 26 up-to-date
Build step 'Execute shell' marked build as failure
[FINDBUGS] Collecting findbugs analysis files...
Setting GRADLE_4_10_3_HOME=/home/jenkins/tools/gradle/4.10.3
[FINDBUGS] Searching for all files in <https://builds.apache.org/job/kafka-2.3-jdk8/ws/> that match the pattern **/build/reports/findbugs/*.xml
[FINDBUGS] No files found. Configuration error?
Setting GRADLE_4_10_3_HOME=/home/jenkins/tools/gradle/4.10.3
No credentials specified
Setting GRADLE_4_10_3_HOME=/home/jenkins/tools/gradle/4.10.3
<Git Blamer> Using GitBlamer to create author and commit information for all warnings.
<Git Blamer> GIT_COMMIT=080178add5ee2c811e1ec425793d0f619da8d4b6, workspace=<https://builds.apache.org/job/kafka-2.3-jdk8/ws/>
[FINDBUGS] Computing warning deltas based on reference build #110
Recording test results
Setting GRADLE_4_10_3_HOME=/home/jenkins/tools/gradle/4.10.3
Setting GRADLE_4_10_3_HOME=/home/jenkins/tools/gradle/4.10.3
Not sending mail to unregistered user ismael@juma.me.uk
Not sending mail to unregistered user mumrah@gmail.com
Build failed in Jenkins: kafka-2.3-jdk8 #112
Posted by Apache Jenkins Server <je...@builds.apache.org>.
See <https://builds.apache.org/job/kafka-2.3-jdk8/112/display/redirect?page=changes>
Changes:
[ismael] MINOR: Update Jackson to 2.10.0 (#7411)
------------------------------------------
[...truncated 1.46 MB...]
org.apache.kafka.streams.tests.SystemTestUtilTest > shouldParseSingleKeyValuePairString STARTED
org.apache.kafka.streams.tests.SystemTestUtilTest > shouldParseSingleKeyValuePairString PASSED
org.apache.kafka.streams.KeyValueTest > shouldHaveSameEqualsAndHashCode STARTED
org.apache.kafka.streams.KeyValueTest > shouldHaveSameEqualsAndHashCode PASSED
org.apache.kafka.streams.integration.KStreamAggregationDedupIntegrationTest > shouldReduce STARTED
org.apache.kafka.streams.integration.KStreamAggregationDedupIntegrationTest > shouldReduce PASSED
org.apache.kafka.streams.integration.KStreamAggregationDedupIntegrationTest > shouldGroupByKey STARTED
org.apache.kafka.streams.integration.KStreamAggregationDedupIntegrationTest > shouldGroupByKey PASSED
org.apache.kafka.streams.integration.KStreamAggregationDedupIntegrationTest > shouldReduceWindowed STARTED
org.apache.kafka.streams.integration.KStreamAggregationDedupIntegrationTest > shouldReduceWindowed PASSED
org.apache.kafka.streams.integration.PurgeRepartitionTopicIntegrationTest > shouldRestoreState STARTED
org.apache.kafka.streams.integration.PurgeRepartitionTopicIntegrationTest > shouldRestoreState PASSED
org.apache.kafka.streams.integration.KStreamAggregationIntegrationTest > shouldReduceSessionWindows STARTED
org.apache.kafka.streams.integration.KStreamAggregationIntegrationTest > shouldReduceSessionWindows PASSED
org.apache.kafka.streams.integration.KStreamAggregationIntegrationTest > shouldReduce STARTED
org.apache.kafka.streams.integration.KStreamAggregationIntegrationTest > shouldReduce PASSED
org.apache.kafka.streams.integration.KStreamAggregationIntegrationTest > shouldAggregate STARTED
org.apache.kafka.streams.integration.KStreamAggregationIntegrationTest > shouldAggregate PASSED
org.apache.kafka.streams.integration.KStreamAggregationIntegrationTest > shouldCount STARTED
org.apache.kafka.streams.integration.KStreamAggregationIntegrationTest > shouldCount PASSED
org.apache.kafka.streams.integration.KStreamAggregationIntegrationTest > shouldGroupByKey STARTED
org.apache.kafka.streams.integration.KStreamAggregationIntegrationTest > shouldGroupByKey PASSED
org.apache.kafka.streams.integration.KStreamAggregationIntegrationTest > shouldCountWithInternalStore STARTED
org.apache.kafka.streams.integration.KStreamAggregationIntegrationTest > shouldCountWithInternalStore PASSED
org.apache.kafka.streams.integration.KStreamAggregationIntegrationTest > shouldCountUnlimitedWindows STARTED
org.apache.kafka.streams.integration.KStreamAggregationIntegrationTest > shouldCountUnlimitedWindows PASSED
org.apache.kafka.streams.integration.KStreamAggregationIntegrationTest > shouldReduceWindowed STARTED
org.apache.kafka.streams.integration.KStreamAggregationIntegrationTest > shouldReduceWindowed PASSED
org.apache.kafka.streams.integration.KStreamAggregationIntegrationTest > shouldCountSessionWindows STARTED
org.apache.kafka.streams.integration.KStreamAggregationIntegrationTest > shouldCountSessionWindows PASSED
org.apache.kafka.streams.integration.KStreamAggregationIntegrationTest > shouldAggregateWindowed STARTED
org.apache.kafka.streams.integration.KStreamAggregationIntegrationTest > shouldAggregateWindowed PASSED
org.apache.kafka.streams.integration.FineGrainedAutoResetIntegrationTest > shouldOnlyReadRecordsWhereEarliestSpecifiedWithNoCommittedOffsetsWithGlobalAutoOffsetResetLatest STARTED
org.apache.kafka.streams.integration.FineGrainedAutoResetIntegrationTest > shouldOnlyReadRecordsWhereEarliestSpecifiedWithNoCommittedOffsetsWithGlobalAutoOffsetResetLatest PASSED
org.apache.kafka.streams.integration.FineGrainedAutoResetIntegrationTest > shouldThrowExceptionOverlappingPattern STARTED
org.apache.kafka.streams.integration.FineGrainedAutoResetIntegrationTest > shouldThrowExceptionOverlappingPattern PASSED
org.apache.kafka.streams.integration.FineGrainedAutoResetIntegrationTest > shouldThrowExceptionOverlappingTopic STARTED
org.apache.kafka.streams.integration.FineGrainedAutoResetIntegrationTest > shouldThrowExceptionOverlappingTopic PASSED
org.apache.kafka.streams.integration.FineGrainedAutoResetIntegrationTest > shouldOnlyReadRecordsWhereEarliestSpecifiedWithInvalidCommittedOffsets STARTED
org.apache.kafka.streams.integration.FineGrainedAutoResetIntegrationTest > shouldOnlyReadRecordsWhereEarliestSpecifiedWithInvalidCommittedOffsets PASSED
org.apache.kafka.streams.integration.FineGrainedAutoResetIntegrationTest > shouldOnlyReadRecordsWhereEarliestSpecifiedWithNoCommittedOffsetsWithDefaultGlobalAutoOffsetResetEarliest STARTED
org.apache.kafka.streams.integration.FineGrainedAutoResetIntegrationTest > shouldOnlyReadRecordsWhereEarliestSpecifiedWithNoCommittedOffsetsWithDefaultGlobalAutoOffsetResetEarliest PASSED
org.apache.kafka.streams.integration.FineGrainedAutoResetIntegrationTest > shouldThrowStreamsExceptionNoResetSpecified STARTED
org.apache.kafka.streams.integration.FineGrainedAutoResetIntegrationTest > shouldThrowStreamsExceptionNoResetSpecified PASSED
org.apache.kafka.streams.integration.SuppressionDurabilityIntegrationTest > shouldRecoverBufferAfterShutdown[0: eosEnabled=false] STARTED
org.apache.kafka.streams.integration.SuppressionDurabilityIntegrationTest > shouldRecoverBufferAfterShutdown[0: eosEnabled=false] PASSED
org.apache.kafka.streams.integration.SuppressionDurabilityIntegrationTest > shouldRecoverBufferAfterShutdown[1: eosEnabled=true] STARTED
org.apache.kafka.streams.integration.SuppressionDurabilityIntegrationTest > shouldRecoverBufferAfterShutdown[1: eosEnabled=true] PASSED
org.apache.kafka.streams.integration.KTableSourceTopicRestartIntegrationTest > shouldRestoreAndProgressWhenTopicNotWrittenToDuringRestoration STARTED
org.apache.kafka.streams.integration.KTableSourceTopicRestartIntegrationTest > shouldRestoreAndProgressWhenTopicNotWrittenToDuringRestoration PASSED
org.apache.kafka.streams.integration.KTableSourceTopicRestartIntegrationTest > shouldRestoreAndProgressWhenTopicWrittenToDuringRestorationWithEosEnabled STARTED
org.apache.kafka.streams.integration.KTableSourceTopicRestartIntegrationTest > shouldRestoreAndProgressWhenTopicWrittenToDuringRestorationWithEosEnabled PASSED
org.apache.kafka.streams.integration.KTableSourceTopicRestartIntegrationTest > shouldRestoreAndProgressWhenTopicWrittenToDuringRestorationWithEosDisabled STARTED
org.apache.kafka.streams.integration.KTableSourceTopicRestartIntegrationTest > shouldRestoreAndProgressWhenTopicWrittenToDuringRestorationWithEosDisabled PASSED
org.apache.kafka.streams.integration.QueryableStateIntegrationTest > shouldBeAbleToQueryMapValuesState STARTED
org.apache.kafka.streams.integration.QueryableStateIntegrationTest > shouldBeAbleToQueryMapValuesState PASSED
org.apache.kafka.streams.integration.QueryableStateIntegrationTest > shouldNotMakeStoreAvailableUntilAllStoresAvailable STARTED
org.apache.kafka.streams.integration.QueryableStateIntegrationTest > shouldNotMakeStoreAvailableUntilAllStoresAvailable PASSED
org.apache.kafka.streams.integration.QueryableStateIntegrationTest > queryOnRebalance STARTED
org.apache.kafka.streams.integration.QueryableStateIntegrationTest > queryOnRebalance PASSED
org.apache.kafka.streams.integration.QueryableStateIntegrationTest > concurrentAccesses STARTED
FATAL: command execution failed
java.io.IOException
at hudson.remoting.Channel.close(Channel.java:1449)
at hudson.remoting.Channel.close(Channel.java:1405)
at hudson.slaves.SlaveComputer.closeChannel(SlaveComputer.java:847)
at hudson.slaves.SlaveComputer.kill(SlaveComputer.java:814)
at hudson.model.AbstractCIBase.killComputer(AbstractCIBase.java:89)
at jenkins.model.Jenkins.access$2100(Jenkins.java:312)
at jenkins.model.Jenkins$19.run(Jenkins.java:3464)
at hudson.model.Queue._withLock(Queue.java:1379)
at hudson.model.Queue.withLock(Queue.java:1256)
at jenkins.model.Jenkins._cleanUpDisconnectComputers(Jenkins.java:3458)
at jenkins.model.Jenkins.cleanUp(Jenkins.java:3336)
at hudson.WebAppMain.contextDestroyed(WebAppMain.java:379)
at org.apache.catalina.core.StandardContext.listenerStop(StandardContext.java:4732)
at org.apache.catalina.core.StandardContext.stopInternal(StandardContext.java:5396)
at org.apache.catalina.util.LifecycleBase.stop(LifecycleBase.java:257)
at org.apache.catalina.core.ContainerBase$StopChild.call(ContainerBase.java:1400)
at org.apache.catalina.core.ContainerBase$StopChild.call(ContainerBase.java:1389)
at java.util.concurrent.FutureTask.run(FutureTask.java:266)
at org.apache.tomcat.util.threads.InlineExecutorService.execute(InlineExecutorService.java:75)
at java.util.concurrent.AbstractExecutorService.submit(AbstractExecutorService.java:134)
at org.apache.catalina.core.ContainerBase.stopInternal(ContainerBase.java:976)
at org.apache.catalina.util.LifecycleBase.stop(LifecycleBase.java:257)
at org.apache.catalina.core.ContainerBase$StopChild.call(ContainerBase.java:1400)
at org.apache.catalina.core.ContainerBase$StopChild.call(ContainerBase.java:1389)
at java.util.concurrent.FutureTask.run(FutureTask.java:266)
at org.apache.tomcat.util.threads.InlineExecutorService.execute(InlineExecutorService.java:75)
at java.util.concurrent.AbstractExecutorService.submit(AbstractExecutorService.java:134)
at org.apache.catalina.core.ContainerBase.stopInternal(ContainerBase.java:976)
at org.apache.catalina.util.LifecycleBase.stop(LifecycleBase.java:257)
at org.apache.catalina.core.StandardService.stopInternal(StandardService.java:473)
at org.apache.catalina.util.LifecycleBase.stop(LifecycleBase.java:257)
at org.apache.catalina.core.StandardServer.stopInternal(StandardServer.java:994)
at org.apache.catalina.util.LifecycleBase.stop(LifecycleBase.java:257)
at org.apache.catalina.startup.Catalina.stop(Catalina.java:706)
at org.apache.catalina.startup.Catalina.start(Catalina.java:668)
at sun.reflect.NativeMethodAccessorImpl.invoke0(Native Method)
at sun.reflect.NativeMethodAccessorImpl.invoke(NativeMethodAccessorImpl.java:62)
at sun.reflect.DelegatingMethodAccessorImpl.invoke(DelegatingMethodAccessorImpl.java:43)
at java.lang.reflect.Method.invoke(Method.java:498)
at org.apache.catalina.startup.Bootstrap.start(Bootstrap.java:344)
at org.apache.catalina.startup.Bootstrap.main(Bootstrap.java:475)
Caused: hudson.remoting.ChannelClosedException: Channel "unknown": Remote call on H34 failed. The channel is closing down or has closed down
at hudson.remoting.Channel.call(Channel.java:950)
at hudson.remoting.RemoteInvocationHandler.invoke(RemoteInvocationHandler.java:283)
at com.sun.proxy.$Proxy144.isAlive(Unknown Source)
at hudson.Launcher$RemoteLauncher$ProcImpl.isAlive(Launcher.java:1150)
at hudson.Launcher$RemoteLauncher$ProcImpl.join(Launcher.java:1142)
at hudson.tasks.CommandInterpreter.join(CommandInterpreter.java:155)
at hudson.tasks.CommandInterpreter.perform(CommandInterpreter.java:109)
at hudson.tasks.CommandInterpreter.perform(CommandInterpreter.java:66)
at hudson.tasks.BuildStepMonitor$1.perform(BuildStepMonitor.java:20)
at hudson.model.AbstractBuild$AbstractBuildExecution.perform(AbstractBuild.java:741)
at hudson.model.Build$BuildExecution.build(Build.java:206)
at hudson.model.Build$BuildExecution.doRun(Build.java:163)
at hudson.model.AbstractBuild$AbstractBuildExecution.run(AbstractBuild.java:504)
at hudson.model.Run.execute(Run.java:1815)
at hudson.model.FreeStyleBuild.run(FreeStyleBuild.java:43)
at hudson.model.ResourceController.execute(ResourceController.java:97)
at hudson.model.Executor.run(Executor.java:429)
FATAL: Unable to delete script file /tmp/jenkins8482244175211546422.sh
java.io.IOException
at hudson.remoting.Channel.close(Channel.java:1449)
at hudson.remoting.Channel.close(Channel.java:1405)
at hudson.slaves.SlaveComputer.closeChannel(SlaveComputer.java:847)
at hudson.slaves.SlaveComputer.kill(SlaveComputer.java:814)
at hudson.model.AbstractCIBase.killComputer(AbstractCIBase.java:89)
at jenkins.model.Jenkins.access$2100(Jenkins.java:312)
at jenkins.model.Jenkins$19.run(Jenkins.java:3464)
at hudson.model.Queue._withLock(Queue.java:1379)
at hudson.model.Queue.withLock(Queue.java:1256)
at jenkins.model.Jenkins._cleanUpDisconnectComputers(Jenkins.java:3458)
at jenkins.model.Jenkins.cleanUp(Jenkins.java:3336)
at hudson.WebAppMain.contextDestroyed(WebAppMain.java:379)
at org.apache.catalina.core.StandardContext.listenerStop(StandardContext.java:4732)
at org.apache.catalina.core.StandardContext.stopInternal(StandardContext.java:5396)
at org.apache.catalina.util.LifecycleBase.stop(LifecycleBase.java:257)
at org.apache.catalina.core.ContainerBase$StopChild.call(ContainerBase.java:1400)
at org.apache.catalina.core.ContainerBase$StopChild.call(ContainerBase.java:1389)
at java.util.concurrent.FutureTask.run(FutureTask.java:266)
at org.apache.tomcat.util.threads.InlineExecutorService.execute(InlineExecutorService.java:75)
at java.util.concurrent.AbstractExecutorService.submit(AbstractExecutorService.java:134)
at org.apache.catalina.core.ContainerBase.stopInternal(ContainerBase.java:976)
at org.apache.catalina.util.LifecycleBase.stop(LifecycleBase.java:257)
at org.apache.catalina.core.ContainerBase$StopChild.call(ContainerBase.java:1400)
at org.apache.catalina.core.ContainerBase$StopChild.call(ContainerBase.java:1389)
at java.util.concurrent.FutureTask.run(FutureTask.java:266)
at org.apache.tomcat.util.threads.InlineExecutorService.execute(InlineExecutorService.java:75)
at java.util.concurrent.AbstractExecutorService.submit(AbstractExecutorService.java:134)
at org.apache.catalina.core.ContainerBase.stopInternal(ContainerBase.java:976)
at org.apache.catalina.util.LifecycleBase.stop(LifecycleBase.java:257)
at org.apache.catalina.core.StandardService.stopInternal(StandardService.java:473)
at org.apache.catalina.util.LifecycleBase.stop(LifecycleBase.java:257)
at org.apache.catalina.core.StandardServer.stopInternal(StandardServer.java:994)
at org.apache.catalina.util.LifecycleBase.stop(LifecycleBase.java:257)
at org.apache.catalina.startup.Catalina.stop(Catalina.java:706)
at org.apache.catalina.startup.Catalina.start(Catalina.java:668)
at sun.reflect.NativeMethodAccessorImpl.invoke0(Native Method)
at sun.reflect.NativeMethodAccessorImpl.invoke(NativeMethodAccessorImpl.java:62)
at sun.reflect.DelegatingMethodAccessorImpl.invoke(DelegatingMethodAccessorImpl.java:43)
at java.lang.reflect.Method.invoke(Method.java:498)
at org.apache.catalina.startup.Bootstrap.start(Bootstrap.java:344)
at org.apache.catalina.startup.Bootstrap.main(Bootstrap.java:475)
Caused: hudson.remoting.ChannelClosedException: Channel "unknown": Remote call on H34 failed. The channel is closing down or has closed down
at hudson.remoting.Channel.call(Channel.java:950)
at hudson.FilePath.act(FilePath.java:1072)
at hudson.FilePath.act(FilePath.java:1061)
at hudson.FilePath.delete(FilePath.java:1542)
at hudson.tasks.CommandInterpreter.perform(CommandInterpreter.java:123)
at hudson.tasks.CommandInterpreter.perform(CommandInterpreter.java:66)
at hudson.tasks.BuildStepMonitor$1.perform(BuildStepMonitor.java:20)
at hudson.model.AbstractBuild$AbstractBuildExecution.perform(AbstractBuild.java:741)
at hudson.model.Build$BuildExecution.build(Build.java:206)
at hudson.model.Build$BuildExecution.doRun(Build.java:163)
at hudson.model.AbstractBuild$AbstractBuildExecution.run(AbstractBuild.java:504)
at hudson.model.Run.execute(Run.java:1815)
at hudson.model.FreeStyleBuild.run(FreeStyleBuild.java:43)
at hudson.model.ResourceController.execute(ResourceController.java:97)
at hudson.model.Executor.run(Executor.java:429)
Build step 'Execute shell' marked build as failure
ERROR: Step ?[Deprecated] Publish FindBugs analysis results? failed: no workspace for kafka-2.3-jdk8 #112
ERROR: Step ?Publish JUnit test result report? failed: no workspace for kafka-2.3-jdk8 #112
ERROR: H34 is offline; cannot locate JDK 1.8 (latest)
ERROR: H34 is offline; cannot locate Gradle 4.10.3
Setting GRADLE_4_10_3_HOME=/home/jenkins/tools/gradle/4.10.3
Not sending mail to unregistered user ismael@juma.me.uk