You are viewing a plain text version of this content. The canonical link for it is here.
Posted to builds@beam.apache.org by Apache Jenkins Server <je...@builds.apache.org> on 2020/08/20 13:04:18 UTC
Build failed in Jenkins: beam_LoadTests_Python_GBK_Dataflow_Batch
#446
See <https://ci-beam.apache.org/job/beam_LoadTests_Python_GBK_Dataflow_Batch/446/display/redirect?page=changes>
Changes:
[chamikaramj] Include coders embedded in CombinePayload when converting x-lang
[zyichi] Allow Nexmark launcher to publish human-readable events to pubsub.
[douglas.damon] Add Filter lesson to Go SDK katas
[douglas.damon] Reformat code for readability
[yoshiki.obata] [BEAM-9980] Configure Python versions for direct test suite tasks via
[irvi.fa] [BEAM-10753] Add Slack link invitation on README
[Luke Cwik] [BEAM-10756] Fix empty pull response to not ack and to not throw
[noreply] Merge pull request #12597: [BEAM-10685] Added integration test for
[ettarapp] clarifying unclear comments
[noreply] Update README.md
[noreply] [BEAM-3301] Adding SDF Go Dataflow translation. (#12629)
[kevinsijo] [BEAM-9919] Refining xlang types and wrappers
[noreply] [BEAM-10752] Use TestPubsubSignal in PubsubToBigqueryIT (#12625)
[douglas.damon] Change license info format in task-info.yaml
[douglas.damon] Update stepik course
[Luke Cwik] [BEAM-9979] Support a reset call that happens after the bundle is done
[noreply] [BEAM-10200] Add optional experiment to enable heap dump through the …
[kevinsijo] [BEAM-9919] xlang transforms wrapped with namespaces
[kevinsijo] [BEAM-9919] cleaning namespace.go
[kevinsijo] [BEAM-9920] Enabling artifact staging for xlang transforms
[kevinsijo] documentation(beam/sdks/go): added apache license and function docstring
[noreply] [BEAM-9547] Implement dataframes top, join, merge. (#12516)
[kevinsijo] fix(beam/sdks/go): correcting changed function name
[noreply] Merge pull request #12581 from [BEAM-10378] Add Azure Blob Storage
------------------------------------------
[...truncated 26.16 KB...]
Collecting google-cloud-spanner<2,>=1.13.0
Using cached google_cloud_spanner-1.17.1-py2.py3-none-any.whl (250 kB)
Collecting grpcio-gcp<1,>=0.2.2
Using cached grpcio_gcp-0.2.2-py2.py3-none-any.whl (9.4 kB)
Collecting google-cloud-dlp<2,>=0.12.0
Using cached google_cloud_dlp-1.0.0-py2.py3-none-any.whl (169 kB)
Collecting google-cloud-language<2,>=1.3.0
Using cached google_cloud_language-1.3.0-py2.py3-none-any.whl (83 kB)
Collecting google-cloud-videointelligence<2,>=1.8.0
Using cached google_cloud_videointelligence-1.15.0-py2.py3-none-any.whl (180 kB)
Collecting google-cloud-vision<2,>=0.38.0
Using cached google_cloud_vision-1.0.0-py2.py3-none-any.whl (435 kB)
Collecting freezegun>=0.3.12
Using cached freezegun-0.3.15-py2.py3-none-any.whl (14 kB)
Collecting nose>=1.3.7
Using cached nose-1.3.7-py3-none-any.whl (154 kB)
Processing /home/jenkins/.cache/pip/wheels/2e/29/a9/431158315f33abeaad2905460f5ffb18fc30f7ed7c66c47dee/nose_xunitmp-0.4.1-py3-none-any.whl
Collecting parameterized<0.8.0,>=0.7.1
Using cached parameterized-0.7.4-py2.py3-none-any.whl (25 kB)
Collecting pyhamcrest!=1.10.0,<2.0.0,>=1.9
Using cached PyHamcrest-1.10.1-py3-none-any.whl (48 kB)
Processing /home/jenkins/.cache/pip/wheels/5e/03/1e/e1e954795d6f35dfc7b637fe2277bff021303bd9570ecea653/PyYAML-5.3.1-cp37-cp37m-linux_x86_64.whl
Collecting requests_mock<2.0,>=1.7
Using cached requests_mock-1.8.0-py2.py3-none-any.whl (23 kB)
Collecting tenacity<6.0,>=5.0.2
Using cached tenacity-5.1.5-py2.py3-none-any.whl (34 kB)
Collecting pytest<5.0,>=4.4.0
Using cached pytest-4.6.11-py2.py3-none-any.whl (231 kB)
Collecting pytest-xdist<2,>=1.29.0
Using cached pytest_xdist-1.34.0-py2.py3-none-any.whl (36 kB)
Collecting pytest-timeout<2,>=1.3.3
Using cached pytest_timeout-1.4.2-py2.py3-none-any.whl (10 kB)
Collecting pandas<1,>=0.25.2
Using cached pandas-0.25.3-cp37-cp37m-manylinux1_x86_64.whl (10.4 MB)
Collecting sqlalchemy<2.0,>=1.3
Using cached SQLAlchemy-1.3.19-cp37-cp37m-manylinux2010_x86_64.whl (1.3 MB)
Collecting psycopg2-binary<3.0.0,>=2.8.5
Using cached psycopg2_binary-2.8.5-cp37-cp37m-manylinux1_x86_64.whl (2.9 MB)
Processing /home/jenkins/.cache/pip/wheels/22/11/6e/126cbd2f544f9966ee22e074e5a3b7ab9b22bb2d4a6217e599/testcontainers-3.0.3-py2.py3-none-any.whl
Requirement already satisfied: six>=1.5.2 in <https://ci-beam.apache.org/job/beam_LoadTests_Python_GBK_Dataflow_Batch/ws/src/build/gradleenv/1329484227/lib/python3.7/site-packages> (from grpcio<2,>=1.29.0->apache-beam==2.25.0.dev0) (1.15.0)
Processing /home/jenkins/.cache/pip/wheels/9b/04/dd/7daf4150b6d9b12949298737de9431a324d4b797ffd63f526e/docopt-0.6.2-py2.py3-none-any.whl
Collecting pbr>=0.11
Using cached pbr-5.4.5-py2.py3-none-any.whl (110 kB)
Collecting pyasn1>=0.1.7
Using cached pyasn1-0.4.8-py2.py3-none-any.whl (77 kB)
Collecting pyasn1-modules>=0.0.5
Using cached pyasn1_modules-0.2.8-py2.py3-none-any.whl (155 kB)
Collecting rsa>=3.1.4
Using cached rsa-4.6-py3-none-any.whl (47 kB)
Requirement already satisfied: setuptools in <https://ci-beam.apache.org/job/beam_LoadTests_Python_GBK_Dataflow_Batch/ws/src/build/gradleenv/1329484227/lib/python3.7/site-packages> (from protobuf<4,>=3.12.2->apache-beam==2.25.0.dev0) (49.6.0)
Collecting pyparsing>=2.1.4
Using cached pyparsing-2.4.7-py2.py3-none-any.whl (67 kB)
Collecting idna<3,>=2.5
Using cached idna-2.10-py2.py3-none-any.whl (58 kB)
Collecting urllib3!=1.25.0,!=1.25.1,<1.26,>=1.21.1
Using cached urllib3-1.25.10-py2.py3-none-any.whl (127 kB)
Collecting certifi>=2017.4.17
Using cached certifi-2020.6.20-py2.py3-none-any.whl (156 kB)
Collecting chardet<4,>=3.0.2
Using cached chardet-3.0.4-py2.py3-none-any.whl (133 kB)
Collecting s3transfer<0.4.0,>=0.3.0
Using cached s3transfer-0.3.3-py2.py3-none-any.whl (69 kB)
Collecting botocore<1.18.0,>=1.17.46
Using cached botocore-1.17.46-py2.py3-none-any.whl (6.5 MB)
Collecting jmespath<1.0.0,>=0.7.1
Using cached jmespath-0.10.0-py2.py3-none-any.whl (24 kB)
Collecting fasteners>=0.14
Using cached fasteners-0.15-py2.py3-none-any.whl (23 kB)
Collecting google-api-core[grpc]<2.0.0dev,>=1.14.0
Using cached google_api_core-1.22.1-py2.py3-none-any.whl (91 kB)
Processing /home/jenkins/.cache/pip/wheels/b9/ee/67/2e444183030cb8d31ce8b34cee34a7afdbd3ba5959ea846380/grpc_google_iam_v1-0.12.3-py3-none-any.whl
Collecting google-resumable-media<2.0dev,>=0.5.0
Using cached google_resumable_media-0.7.1-py2.py3-none-any.whl (42 kB)
Requirement already satisfied: importlib-metadata>=0.12; python_version < "3.8" in <https://ci-beam.apache.org/job/beam_LoadTests_Python_GBK_Dataflow_Batch/ws/src/build/gradleenv/1329484227/lib/python3.7/site-packages> (from pytest<5.0,>=4.4.0->apache-beam==2.25.0.dev0) (1.7.0)
Collecting packaging
Using cached packaging-20.4-py2.py3-none-any.whl (37 kB)
Collecting more-itertools>=4.0.0; python_version > "2.7"
Using cached more_itertools-8.4.0-py3-none-any.whl (43 kB)
Requirement already satisfied: pluggy<1.0,>=0.12 in <https://ci-beam.apache.org/job/beam_LoadTests_Python_GBK_Dataflow_Batch/ws/src/build/gradleenv/1329484227/lib/python3.7/site-packages> (from pytest<5.0,>=4.4.0->apache-beam==2.25.0.dev0) (0.13.1)
Requirement already satisfied: py>=1.5.0 in <https://ci-beam.apache.org/job/beam_LoadTests_Python_GBK_Dataflow_Batch/ws/src/build/gradleenv/1329484227/lib/python3.7/site-packages> (from pytest<5.0,>=4.4.0->apache-beam==2.25.0.dev0) (1.9.0)
Collecting wcwidth
Using cached wcwidth-0.2.5-py2.py3-none-any.whl (30 kB)
Collecting attrs>=17.4.0
Using cached attrs-19.3.0-py2.py3-none-any.whl (39 kB)
Collecting atomicwrites>=1.0
Using cached atomicwrites-1.4.0-py2.py3-none-any.whl (6.8 kB)
Collecting execnet>=1.1
Using cached execnet-1.7.1-py2.py3-none-any.whl (39 kB)
Collecting pytest-forked
Using cached pytest_forked-1.3.0-py2.py3-none-any.whl (4.7 kB)
Collecting deprecation
Using cached deprecation-2.1.0-py2.py3-none-any.whl (11 kB)
Collecting crayons
Using cached crayons-0.3.1-py2.py3-none-any.whl (4.6 kB)
Processing /home/jenkins/.cache/pip/wheels/62/76/4c/aa25851149f3f6d9785f6c869387ad82b3fd37582fa8147ac6/wrapt-1.12.1-cp37-cp37m-linux_x86_64.whl
Collecting docker
Using cached docker-4.3.0-py2.py3-none-any.whl (145 kB)
Processing /home/jenkins/.cache/pip/wheels/4e/29/41/2a34b96f3d4bf9ab8ccaac5d86db4334fa17d79e7027a5b86f/blindspin-2.0.1-py3-none-any.whl
Collecting docutils<0.16,>=0.10
Using cached docutils-0.15.2-py3-none-any.whl (547 kB)
Collecting monotonic>=0.1
Using cached monotonic-1.5-py2.py3-none-any.whl (5.3 kB)
Collecting googleapis-common-protos<2.0dev,>=1.6.0
Using cached googleapis_common_protos-1.52.0-py2.py3-none-any.whl (100 kB)
Collecting google-crc32c<0.2dev,>=0.1.0; python_version >= "3.5"
Using cached google_crc32c-0.1.0-cp37-cp37m-manylinux2010_x86_64.whl (39 kB)
Requirement already satisfied: zipp>=0.5 in <https://ci-beam.apache.org/job/beam_LoadTests_Python_GBK_Dataflow_Batch/ws/src/build/gradleenv/1329484227/lib/python3.7/site-packages> (from importlib-metadata>=0.12; python_version < "3.8"->pytest<5.0,>=4.4.0->apache-beam==2.25.0.dev0) (3.1.0)
Collecting apipkg>=1.4
Using cached apipkg-1.5-py2.py3-none-any.whl (4.9 kB)
Collecting colorama
Using cached colorama-0.4.3-py2.py3-none-any.whl (15 kB)
Collecting websocket-client>=0.32.0
Using cached websocket_client-0.57.0-py2.py3-none-any.whl (200 kB)
Collecting cffi>=1.0.0
Using cached cffi-1.14.2-cp37-cp37m-manylinux1_x86_64.whl (401 kB)
Collecting pycparser
Using cached pycparser-2.20-py2.py3-none-any.whl (112 kB)
Building wheels for collected packages: apache-beam
Building wheel for apache-beam (setup.py): started
Building wheel for apache-beam (setup.py): finished with status 'done'
Created wheel for apache-beam: filename=apache_beam-2.25.0.dev0-py3-none-any.whl size=2174879 sha256=b29ea6e78a746d816c8634ef471b4a25856dd53c6f4c11377f764837854b9229
Stored in directory: /home/jenkins/.cache/pip/wheels/77/c3/45/f8c936a7742001e3bc0d0f63813dd268a96c932cc292dc2aae
Successfully built apache-beam
Installing collected packages: crcmod, dill, pytz, fastavro, idna, urllib3, certifi, chardet, requests, docopt, hdfs, httplib2, pbr, mock, numpy, pymongo, pyasn1, pyasn1-modules, rsa, oauth2client, pyparsing, pydot, python-dateutil, typing-extensions, avro-python3, pyarrow, docutils, jmespath, botocore, s3transfer, boto3, cachetools, monotonic, fasteners, google-apitools, google-auth, googleapis-common-protos, google-api-core, google-cloud-core, google-cloud-datastore, grpc-google-iam-v1, google-cloud-pubsub, pycparser, cffi, google-crc32c, google-resumable-media, google-cloud-bigquery, google-cloud-bigtable, google-cloud-spanner, grpcio-gcp, google-cloud-dlp, google-cloud-language, google-cloud-videointelligence, google-cloud-vision, freezegun, nose, nose-xunitmp, parameterized, pyhamcrest, pyyaml, requests-mock, tenacity, packaging, more-itertools, wcwidth, attrs, atomicwrites, pytest, apipkg, execnet, pytest-forked, pytest-xdist, pytest-timeout, pandas, sqlalchemy, psycopg2-binary, deprecation, colorama, crayons, wrapt, websocket-client, docker, blindspin, testcontainers, apache-beam
Successfully installed apache-beam-2.25.0.dev0 apipkg-1.5 atomicwrites-1.4.0 attrs-19.3.0 avro-python3-1.9.2.1 blindspin-2.0.1 boto3-1.14.46 botocore-1.17.46 cachetools-3.1.1 certifi-2020.6.20 cffi-1.14.2 chardet-3.0.4 colorama-0.4.3 crayons-0.3.1 crcmod-1.7 deprecation-2.1.0 dill-0.3.1.1 docker-4.3.0 docopt-0.6.2 docutils-0.15.2 execnet-1.7.1 fastavro-0.23.6 fasteners-0.15 freezegun-0.3.15 google-api-core-1.22.1 google-apitools-0.5.31 google-auth-1.20.1 google-cloud-bigquery-1.27.2 google-cloud-bigtable-1.4.0 google-cloud-core-1.4.1 google-cloud-datastore-1.15.0 google-cloud-dlp-1.0.0 google-cloud-language-1.3.0 google-cloud-pubsub-1.7.0 google-cloud-spanner-1.17.1 google-cloud-videointelligence-1.15.0 google-cloud-vision-1.0.0 google-crc32c-0.1.0 google-resumable-media-0.7.1 googleapis-common-protos-1.52.0 grpc-google-iam-v1-0.12.3 grpcio-gcp-0.2.2 hdfs-2.5.8 httplib2-0.17.4 idna-2.10 jmespath-0.10.0 mock-2.0.0 monotonic-1.5 more-itertools-8.4.0 nose-1.3.7 nose-xunitmp-0.4.1 numpy-1.19.1 oauth2client-3.0.0 packaging-20.4 pandas-0.25.3 parameterized-0.7.4 pbr-5.4.5 psycopg2-binary-2.8.5 pyarrow-0.17.1 pyasn1-0.4.8 pyasn1-modules-0.2.8 pycparser-2.20 pydot-1.4.1 pyhamcrest-1.10.1 pymongo-3.11.0 pyparsing-2.4.7 pytest-4.6.11 pytest-forked-1.3.0 pytest-timeout-1.4.2 pytest-xdist-1.34.0 python-dateutil-2.8.1 pytz-2020.1 pyyaml-5.3.1 requests-2.24.0 requests-mock-1.8.0 rsa-4.6 s3transfer-0.3.3 sqlalchemy-1.3.19 tenacity-5.1.5 testcontainers-3.0.3 typing-extensions-3.7.4.2 urllib3-1.25.10 wcwidth-0.2.5 websocket-client-0.57.0 wrapt-1.12.1
> Task :sdks:python:apache_beam:testing:load_tests:run
INFO:apache_beam.runners.portability.stager:Copying Beam SDK "<https://ci-beam.apache.org/job/beam_LoadTests_Python_GBK_Dataflow_Batch/ws/src/sdks/python/build/apache-beam.tar.gz"> to staging location.
WARNING:root:Make sure that locally built Python SDK docker image has Python 3.7 interpreter.
INFO:root:Using Python SDK docker image: apache/beam_python3.7_sdk:2.25.0.dev. If the image is not available at local, we will try to pull from hub.docker.com
INFO:apache_beam.runners.dataflow.internal.apiclient:Defaulting to the temp_location as staging_location: gs://temp-storage-for-perf-tests/loadtests
INFO:apache_beam.internal.gcp.auth:Setting socket default timeout to 60 seconds.
INFO:apache_beam.internal.gcp.auth:socket default timeout is 60.0 seconds.
INFO:apache_beam.runners.dataflow.internal.apiclient:Starting GCS upload to gs://temp-storage-for-perf-tests/loadtests/load-tests-python-dataflow-batch-gbk-1-0820101528.1597926341.954742/pipeline.pb...
INFO:oauth2client.transport:Attempting refresh to obtain initial access_token
INFO:oauth2client.transport:Attempting refresh to obtain initial access_token
INFO:apache_beam.runners.dataflow.internal.apiclient:Completed GCS upload to gs://temp-storage-for-perf-tests/loadtests/load-tests-python-dataflow-batch-gbk-1-0820101528.1597926341.954742/pipeline.pb in 0 seconds.
INFO:apache_beam.runners.dataflow.internal.apiclient:Starting GCS upload to gs://temp-storage-for-perf-tests/loadtests/load-tests-python-dataflow-batch-gbk-1-0820101528.1597926341.954742/dataflow_python_sdk.tar...
INFO:apache_beam.runners.dataflow.internal.apiclient:Completed GCS upload to gs://temp-storage-for-perf-tests/loadtests/load-tests-python-dataflow-batch-gbk-1-0820101528.1597926341.954742/dataflow_python_sdk.tar in 0 seconds.
WARNING:apache_beam.options.pipeline_options:Discarding unparseable args: ['--iterations=1', '--fanout=1']
WARNING:apache_beam.options.pipeline_options:Discarding unparseable args: ['--iterations=1', '--fanout=1']
INFO:apache_beam.runners.dataflow.internal.apiclient:Create job: <Job
createTime: '2020-08-20T12:25:43.626256Z'
currentStateTime: '1970-01-01T00:00:00Z'
id: '2020-08-20_05_25_42-4165643015429889841'
location: 'us-central1'
name: 'load-tests-python-dataflow-batch-gbk-1-0820101528'
projectId: 'apache-beam-testing'
stageStates: []
startTime: '2020-08-20T12:25:43.626256Z'
steps: []
tempFiles: []
type: TypeValueValuesEnum(JOB_TYPE_BATCH, 1)>
INFO:apache_beam.runners.dataflow.internal.apiclient:Created job with id: [2020-08-20_05_25_42-4165643015429889841]
INFO:apache_beam.runners.dataflow.internal.apiclient:Submitted job: 2020-08-20_05_25_42-4165643015429889841
INFO:apache_beam.runners.dataflow.internal.apiclient:To access the Dataflow monitoring console, please navigate to https://console.cloud.google.com/dataflow/jobs/us-central1/2020-08-20_05_25_42-4165643015429889841?project=apache-beam-testing
INFO:apache_beam.runners.dataflow.dataflow_runner:Job 2020-08-20_05_25_42-4165643015429889841 is in state JOB_STATE_PENDING
INFO:apache_beam.runners.dataflow.dataflow_runner:2020-08-20T12:25:51.874Z: JOB_MESSAGE_BASIC: Worker configuration: n1-standard-1 in us-central1-f.
INFO:apache_beam.runners.dataflow.dataflow_runner:2020-08-20T12:25:52.547Z: JOB_MESSAGE_DETAILED: Expanding CoGroupByKey operations into optimizable parts.
INFO:apache_beam.runners.dataflow.dataflow_runner:2020-08-20T12:25:52.715Z: JOB_MESSAGE_DEBUG: Combiner lifting skipped for step GroupByKey 0: GroupByKey not followed by a combiner.
INFO:apache_beam.runners.dataflow.dataflow_runner:2020-08-20T12:25:52.776Z: JOB_MESSAGE_DETAILED: Expanding GroupByKey operations into optimizable parts.
INFO:apache_beam.runners.dataflow.dataflow_runner:2020-08-20T12:25:52.825Z: JOB_MESSAGE_DETAILED: Lifting ValueCombiningMappingFns into MergeBucketsMappingFns
INFO:apache_beam.runners.dataflow.dataflow_runner:2020-08-20T12:25:52.909Z: JOB_MESSAGE_DEBUG: Annotating graph with Autotuner information.
INFO:apache_beam.runners.dataflow.dataflow_runner:2020-08-20T12:25:52.973Z: JOB_MESSAGE_DETAILED: Fusing adjacent ParDo, Read, Write, and Flatten operations
INFO:apache_beam.runners.dataflow.dataflow_runner:2020-08-20T12:25:53.026Z: JOB_MESSAGE_DETAILED: Fusing consumer Measure time: Start into Read
INFO:apache_beam.runners.dataflow.dataflow_runner:2020-08-20T12:25:53.088Z: JOB_MESSAGE_DETAILED: Fusing consumer Assign timestamps into Measure time: Start
INFO:apache_beam.runners.dataflow.dataflow_runner:2020-08-20T12:25:53.126Z: JOB_MESSAGE_DETAILED: Fusing consumer GroupByKey 0/Reify into Assign timestamps
INFO:apache_beam.runners.dataflow.dataflow_runner:2020-08-20T12:25:53.160Z: JOB_MESSAGE_DETAILED: Fusing consumer GroupByKey 0/Write into GroupByKey 0/Reify
INFO:apache_beam.runners.dataflow.dataflow_runner:2020-08-20T12:25:53.194Z: JOB_MESSAGE_DETAILED: Fusing consumer GroupByKey 0/GroupByWindow into GroupByKey 0/Read
INFO:apache_beam.runners.dataflow.dataflow_runner:2020-08-20T12:25:53.229Z: JOB_MESSAGE_DETAILED: Fusing consumer Ungroup 0 into GroupByKey 0/GroupByWindow
INFO:apache_beam.runners.dataflow.dataflow_runner:2020-08-20T12:25:53.277Z: JOB_MESSAGE_DETAILED: Fusing consumer Measure latency into Ungroup 0
INFO:apache_beam.runners.dataflow.dataflow_runner:2020-08-20T12:25:53.317Z: JOB_MESSAGE_DETAILED: Fusing consumer Measure time: End 0 into Measure latency
INFO:apache_beam.runners.dataflow.dataflow_runner:2020-08-20T12:25:53.366Z: JOB_MESSAGE_DEBUG: Workflow config is missing a default resource spec.
INFO:apache_beam.runners.dataflow.dataflow_runner:2020-08-20T12:25:53.788Z: JOB_MESSAGE_DEBUG: Adding StepResource setup and teardown to workflow graph.
INFO:apache_beam.runners.dataflow.dataflow_runner:2020-08-20T12:25:53.930Z: JOB_MESSAGE_DEBUG: Adding workflow start and stop steps.
INFO:apache_beam.runners.dataflow.dataflow_runner:2020-08-20T12:25:54.168Z: JOB_MESSAGE_DEBUG: Assigning stage ids.
INFO:apache_beam.runners.dataflow.dataflow_runner:2020-08-20T12:25:54.468Z: JOB_MESSAGE_DEBUG: Executing wait step start13
INFO:apache_beam.runners.dataflow.dataflow_runner:2020-08-20T12:25:54.536Z: JOB_MESSAGE_BASIC: Executing operation GroupByKey 0/Create
INFO:apache_beam.runners.dataflow.dataflow_runner:2020-08-20T12:25:54.591Z: JOB_MESSAGE_DEBUG: Starting **** pool setup.
INFO:apache_beam.runners.dataflow.dataflow_runner:2020-08-20T12:25:54.622Z: JOB_MESSAGE_BASIC: Starting 5 ****s in us-central1-f...
INFO:apache_beam.runners.dataflow.dataflow_runner:2020-08-20T12:25:54.685Z: JOB_MESSAGE_BASIC: Finished operation GroupByKey 0/Create
INFO:apache_beam.runners.dataflow.dataflow_runner:2020-08-20T12:25:54.776Z: JOB_MESSAGE_DEBUG: Value "GroupByKey 0/Session" materialized.
INFO:apache_beam.runners.dataflow.dataflow_runner:2020-08-20T12:25:54.850Z: JOB_MESSAGE_BASIC: Executing operation Read+Measure time: Start+Assign timestamps+GroupByKey 0/Reify+GroupByKey 0/Write
INFO:apache_beam.runners.dataflow.dataflow_runner:Job 2020-08-20_05_25_42-4165643015429889841 is in state JOB_STATE_RUNNING
INFO:apache_beam.runners.dataflow.dataflow_runner:2020-08-20T12:26:18.333Z: JOB_MESSAGE_WARNING: Your project already contains 100 Dataflow-created metric descriptors and Stackdriver will not create new Dataflow custom metrics for this job. Each unique user-defined metric name (independent of the DoFn in which it is defined) produces a new metric descriptor. To delete old / unused metric descriptors see https://developers.google.com/apis-explorer/#p/monitoring/v3/monitoring.projects.metricDescriptors.list and https://developers.google.com/apis-explorer/#p/monitoring/v3/monitoring.projects.metricDescriptors.delete
INFO:apache_beam.runners.dataflow.dataflow_runner:2020-08-20T12:26:20.324Z: JOB_MESSAGE_DETAILED: Autoscaling: Raised the number of ****s to 5 based on the rate of progress in the currently running stage(s).
INFO:apache_beam.runners.dataflow.dataflow_runner:2020-08-20T12:27:56.882Z: JOB_MESSAGE_DETAILED: Workers have started successfully.
INFO:apache_beam.runners.dataflow.dataflow_runner:2020-08-20T12:27:56.933Z: JOB_MESSAGE_DETAILED: Workers have started successfully.
INFO:apache_beam.runners.dataflow.dataflow_runner:2020-08-20T12:58:40.295Z: JOB_MESSAGE_BASIC: Finished operation Read+Measure time: Start+Assign timestamps+GroupByKey 0/Reify+GroupByKey 0/Write
INFO:apache_beam.runners.dataflow.dataflow_runner:2020-08-20T12:58:40.660Z: JOB_MESSAGE_BASIC: Executing operation GroupByKey 0/Close
INFO:apache_beam.runners.dataflow.dataflow_runner:2020-08-20T12:58:40.947Z: JOB_MESSAGE_BASIC: Finished operation GroupByKey 0/Close
INFO:apache_beam.runners.dataflow.dataflow_runner:2020-08-20T12:58:41.239Z: JOB_MESSAGE_BASIC: Executing operation GroupByKey 0/Read+GroupByKey 0/GroupByWindow+Ungroup 0+Measure latency+Measure time: End 0
INFO:apache_beam.runners.dataflow.dataflow_runner:2020-08-20T13:03:07.533Z: JOB_MESSAGE_BASIC: Finished operation GroupByKey 0/Read+GroupByKey 0/GroupByWindow+Ungroup 0+Measure latency+Measure time: End 0
INFO:apache_beam.runners.dataflow.dataflow_runner:2020-08-20T13:03:07.695Z: JOB_MESSAGE_DEBUG: Executing success step success11
INFO:apache_beam.runners.dataflow.dataflow_runner:2020-08-20T13:03:07.817Z: JOB_MESSAGE_DETAILED: Cleaning up.
INFO:apache_beam.runners.dataflow.dataflow_runner:2020-08-20T13:03:07.899Z: JOB_MESSAGE_DEBUG: Starting **** pool teardown.
INFO:apache_beam.runners.dataflow.dataflow_runner:2020-08-20T13:03:07.969Z: JOB_MESSAGE_BASIC: Stopping **** pool...
INFO:apache_beam.runners.dataflow.dataflow_runner:2020-08-20T13:04:01.052Z: JOB_MESSAGE_DETAILED: Autoscaling: Resized **** pool from 5 to 0.
INFO:apache_beam.runners.dataflow.dataflow_runner:2020-08-20T13:04:01.104Z: JOB_MESSAGE_BASIC: Worker pool stopped.
INFO:apache_beam.runners.dataflow.dataflow_runner:2020-08-20T13:04:01.143Z: JOB_MESSAGE_DEBUG: Tearing down pending resources...
INFO:apache_beam.runners.dataflow.dataflow_runner:Job 2020-08-20_05_25_42-4165643015429889841 is in state JOB_STATE_DONE
INFO:apache_beam.testing.load_tests.load_test_metrics_utils:Load test results for test: 025d1983097440e886613ae88ad8c540 and timestamp: 1597928655.8329215:
INFO:apache_beam.testing.load_tests.load_test_metrics_utils:Metric: python_dataflow_batch_gbk_1_runtime Value: 1914
INFO:apache_beam.testing.load_tests.load_test_metrics_utils:Metric: python_dataflow_batch_gbk_1_measure_latency_count_latency Value: 512
INFO:apache_beam.testing.load_tests.load_test_metrics_utils:Metric: python_dataflow_batch_gbk_1_measure_latency_max_latency Value: 9224969965437156
INFO:apache_beam.testing.load_tests.load_test_metrics_utils:Metric: python_dataflow_batch_gbk_1_measure_latency_min_latency Value: 9224969965176352
Traceback (most recent call last):
File "/usr/lib/python3.7/runpy.py", line 193, in _run_module_as_main
"__main__", mod_spec)
File "/usr/lib/python3.7/runpy.py", line 85, in _run_code
exec(code, run_globals)
File "<https://ci-beam.apache.org/job/beam_LoadTests_Python_GBK_Dataflow_Batch/ws/src/sdks/python/apache_beam/testing/load_tests/group_by_key_test.py",> line 120, in <module>
GroupByKeyTest().run()
File "<https://ci-beam.apache.org/job/beam_LoadTests_Python_GBK_Dataflow_Batch/ws/src/sdks/python/apache_beam/testing/load_tests/load_test.py",> line 153, in run
self._metrics_monitor.publish_metrics(self.result)
File "<https://ci-beam.apache.org/job/beam_LoadTests_Python_GBK_Dataflow_Batch/ws/src/sdks/python/apache_beam/testing/load_tests/load_test_metrics_utils.py",> line 227, in publish_metrics
publisher.publish(insert_dicts)
File "<https://ci-beam.apache.org/job/beam_LoadTests_Python_GBK_Dataflow_Batch/ws/src/sdks/python/apache_beam/testing/load_tests/load_test_metrics_utils.py",> line 375, in publish
% (result[METRICS_TYPE_LABEL], result[VALUE_LABEL])
TypeError: %d format: a number is required, not NoneType
> Task :sdks:python:apache_beam:testing:load_tests:run FAILED
FAILURE: Build failed with an exception.
* Where:
Build file '<https://ci-beam.apache.org/job/beam_LoadTests_Python_GBK_Dataflow_Batch/ws/src/sdks/python/apache_beam/testing/load_tests/build.gradle'> line: 58
* What went wrong:
Execution failed for task ':sdks:python:apache_beam:testing:load_tests:run'.
> error occurred
* Try:
Run with --stacktrace option to get the stack trace. Run with --info or --debug option to get more log output. Run with --scan to get full insights.
* Get more help at https://help.gradle.org
Deprecated Gradle features were used in this build, making it incompatible with Gradle 6.0.
Use '--warning-mode all' to show the individual deprecation warnings.
See https://docs.gradle.org/5.2.1/userguide/command_line_interface.html#sec:command_line_warnings
BUILD FAILED in 39m 56s
5 actionable tasks: 5 executed
Publishing build scan...
https://gradle.com/s/5anqmiefdjdic
Build step 'Invoke Gradle script' changed build result to FAILURE
Build step 'Invoke Gradle script' marked build as failure
---------------------------------------------------------------------
To unsubscribe, e-mail: builds-unsubscribe@beam.apache.org
For additional commands, e-mail: builds-help@beam.apache.org
Jenkins build is back to normal :
beam_LoadTests_Python_GBK_Dataflow_Batch #452
Posted by Apache Jenkins Server <je...@builds.apache.org>.
See <https://ci-beam.apache.org/job/beam_LoadTests_Python_GBK_Dataflow_Batch/452/display/redirect?page=changes>
---------------------------------------------------------------------
To unsubscribe, e-mail: builds-unsubscribe@beam.apache.org
For additional commands, e-mail: builds-help@beam.apache.org
Build failed in Jenkins: beam_LoadTests_Python_GBK_Dataflow_Batch
#451
Posted by Apache Jenkins Server <je...@builds.apache.org>.
See <https://ci-beam.apache.org/job/beam_LoadTests_Python_GBK_Dataflow_Batch/451/display/redirect?page=changes>
Changes:
[Udi Meiri] Silence red PYTHONPATH warning from tox
[tobiasz.kedzierski] [BEAM-10682] Add workflow to run Java tests on Linux/Windows/Mac
[Robin Qiu] Propagate BigQuery streaming insert throttled time to Dataflow worker in
[Kamil Wasilewski] [BEAM-10524] JSON decoder for ReadFromBigQuery supports repeatable
[noreply] Merge pull request #12415 from [BEAM-10603] Add the RecordingManager and
[noreply] [BEAM-10777] Add two blog posts detailing changes to the type hints
------------------------------------------
[...truncated 26.52 KB...]
Collecting google-cloud-spanner<2,>=1.13.0
Using cached google_cloud_spanner-1.17.1-py2.py3-none-any.whl (250 kB)
Collecting grpcio-gcp<1,>=0.2.2
Using cached grpcio_gcp-0.2.2-py2.py3-none-any.whl (9.4 kB)
Collecting google-cloud-dlp<2,>=0.12.0
Using cached google_cloud_dlp-1.0.0-py2.py3-none-any.whl (169 kB)
Collecting google-cloud-language<2,>=1.3.0
Using cached google_cloud_language-1.3.0-py2.py3-none-any.whl (83 kB)
Collecting google-cloud-videointelligence<2,>=1.8.0
Using cached google_cloud_videointelligence-1.15.0-py2.py3-none-any.whl (180 kB)
Collecting google-cloud-vision<2,>=0.38.0
Using cached google_cloud_vision-1.0.0-py2.py3-none-any.whl (435 kB)
Collecting freezegun>=0.3.12
Using cached freezegun-0.3.15-py2.py3-none-any.whl (14 kB)
Collecting nose>=1.3.7
Using cached nose-1.3.7-py3-none-any.whl (154 kB)
Processing /home/jenkins/.cache/pip/wheels/2e/29/a9/431158315f33abeaad2905460f5ffb18fc30f7ed7c66c47dee/nose_xunitmp-0.4.1-py3-none-any.whl
Collecting parameterized<0.8.0,>=0.7.1
Using cached parameterized-0.7.4-py2.py3-none-any.whl (25 kB)
Collecting pyhamcrest!=1.10.0,<2.0.0,>=1.9
Using cached PyHamcrest-1.10.1-py3-none-any.whl (48 kB)
Processing /home/jenkins/.cache/pip/wheels/5e/03/1e/e1e954795d6f35dfc7b637fe2277bff021303bd9570ecea653/PyYAML-5.3.1-cp37-cp37m-linux_x86_64.whl
Collecting requests_mock<2.0,>=1.7
Using cached requests_mock-1.8.0-py2.py3-none-any.whl (23 kB)
Collecting tenacity<6.0,>=5.0.2
Using cached tenacity-5.1.5-py2.py3-none-any.whl (34 kB)
Collecting pytest<5.0,>=4.4.0
Using cached pytest-4.6.11-py2.py3-none-any.whl (231 kB)
Collecting pytest-xdist<2,>=1.29.0
Using cached pytest_xdist-1.34.0-py2.py3-none-any.whl (36 kB)
Collecting pytest-timeout<2,>=1.3.3
Using cached pytest_timeout-1.4.2-py2.py3-none-any.whl (10 kB)
Collecting pandas<1,>=0.25.2
Using cached pandas-0.25.3-cp37-cp37m-manylinux1_x86_64.whl (10.4 MB)
Collecting sqlalchemy<2.0,>=1.3
Using cached SQLAlchemy-1.3.19-cp37-cp37m-manylinux2010_x86_64.whl (1.3 MB)
Collecting psycopg2-binary<3.0.0,>=2.8.5
Using cached psycopg2_binary-2.8.5-cp37-cp37m-manylinux1_x86_64.whl (2.9 MB)
Processing /home/jenkins/.cache/pip/wheels/22/11/6e/126cbd2f544f9966ee22e074e5a3b7ab9b22bb2d4a6217e599/testcontainers-3.0.3-py2.py3-none-any.whl
Requirement already satisfied: six>=1.5.2 in <https://ci-beam.apache.org/job/beam_LoadTests_Python_GBK_Dataflow_Batch/ws/src/build/gradleenv/1329484227/lib/python3.7/site-packages> (from grpcio<2,>=1.29.0->apache-beam==2.25.0.dev0) (1.15.0)
Processing /home/jenkins/.cache/pip/wheels/9b/04/dd/7daf4150b6d9b12949298737de9431a324d4b797ffd63f526e/docopt-0.6.2-py2.py3-none-any.whl
Collecting pbr>=0.11
Using cached pbr-5.4.5-py2.py3-none-any.whl (110 kB)
Collecting rsa>=3.1.4
Using cached rsa-4.6-py3-none-any.whl (47 kB)
Collecting pyasn1-modules>=0.0.5
Using cached pyasn1_modules-0.2.8-py2.py3-none-any.whl (155 kB)
Collecting pyasn1>=0.1.7
Using cached pyasn1-0.4.8-py2.py3-none-any.whl (77 kB)
Requirement already satisfied: setuptools in <https://ci-beam.apache.org/job/beam_LoadTests_Python_GBK_Dataflow_Batch/ws/src/build/gradleenv/1329484227/lib/python3.7/site-packages> (from protobuf<4,>=3.12.2->apache-beam==2.25.0.dev0) (49.6.0)
Collecting pyparsing>=2.1.4
Using cached pyparsing-2.4.7-py2.py3-none-any.whl (67 kB)
Collecting certifi>=2017.4.17
Using cached certifi-2020.6.20-py2.py3-none-any.whl (156 kB)
Collecting chardet<4,>=3.0.2
Using cached chardet-3.0.4-py2.py3-none-any.whl (133 kB)
Collecting urllib3!=1.25.0,!=1.25.1,<1.26,>=1.21.1
Using cached urllib3-1.25.10-py2.py3-none-any.whl (127 kB)
Collecting idna<3,>=2.5
Using cached idna-2.10-py2.py3-none-any.whl (58 kB)
Collecting s3transfer<0.4.0,>=0.3.0
Using cached s3transfer-0.3.3-py2.py3-none-any.whl (69 kB)
Collecting botocore<1.18.0,>=1.17.48
Using cached botocore-1.17.48-py2.py3-none-any.whl (6.5 MB)
Collecting jmespath<1.0.0,>=0.7.1
Using cached jmespath-0.10.0-py2.py3-none-any.whl (24 kB)
Collecting fasteners>=0.14
Using cached fasteners-0.15-py2.py3-none-any.whl (23 kB)
Collecting google-api-core[grpc]<2.0.0dev,>=1.14.0
Using cached google_api_core-1.22.1-py2.py3-none-any.whl (91 kB)
Processing /home/jenkins/.cache/pip/wheels/b9/ee/67/2e444183030cb8d31ce8b34cee34a7afdbd3ba5959ea846380/grpc_google_iam_v1-0.12.3-py3-none-any.whl
Collecting google-resumable-media<2.0dev,>=0.5.0
Using cached google_resumable_media-0.7.1-py2.py3-none-any.whl (42 kB)
Collecting atomicwrites>=1.0
Using cached atomicwrites-1.4.0-py2.py3-none-any.whl (6.8 kB)
Requirement already satisfied: importlib-metadata>=0.12; python_version < "3.8" in <https://ci-beam.apache.org/job/beam_LoadTests_Python_GBK_Dataflow_Batch/ws/src/build/gradleenv/1329484227/lib/python3.7/site-packages> (from pytest<5.0,>=4.4.0->apache-beam==2.25.0.dev0) (1.7.0)
Requirement already satisfied: pluggy<1.0,>=0.12 in <https://ci-beam.apache.org/job/beam_LoadTests_Python_GBK_Dataflow_Batch/ws/src/build/gradleenv/1329484227/lib/python3.7/site-packages> (from pytest<5.0,>=4.4.0->apache-beam==2.25.0.dev0) (0.13.1)
Collecting more-itertools>=4.0.0; python_version > "2.7"
Using cached more_itertools-8.4.0-py3-none-any.whl (43 kB)
Collecting attrs>=17.4.0
Using cached attrs-20.1.0-py2.py3-none-any.whl (49 kB)
Collecting wcwidth
Using cached wcwidth-0.2.5-py2.py3-none-any.whl (30 kB)
Requirement already satisfied: py>=1.5.0 in <https://ci-beam.apache.org/job/beam_LoadTests_Python_GBK_Dataflow_Batch/ws/src/build/gradleenv/1329484227/lib/python3.7/site-packages> (from pytest<5.0,>=4.4.0->apache-beam==2.25.0.dev0) (1.9.0)
Collecting packaging
Using cached packaging-20.4-py2.py3-none-any.whl (37 kB)
Collecting pytest-forked
Using cached pytest_forked-1.3.0-py2.py3-none-any.whl (4.7 kB)
Collecting execnet>=1.1
Using cached execnet-1.7.1-py2.py3-none-any.whl (39 kB)
Collecting crayons
Using cached crayons-0.3.1-py2.py3-none-any.whl (4.6 kB)
Processing /home/jenkins/.cache/pip/wheels/4e/29/41/2a34b96f3d4bf9ab8ccaac5d86db4334fa17d79e7027a5b86f/blindspin-2.0.1-py3-none-any.whl
Collecting deprecation
Using cached deprecation-2.1.0-py2.py3-none-any.whl (11 kB)
Processing /home/jenkins/.cache/pip/wheels/62/76/4c/aa25851149f3f6d9785f6c869387ad82b3fd37582fa8147ac6/wrapt-1.12.1-cp37-cp37m-linux_x86_64.whl
Collecting docker
Using cached docker-4.3.1-py2.py3-none-any.whl (145 kB)
Collecting docutils<0.16,>=0.10
Using cached docutils-0.15.2-py3-none-any.whl (547 kB)
Collecting monotonic>=0.1
Using cached monotonic-1.5-py2.py3-none-any.whl (5.3 kB)
Collecting googleapis-common-protos<2.0dev,>=1.6.0
Using cached googleapis_common_protos-1.52.0-py2.py3-none-any.whl (100 kB)
Collecting google-crc32c<0.2dev,>=0.1.0; python_version >= "3.5"
Using cached google_crc32c-0.1.0-cp37-cp37m-manylinux2010_x86_64.whl (39 kB)
Requirement already satisfied: zipp>=0.5 in <https://ci-beam.apache.org/job/beam_LoadTests_Python_GBK_Dataflow_Batch/ws/src/build/gradleenv/1329484227/lib/python3.7/site-packages> (from importlib-metadata>=0.12; python_version < "3.8"->pytest<5.0,>=4.4.0->apache-beam==2.25.0.dev0) (3.1.0)
Collecting apipkg>=1.4
Using cached apipkg-1.5-py2.py3-none-any.whl (4.9 kB)
Collecting colorama
Using cached colorama-0.4.3-py2.py3-none-any.whl (15 kB)
Collecting websocket-client>=0.32.0
Using cached websocket_client-0.57.0-py2.py3-none-any.whl (200 kB)
Collecting cffi>=1.0.0
Using cached cffi-1.14.2-cp37-cp37m-manylinux1_x86_64.whl (401 kB)
Collecting pycparser
Using cached pycparser-2.20-py2.py3-none-any.whl (112 kB)
Building wheels for collected packages: apache-beam
Building wheel for apache-beam (setup.py): started
Building wheel for apache-beam (setup.py): finished with status 'done'
Created wheel for apache-beam: filename=apache_beam-2.25.0.dev0-py3-none-any.whl size=2204369 sha256=7e10c0f16a5eb0de20b9202c4327f732e0e829dde5ea5f8379d52c381a1f8f1b
Stored in directory: /home/jenkins/.cache/pip/wheels/77/c3/45/f8c936a7742001e3bc0d0f63813dd268a96c932cc292dc2aae
Successfully built apache-beam
Installing collected packages: crcmod, dill, pytz, fastavro, certifi, chardet, urllib3, idna, requests, docopt, hdfs, httplib2, pbr, mock, numpy, pymongo, pyasn1, rsa, pyasn1-modules, oauth2client, pyparsing, pydot, python-dateutil, typing-extensions, avro-python3, pyarrow, docutils, jmespath, botocore, s3transfer, boto3, cachetools, monotonic, fasteners, google-apitools, google-auth, googleapis-common-protos, google-api-core, google-cloud-core, google-cloud-datastore, grpc-google-iam-v1, google-cloud-pubsub, pycparser, cffi, google-crc32c, google-resumable-media, google-cloud-bigquery, google-cloud-bigtable, google-cloud-spanner, grpcio-gcp, google-cloud-dlp, google-cloud-language, google-cloud-videointelligence, google-cloud-vision, freezegun, nose, nose-xunitmp, parameterized, pyhamcrest, pyyaml, requests-mock, tenacity, atomicwrites, more-itertools, attrs, wcwidth, packaging, pytest, pytest-forked, apipkg, execnet, pytest-xdist, pytest-timeout, pandas, sqlalchemy, psycopg2-binary, colorama, crayons, blindspin, deprecation, wrapt, websocket-client, docker, testcontainers, apache-beam
Successfully installed apache-beam-2.25.0.dev0 apipkg-1.5 atomicwrites-1.4.0 attrs-20.1.0 avro-python3-1.9.2.1 blindspin-2.0.1 boto3-1.14.48 botocore-1.17.48 cachetools-3.1.1 certifi-2020.6.20 cffi-1.14.2 chardet-3.0.4 colorama-0.4.3 crayons-0.3.1 crcmod-1.7 deprecation-2.1.0 dill-0.3.1.1 docker-4.3.1 docopt-0.6.2 docutils-0.15.2 execnet-1.7.1 fastavro-0.23.6 fasteners-0.15 freezegun-0.3.15 google-api-core-1.22.1 google-apitools-0.5.31 google-auth-1.20.1 google-cloud-bigquery-1.27.2 google-cloud-bigtable-1.4.0 google-cloud-core-1.4.1 google-cloud-datastore-1.15.0 google-cloud-dlp-1.0.0 google-cloud-language-1.3.0 google-cloud-pubsub-1.7.0 google-cloud-spanner-1.17.1 google-cloud-videointelligence-1.15.0 google-cloud-vision-1.0.0 google-crc32c-0.1.0 google-resumable-media-0.7.1 googleapis-common-protos-1.52.0 grpc-google-iam-v1-0.12.3 grpcio-gcp-0.2.2 hdfs-2.5.8 httplib2-0.17.4 idna-2.10 jmespath-0.10.0 mock-2.0.0 monotonic-1.5 more-itertools-8.4.0 nose-1.3.7 nose-xunitmp-0.4.1 numpy-1.19.1 oauth2client-3.0.0 packaging-20.4 pandas-0.25.3 parameterized-0.7.4 pbr-5.4.5 psycopg2-binary-2.8.5 pyarrow-0.17.1 pyasn1-0.4.8 pyasn1-modules-0.2.8 pycparser-2.20 pydot-1.4.1 pyhamcrest-1.10.1 pymongo-3.11.0 pyparsing-2.4.7 pytest-4.6.11 pytest-forked-1.3.0 pytest-timeout-1.4.2 pytest-xdist-1.34.0 python-dateutil-2.8.1 pytz-2020.1 pyyaml-5.3.1 requests-2.24.0 requests-mock-1.8.0 rsa-4.6 s3transfer-0.3.3 sqlalchemy-1.3.19 tenacity-5.1.5 testcontainers-3.0.3 typing-extensions-3.7.4.3 urllib3-1.25.10 wcwidth-0.2.5 websocket-client-0.57.0 wrapt-1.12.1
> Task :sdks:python:apache_beam:testing:load_tests:run
INFO:apache_beam.runners.portability.stager:Copying Beam SDK "<https://ci-beam.apache.org/job/beam_LoadTests_Python_GBK_Dataflow_Batch/ws/src/sdks/python/build/apache-beam.tar.gz"> to staging location.
WARNING:root:Make sure that locally built Python SDK docker image has Python 3.7 interpreter.
INFO:root:Using Python SDK docker image: apache/beam_python3.7_sdk:2.25.0.dev. If the image is not available at local, we will try to pull from hub.docker.com
INFO:apache_beam.runners.dataflow.internal.apiclient:Defaulting to the temp_location as staging_location: gs://temp-storage-for-perf-tests/loadtests
INFO:apache_beam.internal.gcp.auth:Setting socket default timeout to 60 seconds.
INFO:apache_beam.internal.gcp.auth:socket default timeout is 60.0 seconds.
INFO:apache_beam.runners.dataflow.internal.apiclient:Starting GCS upload to gs://temp-storage-for-perf-tests/loadtests/load-tests-python-dataflow-batch-gbk-1-0825100140.1598358342.184334/pipeline.pb...
INFO:oauth2client.transport:Attempting refresh to obtain initial access_token
INFO:oauth2client.transport:Attempting refresh to obtain initial access_token
INFO:apache_beam.runners.dataflow.internal.apiclient:Completed GCS upload to gs://temp-storage-for-perf-tests/loadtests/load-tests-python-dataflow-batch-gbk-1-0825100140.1598358342.184334/pipeline.pb in 0 seconds.
INFO:apache_beam.runners.dataflow.internal.apiclient:Starting GCS upload to gs://temp-storage-for-perf-tests/loadtests/load-tests-python-dataflow-batch-gbk-1-0825100140.1598358342.184334/dataflow_python_sdk.tar...
INFO:apache_beam.runners.dataflow.internal.apiclient:Completed GCS upload to gs://temp-storage-for-perf-tests/loadtests/load-tests-python-dataflow-batch-gbk-1-0825100140.1598358342.184334/dataflow_python_sdk.tar in 0 seconds.
WARNING:apache_beam.options.pipeline_options:Discarding unparseable args: ['--iterations=1', '--fanout=1']
WARNING:apache_beam.options.pipeline_options:Discarding unparseable args: ['--iterations=1', '--fanout=1']
INFO:apache_beam.runners.dataflow.internal.apiclient:Create job: <Job
createTime: '2020-08-25T12:25:44.132289Z'
currentStateTime: '1970-01-01T00:00:00Z'
id: '2020-08-25_05_25_42-10164376841307937775'
location: 'us-central1'
name: 'load-tests-python-dataflow-batch-gbk-1-0825100140'
projectId: 'apache-beam-testing'
stageStates: []
startTime: '2020-08-25T12:25:44.132289Z'
steps: []
tempFiles: []
type: TypeValueValuesEnum(JOB_TYPE_BATCH, 1)>
INFO:apache_beam.runners.dataflow.internal.apiclient:Created job with id: [2020-08-25_05_25_42-10164376841307937775]
INFO:apache_beam.runners.dataflow.internal.apiclient:Submitted job: 2020-08-25_05_25_42-10164376841307937775
INFO:apache_beam.runners.dataflow.internal.apiclient:To access the Dataflow monitoring console, please navigate to https://console.cloud.google.com/dataflow/jobs/us-central1/2020-08-25_05_25_42-10164376841307937775?project=apache-beam-testing
INFO:apache_beam.runners.dataflow.dataflow_runner:Job 2020-08-25_05_25_42-10164376841307937775 is in state JOB_STATE_PENDING
INFO:apache_beam.runners.dataflow.dataflow_runner:2020-08-25T12:25:46.917Z: JOB_MESSAGE_BASIC: Worker configuration: n1-standard-1 in us-central1-f.
INFO:apache_beam.runners.dataflow.dataflow_runner:2020-08-25T12:25:47.823Z: JOB_MESSAGE_DETAILED: Expanding CoGroupByKey operations into optimizable parts.
INFO:apache_beam.runners.dataflow.dataflow_runner:2020-08-25T12:25:47.850Z: JOB_MESSAGE_DEBUG: Combiner lifting skipped for step GroupByKey 0: GroupByKey not followed by a combiner.
INFO:apache_beam.runners.dataflow.dataflow_runner:2020-08-25T12:25:47.902Z: JOB_MESSAGE_DETAILED: Expanding GroupByKey operations into optimizable parts.
INFO:apache_beam.runners.dataflow.dataflow_runner:2020-08-25T12:25:47.937Z: JOB_MESSAGE_DETAILED: Lifting ValueCombiningMappingFns into MergeBucketsMappingFns
INFO:apache_beam.runners.dataflow.dataflow_runner:2020-08-25T12:25:48Z: JOB_MESSAGE_DEBUG: Annotating graph with Autotuner information.
INFO:apache_beam.runners.dataflow.dataflow_runner:2020-08-25T12:25:48.040Z: JOB_MESSAGE_DETAILED: Fusing adjacent ParDo, Read, Write, and Flatten operations
INFO:apache_beam.runners.dataflow.dataflow_runner:2020-08-25T12:25:48.065Z: JOB_MESSAGE_DETAILED: Fusing consumer Measure time: Start into Read
INFO:apache_beam.runners.dataflow.dataflow_runner:2020-08-25T12:25:48.087Z: JOB_MESSAGE_DETAILED: Fusing consumer Assign timestamps into Measure time: Start
INFO:apache_beam.runners.dataflow.dataflow_runner:2020-08-25T12:25:48.111Z: JOB_MESSAGE_DETAILED: Fusing consumer GroupByKey 0/Reify into Assign timestamps
INFO:apache_beam.runners.dataflow.dataflow_runner:2020-08-25T12:25:48.145Z: JOB_MESSAGE_DETAILED: Fusing consumer GroupByKey 0/Write into GroupByKey 0/Reify
INFO:apache_beam.runners.dataflow.dataflow_runner:2020-08-25T12:25:48.176Z: JOB_MESSAGE_DETAILED: Fusing consumer GroupByKey 0/GroupByWindow into GroupByKey 0/Read
INFO:apache_beam.runners.dataflow.dataflow_runner:2020-08-25T12:25:48.210Z: JOB_MESSAGE_DETAILED: Fusing consumer Ungroup 0 into GroupByKey 0/GroupByWindow
INFO:apache_beam.runners.dataflow.dataflow_runner:2020-08-25T12:25:48.244Z: JOB_MESSAGE_DETAILED: Fusing consumer Measure latency into Ungroup 0
INFO:apache_beam.runners.dataflow.dataflow_runner:2020-08-25T12:25:48.277Z: JOB_MESSAGE_DETAILED: Fusing consumer Measure time: End 0 into Measure latency
INFO:apache_beam.runners.dataflow.dataflow_runner:2020-08-25T12:25:48.311Z: JOB_MESSAGE_DEBUG: Workflow config is missing a default resource spec.
INFO:apache_beam.runners.dataflow.dataflow_runner:2020-08-25T12:25:48.346Z: JOB_MESSAGE_DEBUG: Adding StepResource setup and teardown to workflow graph.
INFO:apache_beam.runners.dataflow.dataflow_runner:2020-08-25T12:25:48.378Z: JOB_MESSAGE_DEBUG: Adding workflow start and stop steps.
INFO:apache_beam.runners.dataflow.dataflow_runner:2020-08-25T12:25:48.413Z: JOB_MESSAGE_DEBUG: Assigning stage ids.
INFO:apache_beam.runners.dataflow.dataflow_runner:2020-08-25T12:25:48.690Z: JOB_MESSAGE_DEBUG: Executing wait step start13
INFO:apache_beam.runners.dataflow.dataflow_runner:2020-08-25T12:25:48.762Z: JOB_MESSAGE_BASIC: Executing operation GroupByKey 0/Create
INFO:apache_beam.runners.dataflow.dataflow_runner:2020-08-25T12:25:48.808Z: JOB_MESSAGE_DEBUG: Starting **** pool setup.
INFO:apache_beam.runners.dataflow.dataflow_runner:2020-08-25T12:25:48.840Z: JOB_MESSAGE_BASIC: Starting 5 ****s in us-central1-f...
INFO:apache_beam.runners.dataflow.dataflow_runner:2020-08-25T12:25:48.906Z: JOB_MESSAGE_BASIC: Finished operation GroupByKey 0/Create
INFO:apache_beam.runners.dataflow.dataflow_runner:2020-08-25T12:25:48.963Z: JOB_MESSAGE_DEBUG: Value "GroupByKey 0/Session" materialized.
INFO:apache_beam.runners.dataflow.dataflow_runner:2020-08-25T12:25:49.023Z: JOB_MESSAGE_BASIC: Executing operation Read+Measure time: Start+Assign timestamps+GroupByKey 0/Reify+GroupByKey 0/Write
INFO:apache_beam.runners.dataflow.dataflow_runner:Job 2020-08-25_05_25_42-10164376841307937775 is in state JOB_STATE_RUNNING
INFO:apache_beam.runners.dataflow.dataflow_runner:2020-08-25T12:26:10.416Z: JOB_MESSAGE_WARNING: Your project already contains 100 Dataflow-created metric descriptors and Stackdriver will not create new Dataflow custom metrics for this job. Each unique user-defined metric name (independent of the DoFn in which it is defined) produces a new metric descriptor. To delete old / unused metric descriptors see https://developers.google.com/apis-explorer/#p/monitoring/v3/monitoring.projects.metricDescriptors.list and https://developers.google.com/apis-explorer/#p/monitoring/v3/monitoring.projects.metricDescriptors.delete
INFO:apache_beam.runners.dataflow.dataflow_runner:2020-08-25T12:26:18.307Z: JOB_MESSAGE_DETAILED: Autoscaling: Raised the number of ****s to 5 based on the rate of progress in the currently running stage(s).
INFO:apache_beam.runners.dataflow.dataflow_runner:2020-08-25T12:27:59.127Z: JOB_MESSAGE_DETAILED: Workers have started successfully.
INFO:apache_beam.runners.dataflow.dataflow_runner:2020-08-25T12:27:59.158Z: JOB_MESSAGE_DETAILED: Workers have started successfully.
INFO:apache_beam.runners.dataflow.dataflow_runner:2020-08-25T12:59:19.230Z: JOB_MESSAGE_BASIC: Finished operation Read+Measure time: Start+Assign timestamps+GroupByKey 0/Reify+GroupByKey 0/Write
INFO:apache_beam.runners.dataflow.dataflow_runner:2020-08-25T12:59:19.328Z: JOB_MESSAGE_BASIC: Executing operation GroupByKey 0/Close
INFO:apache_beam.runners.dataflow.dataflow_runner:2020-08-25T12:59:19.382Z: JOB_MESSAGE_BASIC: Finished operation GroupByKey 0/Close
INFO:apache_beam.runners.dataflow.dataflow_runner:2020-08-25T12:59:19.438Z: JOB_MESSAGE_BASIC: Executing operation GroupByKey 0/Read+GroupByKey 0/GroupByWindow+Ungroup 0+Measure latency+Measure time: End 0
INFO:apache_beam.runners.dataflow.dataflow_runner:2020-08-25T13:03:55.666Z: JOB_MESSAGE_BASIC: Finished operation GroupByKey 0/Read+GroupByKey 0/GroupByWindow+Ungroup 0+Measure latency+Measure time: End 0
INFO:apache_beam.runners.dataflow.dataflow_runner:2020-08-25T13:03:55.775Z: JOB_MESSAGE_DEBUG: Executing success step success11
INFO:apache_beam.runners.dataflow.dataflow_runner:2020-08-25T13:03:55.849Z: JOB_MESSAGE_DETAILED: Cleaning up.
INFO:apache_beam.runners.dataflow.dataflow_runner:2020-08-25T13:03:55.905Z: JOB_MESSAGE_DEBUG: Starting **** pool teardown.
INFO:apache_beam.runners.dataflow.dataflow_runner:2020-08-25T13:03:55.935Z: JOB_MESSAGE_BASIC: Stopping **** pool...
INFO:apache_beam.runners.dataflow.dataflow_runner:2020-08-25T13:04:46.336Z: JOB_MESSAGE_DETAILED: Autoscaling: Resized **** pool from 5 to 0.
INFO:apache_beam.runners.dataflow.dataflow_runner:2020-08-25T13:04:46.381Z: JOB_MESSAGE_BASIC: Worker pool stopped.
INFO:apache_beam.runners.dataflow.dataflow_runner:2020-08-25T13:04:46.416Z: JOB_MESSAGE_DEBUG: Tearing down pending resources...
INFO:apache_beam.runners.dataflow.dataflow_runner:Job 2020-08-25_05_25_42-10164376841307937775 is in state JOB_STATE_DONE
INFO:apache_beam.testing.load_tests.load_test_metrics_utils:Load test results for test: 204f36644b7b4f6892110d0d69c324f8 and timestamp: 1598360701.3226469:
INFO:apache_beam.testing.load_tests.load_test_metrics_utils:Metric: python_dataflow_batch_gbk_1_runtime Value: 1958
INFO:apache_beam.testing.load_tests.load_test_metrics_utils:Metric: python_dataflow_batch_gbk_1_measure_latency_count_latency Value: 512
INFO:apache_beam.testing.load_tests.load_test_metrics_utils:Metric: python_dataflow_batch_gbk_1_measure_latency_max_latency Value: 9224970397484952
INFO:apache_beam.testing.load_tests.load_test_metrics_utils:Metric: python_dataflow_batch_gbk_1_measure_latency_min_latency Value: 9224970397214536
Traceback (most recent call last):
File "/usr/lib/python3.7/runpy.py", line 193, in _run_module_as_main
"__main__", mod_spec)
File "/usr/lib/python3.7/runpy.py", line 85, in _run_code
exec(code, run_globals)
File "<https://ci-beam.apache.org/job/beam_LoadTests_Python_GBK_Dataflow_Batch/ws/src/sdks/python/apache_beam/testing/load_tests/group_by_key_test.py",> line 120, in <module>
GroupByKeyTest().run()
File "<https://ci-beam.apache.org/job/beam_LoadTests_Python_GBK_Dataflow_Batch/ws/src/sdks/python/apache_beam/testing/load_tests/load_test.py",> line 153, in run
self._metrics_monitor.publish_metrics(self.result)
File "<https://ci-beam.apache.org/job/beam_LoadTests_Python_GBK_Dataflow_Batch/ws/src/sdks/python/apache_beam/testing/load_tests/load_test_metrics_utils.py",> line 227, in publish_metrics
publisher.publish(insert_dicts)
File "<https://ci-beam.apache.org/job/beam_LoadTests_Python_GBK_Dataflow_Batch/ws/src/sdks/python/apache_beam/testing/load_tests/load_test_metrics_utils.py",> line 375, in publish
% (result[METRICS_TYPE_LABEL], result[VALUE_LABEL])
TypeError: %d format: a number is required, not NoneType
> Task :sdks:python:apache_beam:testing:load_tests:run FAILED
FAILURE: Build failed with an exception.
* Where:
Build file '<https://ci-beam.apache.org/job/beam_LoadTests_Python_GBK_Dataflow_Batch/ws/src/sdks/python/apache_beam/testing/load_tests/build.gradle'> line: 58
* What went wrong:
Execution failed for task ':sdks:python:apache_beam:testing:load_tests:run'.
> error occurred
* Try:
Run with --stacktrace option to get the stack trace. Run with --info or --debug option to get more log output. Run with --scan to get full insights.
* Get more help at https://help.gradle.org
Deprecated Gradle features were used in this build, making it incompatible with Gradle 6.0.
Use '--warning-mode all' to show the individual deprecation warnings.
See https://docs.gradle.org/5.2.1/userguide/command_line_interface.html#sec:command_line_warnings
BUILD FAILED in 40m 41s
5 actionable tasks: 5 executed
Publishing build scan...
https://gradle.com/s/ktsyjqqwdrun6
Build step 'Invoke Gradle script' changed build result to FAILURE
Build step 'Invoke Gradle script' marked build as failure
---------------------------------------------------------------------
To unsubscribe, e-mail: builds-unsubscribe@beam.apache.org
For additional commands, e-mail: builds-help@beam.apache.org
Build failed in Jenkins: beam_LoadTests_Python_GBK_Dataflow_Batch
#450
Posted by Apache Jenkins Server <je...@builds.apache.org>.
See <https://ci-beam.apache.org/job/beam_LoadTests_Python_GBK_Dataflow_Batch/450/display/redirect>
Changes:
------------------------------------------
[...truncated 26.44 KB...]
Collecting google-cloud-spanner<2,>=1.13.0
Using cached google_cloud_spanner-1.17.1-py2.py3-none-any.whl (250 kB)
Collecting grpcio-gcp<1,>=0.2.2
Using cached grpcio_gcp-0.2.2-py2.py3-none-any.whl (9.4 kB)
Collecting google-cloud-dlp<2,>=0.12.0
Using cached google_cloud_dlp-1.0.0-py2.py3-none-any.whl (169 kB)
Collecting google-cloud-language<2,>=1.3.0
Using cached google_cloud_language-1.3.0-py2.py3-none-any.whl (83 kB)
Collecting google-cloud-videointelligence<2,>=1.8.0
Using cached google_cloud_videointelligence-1.15.0-py2.py3-none-any.whl (180 kB)
Collecting google-cloud-vision<2,>=0.38.0
Using cached google_cloud_vision-1.0.0-py2.py3-none-any.whl (435 kB)
Collecting freezegun>=0.3.12
Using cached freezegun-0.3.15-py2.py3-none-any.whl (14 kB)
Collecting nose>=1.3.7
Using cached nose-1.3.7-py3-none-any.whl (154 kB)
Processing /home/jenkins/.cache/pip/wheels/2e/29/a9/431158315f33abeaad2905460f5ffb18fc30f7ed7c66c47dee/nose_xunitmp-0.4.1-py3-none-any.whl
Collecting parameterized<0.8.0,>=0.7.1
Using cached parameterized-0.7.4-py2.py3-none-any.whl (25 kB)
Collecting pyhamcrest!=1.10.0,<2.0.0,>=1.9
Using cached PyHamcrest-1.10.1-py3-none-any.whl (48 kB)
Processing /home/jenkins/.cache/pip/wheels/5e/03/1e/e1e954795d6f35dfc7b637fe2277bff021303bd9570ecea653/PyYAML-5.3.1-cp37-cp37m-linux_x86_64.whl
Collecting requests_mock<2.0,>=1.7
Using cached requests_mock-1.8.0-py2.py3-none-any.whl (23 kB)
Collecting tenacity<6.0,>=5.0.2
Using cached tenacity-5.1.5-py2.py3-none-any.whl (34 kB)
Collecting pytest<5.0,>=4.4.0
Using cached pytest-4.6.11-py2.py3-none-any.whl (231 kB)
Collecting pytest-xdist<2,>=1.29.0
Using cached pytest_xdist-1.34.0-py2.py3-none-any.whl (36 kB)
Collecting pytest-timeout<2,>=1.3.3
Using cached pytest_timeout-1.4.2-py2.py3-none-any.whl (10 kB)
Collecting pandas<1,>=0.25.2
Using cached pandas-0.25.3-cp37-cp37m-manylinux1_x86_64.whl (10.4 MB)
Collecting sqlalchemy<2.0,>=1.3
Using cached SQLAlchemy-1.3.19-cp37-cp37m-manylinux2010_x86_64.whl (1.3 MB)
Collecting psycopg2-binary<3.0.0,>=2.8.5
Using cached psycopg2_binary-2.8.5-cp37-cp37m-manylinux1_x86_64.whl (2.9 MB)
Processing /home/jenkins/.cache/pip/wheels/22/11/6e/126cbd2f544f9966ee22e074e5a3b7ab9b22bb2d4a6217e599/testcontainers-3.0.3-py2.py3-none-any.whl
Requirement already satisfied: six>=1.5.2 in <https://ci-beam.apache.org/job/beam_LoadTests_Python_GBK_Dataflow_Batch/ws/src/build/gradleenv/1329484227/lib/python3.7/site-packages> (from grpcio<2,>=1.29.0->apache-beam==2.25.0.dev0) (1.15.0)
Processing /home/jenkins/.cache/pip/wheels/9b/04/dd/7daf4150b6d9b12949298737de9431a324d4b797ffd63f526e/docopt-0.6.2-py2.py3-none-any.whl
Collecting pbr>=0.11
Using cached pbr-5.4.5-py2.py3-none-any.whl (110 kB)
Collecting rsa>=3.1.4
Using cached rsa-4.6-py3-none-any.whl (47 kB)
Collecting pyasn1-modules>=0.0.5
Using cached pyasn1_modules-0.2.8-py2.py3-none-any.whl (155 kB)
Collecting pyasn1>=0.1.7
Using cached pyasn1-0.4.8-py2.py3-none-any.whl (77 kB)
Requirement already satisfied: setuptools in <https://ci-beam.apache.org/job/beam_LoadTests_Python_GBK_Dataflow_Batch/ws/src/build/gradleenv/1329484227/lib/python3.7/site-packages> (from protobuf<4,>=3.12.2->apache-beam==2.25.0.dev0) (49.6.0)
Collecting pyparsing>=2.1.4
Using cached pyparsing-2.4.7-py2.py3-none-any.whl (67 kB)
Collecting urllib3!=1.25.0,!=1.25.1,<1.26,>=1.21.1
Using cached urllib3-1.25.10-py2.py3-none-any.whl (127 kB)
Collecting chardet<4,>=3.0.2
Using cached chardet-3.0.4-py2.py3-none-any.whl (133 kB)
Collecting idna<3,>=2.5
Using cached idna-2.10-py2.py3-none-any.whl (58 kB)
Collecting certifi>=2017.4.17
Using cached certifi-2020.6.20-py2.py3-none-any.whl (156 kB)
Collecting botocore<1.18.0,>=1.17.47
Using cached botocore-1.17.47-py2.py3-none-any.whl (6.5 MB)
Collecting jmespath<1.0.0,>=0.7.1
Using cached jmespath-0.10.0-py2.py3-none-any.whl (24 kB)
Collecting s3transfer<0.4.0,>=0.3.0
Using cached s3transfer-0.3.3-py2.py3-none-any.whl (69 kB)
Collecting fasteners>=0.14
Using cached fasteners-0.15-py2.py3-none-any.whl (23 kB)
Collecting google-api-core[grpc]<2.0.0dev,>=1.14.0
Using cached google_api_core-1.22.1-py2.py3-none-any.whl (91 kB)
Processing /home/jenkins/.cache/pip/wheels/b9/ee/67/2e444183030cb8d31ce8b34cee34a7afdbd3ba5959ea846380/grpc_google_iam_v1-0.12.3-py3-none-any.whl
Collecting google-resumable-media<2.0dev,>=0.5.0
Using cached google_resumable_media-0.7.1-py2.py3-none-any.whl (42 kB)
Collecting attrs>=17.4.0
Using cached attrs-20.1.0-py2.py3-none-any.whl (49 kB)
Requirement already satisfied: pluggy<1.0,>=0.12 in <https://ci-beam.apache.org/job/beam_LoadTests_Python_GBK_Dataflow_Batch/ws/src/build/gradleenv/1329484227/lib/python3.7/site-packages> (from pytest<5.0,>=4.4.0->apache-beam==2.25.0.dev0) (0.13.1)
Collecting packaging
Using cached packaging-20.4-py2.py3-none-any.whl (37 kB)
Requirement already satisfied: importlib-metadata>=0.12; python_version < "3.8" in <https://ci-beam.apache.org/job/beam_LoadTests_Python_GBK_Dataflow_Batch/ws/src/build/gradleenv/1329484227/lib/python3.7/site-packages> (from pytest<5.0,>=4.4.0->apache-beam==2.25.0.dev0) (1.7.0)
Collecting more-itertools>=4.0.0; python_version > "2.7"
Using cached more_itertools-8.4.0-py3-none-any.whl (43 kB)
Requirement already satisfied: py>=1.5.0 in <https://ci-beam.apache.org/job/beam_LoadTests_Python_GBK_Dataflow_Batch/ws/src/build/gradleenv/1329484227/lib/python3.7/site-packages> (from pytest<5.0,>=4.4.0->apache-beam==2.25.0.dev0) (1.9.0)
Collecting atomicwrites>=1.0
Using cached atomicwrites-1.4.0-py2.py3-none-any.whl (6.8 kB)
Collecting wcwidth
Using cached wcwidth-0.2.5-py2.py3-none-any.whl (30 kB)
Collecting execnet>=1.1
Using cached execnet-1.7.1-py2.py3-none-any.whl (39 kB)
Collecting pytest-forked
Using cached pytest_forked-1.3.0-py2.py3-none-any.whl (4.7 kB)
Processing /home/jenkins/.cache/pip/wheels/4e/29/41/2a34b96f3d4bf9ab8ccaac5d86db4334fa17d79e7027a5b86f/blindspin-2.0.1-py3-none-any.whl
Processing /home/jenkins/.cache/pip/wheels/62/76/4c/aa25851149f3f6d9785f6c869387ad82b3fd37582fa8147ac6/wrapt-1.12.1-cp37-cp37m-linux_x86_64.whl
Collecting docker
Using cached docker-4.3.1-py2.py3-none-any.whl (145 kB)
Collecting crayons
Using cached crayons-0.3.1-py2.py3-none-any.whl (4.6 kB)
Collecting deprecation
Using cached deprecation-2.1.0-py2.py3-none-any.whl (11 kB)
Collecting docutils<0.16,>=0.10
Using cached docutils-0.15.2-py3-none-any.whl (547 kB)
Collecting monotonic>=0.1
Using cached monotonic-1.5-py2.py3-none-any.whl (5.3 kB)
Collecting googleapis-common-protos<2.0dev,>=1.6.0
Using cached googleapis_common_protos-1.52.0-py2.py3-none-any.whl (100 kB)
Collecting google-crc32c<0.2dev,>=0.1.0; python_version >= "3.5"
Using cached google_crc32c-0.1.0-cp37-cp37m-manylinux2010_x86_64.whl (39 kB)
Requirement already satisfied: zipp>=0.5 in <https://ci-beam.apache.org/job/beam_LoadTests_Python_GBK_Dataflow_Batch/ws/src/build/gradleenv/1329484227/lib/python3.7/site-packages> (from importlib-metadata>=0.12; python_version < "3.8"->pytest<5.0,>=4.4.0->apache-beam==2.25.0.dev0) (3.1.0)
Collecting apipkg>=1.4
Using cached apipkg-1.5-py2.py3-none-any.whl (4.9 kB)
Collecting websocket-client>=0.32.0
Using cached websocket_client-0.57.0-py2.py3-none-any.whl (200 kB)
Collecting colorama
Using cached colorama-0.4.3-py2.py3-none-any.whl (15 kB)
Collecting cffi>=1.0.0
Using cached cffi-1.14.2-cp37-cp37m-manylinux1_x86_64.whl (401 kB)
Collecting pycparser
Using cached pycparser-2.20-py2.py3-none-any.whl (112 kB)
Building wheels for collected packages: apache-beam
Building wheel for apache-beam (setup.py): started
Building wheel for apache-beam (setup.py): finished with status 'done'
Created wheel for apache-beam: filename=apache_beam-2.25.0.dev0-py3-none-any.whl size=2197167 sha256=ad06154d74886de73342fbdff199dd61cf9fc14d65a4724b19b04ba790195598
Stored in directory: /home/jenkins/.cache/pip/wheels/77/c3/45/f8c936a7742001e3bc0d0f63813dd268a96c932cc292dc2aae
Successfully built apache-beam
Installing collected packages: crcmod, dill, pytz, fastavro, urllib3, chardet, idna, certifi, requests, docopt, hdfs, httplib2, pbr, mock, numpy, pymongo, pyasn1, rsa, pyasn1-modules, oauth2client, pyparsing, pydot, python-dateutil, typing-extensions, avro-python3, pyarrow, jmespath, docutils, botocore, s3transfer, boto3, cachetools, monotonic, fasteners, google-apitools, google-auth, googleapis-common-protos, google-api-core, google-cloud-core, google-cloud-datastore, grpc-google-iam-v1, google-cloud-pubsub, pycparser, cffi, google-crc32c, google-resumable-media, google-cloud-bigquery, google-cloud-bigtable, google-cloud-spanner, grpcio-gcp, google-cloud-dlp, google-cloud-language, google-cloud-videointelligence, google-cloud-vision, freezegun, nose, nose-xunitmp, parameterized, pyhamcrest, pyyaml, requests-mock, tenacity, attrs, packaging, more-itertools, atomicwrites, wcwidth, pytest, apipkg, execnet, pytest-forked, pytest-xdist, pytest-timeout, pandas, sqlalchemy, psycopg2-binary, blindspin, wrapt, websocket-client, docker, colorama, crayons, deprecation, testcontainers, apache-beam
Successfully installed apache-beam-2.25.0.dev0 apipkg-1.5 atomicwrites-1.4.0 attrs-20.1.0 avro-python3-1.9.2.1 blindspin-2.0.1 boto3-1.14.47 botocore-1.17.47 cachetools-3.1.1 certifi-2020.6.20 cffi-1.14.2 chardet-3.0.4 colorama-0.4.3 crayons-0.3.1 crcmod-1.7 deprecation-2.1.0 dill-0.3.1.1 docker-4.3.1 docopt-0.6.2 docutils-0.15.2 execnet-1.7.1 fastavro-0.23.6 fasteners-0.15 freezegun-0.3.15 google-api-core-1.22.1 google-apitools-0.5.31 google-auth-1.20.1 google-cloud-bigquery-1.27.2 google-cloud-bigtable-1.4.0 google-cloud-core-1.4.1 google-cloud-datastore-1.15.0 google-cloud-dlp-1.0.0 google-cloud-language-1.3.0 google-cloud-pubsub-1.7.0 google-cloud-spanner-1.17.1 google-cloud-videointelligence-1.15.0 google-cloud-vision-1.0.0 google-crc32c-0.1.0 google-resumable-media-0.7.1 googleapis-common-protos-1.52.0 grpc-google-iam-v1-0.12.3 grpcio-gcp-0.2.2 hdfs-2.5.8 httplib2-0.17.4 idna-2.10 jmespath-0.10.0 mock-2.0.0 monotonic-1.5 more-itertools-8.4.0 nose-1.3.7 nose-xunitmp-0.4.1 numpy-1.19.1 oauth2client-3.0.0 packaging-20.4 pandas-0.25.3 parameterized-0.7.4 pbr-5.4.5 psycopg2-binary-2.8.5 pyarrow-0.17.1 pyasn1-0.4.8 pyasn1-modules-0.2.8 pycparser-2.20 pydot-1.4.1 pyhamcrest-1.10.1 pymongo-3.11.0 pyparsing-2.4.7 pytest-4.6.11 pytest-forked-1.3.0 pytest-timeout-1.4.2 pytest-xdist-1.34.0 python-dateutil-2.8.1 pytz-2020.1 pyyaml-5.3.1 requests-2.24.0 requests-mock-1.8.0 rsa-4.6 s3transfer-0.3.3 sqlalchemy-1.3.19 tenacity-5.1.5 testcontainers-3.0.3 typing-extensions-3.7.4.3 urllib3-1.25.10 wcwidth-0.2.5 websocket-client-0.57.0 wrapt-1.12.1
> Task :sdks:python:apache_beam:testing:load_tests:run
INFO:apache_beam.runners.portability.stager:Copying Beam SDK "<https://ci-beam.apache.org/job/beam_LoadTests_Python_GBK_Dataflow_Batch/ws/src/sdks/python/build/apache-beam.tar.gz"> to staging location.
WARNING:root:Make sure that locally built Python SDK docker image has Python 3.7 interpreter.
INFO:root:Using Python SDK docker image: apache/beam_python3.7_sdk:2.25.0.dev. If the image is not available at local, we will try to pull from hub.docker.com
INFO:apache_beam.runners.dataflow.internal.apiclient:Defaulting to the temp_location as staging_location: gs://temp-storage-for-perf-tests/loadtests
INFO:apache_beam.internal.gcp.auth:Setting socket default timeout to 60 seconds.
INFO:apache_beam.internal.gcp.auth:socket default timeout is 60.0 seconds.
INFO:apache_beam.runners.dataflow.internal.apiclient:Starting GCS upload to gs://temp-storage-for-perf-tests/loadtests/load-tests-python-dataflow-batch-gbk-1-0824100201.1598271920.114004/pipeline.pb...
INFO:oauth2client.transport:Attempting refresh to obtain initial access_token
INFO:oauth2client.transport:Attempting refresh to obtain initial access_token
INFO:apache_beam.runners.dataflow.internal.apiclient:Completed GCS upload to gs://temp-storage-for-perf-tests/loadtests/load-tests-python-dataflow-batch-gbk-1-0824100201.1598271920.114004/pipeline.pb in 0 seconds.
INFO:apache_beam.runners.dataflow.internal.apiclient:Starting GCS upload to gs://temp-storage-for-perf-tests/loadtests/load-tests-python-dataflow-batch-gbk-1-0824100201.1598271920.114004/dataflow_python_sdk.tar...
INFO:apache_beam.runners.dataflow.internal.apiclient:Completed GCS upload to gs://temp-storage-for-perf-tests/loadtests/load-tests-python-dataflow-batch-gbk-1-0824100201.1598271920.114004/dataflow_python_sdk.tar in 0 seconds.
WARNING:apache_beam.options.pipeline_options:Discarding unparseable args: ['--iterations=1', '--fanout=1']
WARNING:apache_beam.options.pipeline_options:Discarding unparseable args: ['--iterations=1', '--fanout=1']
INFO:apache_beam.runners.dataflow.internal.apiclient:Create job: <Job
createTime: '2020-08-24T12:25:21.849688Z'
currentStateTime: '1970-01-01T00:00:00Z'
id: '2020-08-24_05_25_20-12895441199238433645'
location: 'us-central1'
name: 'load-tests-python-dataflow-batch-gbk-1-0824100201'
projectId: 'apache-beam-testing'
stageStates: []
startTime: '2020-08-24T12:25:21.849688Z'
steps: []
tempFiles: []
type: TypeValueValuesEnum(JOB_TYPE_BATCH, 1)>
INFO:apache_beam.runners.dataflow.internal.apiclient:Created job with id: [2020-08-24_05_25_20-12895441199238433645]
INFO:apache_beam.runners.dataflow.internal.apiclient:Submitted job: 2020-08-24_05_25_20-12895441199238433645
INFO:apache_beam.runners.dataflow.internal.apiclient:To access the Dataflow monitoring console, please navigate to https://console.cloud.google.com/dataflow/jobs/us-central1/2020-08-24_05_25_20-12895441199238433645?project=apache-beam-testing
INFO:apache_beam.runners.dataflow.dataflow_runner:Job 2020-08-24_05_25_20-12895441199238433645 is in state JOB_STATE_PENDING
INFO:apache_beam.runners.dataflow.dataflow_runner:2020-08-24T12:25:24.665Z: JOB_MESSAGE_BASIC: Worker configuration: n1-standard-1 in us-central1-f.
INFO:apache_beam.runners.dataflow.dataflow_runner:2020-08-24T12:25:25.964Z: JOB_MESSAGE_DETAILED: Expanding CoGroupByKey operations into optimizable parts.
INFO:apache_beam.runners.dataflow.dataflow_runner:2020-08-24T12:25:26.003Z: JOB_MESSAGE_DEBUG: Combiner lifting skipped for step GroupByKey 0: GroupByKey not followed by a combiner.
INFO:apache_beam.runners.dataflow.dataflow_runner:2020-08-24T12:25:26.039Z: JOB_MESSAGE_DETAILED: Expanding GroupByKey operations into optimizable parts.
INFO:apache_beam.runners.dataflow.dataflow_runner:2020-08-24T12:25:26.161Z: JOB_MESSAGE_DETAILED: Lifting ValueCombiningMappingFns into MergeBucketsMappingFns
INFO:apache_beam.runners.dataflow.dataflow_runner:2020-08-24T12:25:26.233Z: JOB_MESSAGE_DEBUG: Annotating graph with Autotuner information.
INFO:apache_beam.runners.dataflow.dataflow_runner:2020-08-24T12:25:26.280Z: JOB_MESSAGE_DETAILED: Fusing adjacent ParDo, Read, Write, and Flatten operations
INFO:apache_beam.runners.dataflow.dataflow_runner:2020-08-24T12:25:26.314Z: JOB_MESSAGE_DETAILED: Fusing consumer Measure time: Start into Read
INFO:apache_beam.runners.dataflow.dataflow_runner:2020-08-24T12:25:26.349Z: JOB_MESSAGE_DETAILED: Fusing consumer Assign timestamps into Measure time: Start
INFO:apache_beam.runners.dataflow.dataflow_runner:2020-08-24T12:25:26.382Z: JOB_MESSAGE_DETAILED: Fusing consumer GroupByKey 0/Reify into Assign timestamps
INFO:apache_beam.runners.dataflow.dataflow_runner:2020-08-24T12:25:26.415Z: JOB_MESSAGE_DETAILED: Fusing consumer GroupByKey 0/Write into GroupByKey 0/Reify
INFO:apache_beam.runners.dataflow.dataflow_runner:2020-08-24T12:25:26.448Z: JOB_MESSAGE_DETAILED: Fusing consumer GroupByKey 0/GroupByWindow into GroupByKey 0/Read
INFO:apache_beam.runners.dataflow.dataflow_runner:2020-08-24T12:25:26.489Z: JOB_MESSAGE_DETAILED: Fusing consumer Ungroup 0 into GroupByKey 0/GroupByWindow
INFO:apache_beam.runners.dataflow.dataflow_runner:2020-08-24T12:25:26.518Z: JOB_MESSAGE_DETAILED: Fusing consumer Measure latency into Ungroup 0
INFO:apache_beam.runners.dataflow.dataflow_runner:2020-08-24T12:25:26.550Z: JOB_MESSAGE_DETAILED: Fusing consumer Measure time: End 0 into Measure latency
INFO:apache_beam.runners.dataflow.dataflow_runner:2020-08-24T12:25:26.585Z: JOB_MESSAGE_DEBUG: Workflow config is missing a default resource spec.
INFO:apache_beam.runners.dataflow.dataflow_runner:2020-08-24T12:25:26.619Z: JOB_MESSAGE_DEBUG: Adding StepResource setup and teardown to workflow graph.
INFO:apache_beam.runners.dataflow.dataflow_runner:2020-08-24T12:25:26.652Z: JOB_MESSAGE_DEBUG: Adding workflow start and stop steps.
INFO:apache_beam.runners.dataflow.dataflow_runner:2020-08-24T12:25:26.687Z: JOB_MESSAGE_DEBUG: Assigning stage ids.
INFO:apache_beam.runners.dataflow.dataflow_runner:2020-08-24T12:25:26.808Z: JOB_MESSAGE_DEBUG: Executing wait step start13
INFO:apache_beam.runners.dataflow.dataflow_runner:2020-08-24T12:25:26.873Z: JOB_MESSAGE_BASIC: Executing operation GroupByKey 0/Create
INFO:apache_beam.runners.dataflow.dataflow_runner:2020-08-24T12:25:26.920Z: JOB_MESSAGE_DEBUG: Starting **** pool setup.
INFO:apache_beam.runners.dataflow.dataflow_runner:2020-08-24T12:25:26.946Z: JOB_MESSAGE_BASIC: Starting 5 ****s in us-central1-f...
INFO:apache_beam.runners.dataflow.dataflow_runner:2020-08-24T12:25:26.978Z: JOB_MESSAGE_BASIC: Finished operation GroupByKey 0/Create
INFO:apache_beam.runners.dataflow.dataflow_runner:2020-08-24T12:25:27.044Z: JOB_MESSAGE_DEBUG: Value "GroupByKey 0/Session" materialized.
INFO:apache_beam.runners.dataflow.dataflow_runner:2020-08-24T12:25:27.102Z: JOB_MESSAGE_BASIC: Executing operation Read+Measure time: Start+Assign timestamps+GroupByKey 0/Reify+GroupByKey 0/Write
INFO:apache_beam.runners.dataflow.dataflow_runner:Job 2020-08-24_05_25_20-12895441199238433645 is in state JOB_STATE_RUNNING
INFO:apache_beam.runners.dataflow.dataflow_runner:2020-08-24T12:25:35.912Z: JOB_MESSAGE_WARNING: Your project already contains 100 Dataflow-created metric descriptors and Stackdriver will not create new Dataflow custom metrics for this job. Each unique user-defined metric name (independent of the DoFn in which it is defined) produces a new metric descriptor. To delete old / unused metric descriptors see https://developers.google.com/apis-explorer/#p/monitoring/v3/monitoring.projects.metricDescriptors.list and https://developers.google.com/apis-explorer/#p/monitoring/v3/monitoring.projects.metricDescriptors.delete
INFO:apache_beam.runners.dataflow.dataflow_runner:2020-08-24T12:25:54.783Z: JOB_MESSAGE_DETAILED: Autoscaling: Raised the number of ****s to 5 based on the rate of progress in the currently running stage(s).
INFO:apache_beam.runners.dataflow.dataflow_runner:2020-08-24T12:27:39.276Z: JOB_MESSAGE_DETAILED: Workers have started successfully.
INFO:apache_beam.runners.dataflow.dataflow_runner:2020-08-24T12:27:39.309Z: JOB_MESSAGE_DETAILED: Workers have started successfully.
INFO:apache_beam.runners.dataflow.dataflow_runner:2020-08-24T12:58:40.731Z: JOB_MESSAGE_BASIC: Finished operation Read+Measure time: Start+Assign timestamps+GroupByKey 0/Reify+GroupByKey 0/Write
INFO:apache_beam.runners.dataflow.dataflow_runner:2020-08-24T12:58:40.853Z: JOB_MESSAGE_BASIC: Executing operation GroupByKey 0/Close
INFO:apache_beam.runners.dataflow.dataflow_runner:2020-08-24T12:58:40.956Z: JOB_MESSAGE_BASIC: Finished operation GroupByKey 0/Close
INFO:apache_beam.runners.dataflow.dataflow_runner:2020-08-24T12:58:41.026Z: JOB_MESSAGE_BASIC: Executing operation GroupByKey 0/Read+GroupByKey 0/GroupByWindow+Ungroup 0+Measure latency+Measure time: End 0
INFO:apache_beam.runners.dataflow.dataflow_runner:2020-08-24T13:03:04.486Z: JOB_MESSAGE_BASIC: Finished operation GroupByKey 0/Read+GroupByKey 0/GroupByWindow+Ungroup 0+Measure latency+Measure time: End 0
INFO:apache_beam.runners.dataflow.dataflow_runner:2020-08-24T13:03:04.614Z: JOB_MESSAGE_DEBUG: Executing success step success11
INFO:apache_beam.runners.dataflow.dataflow_runner:2020-08-24T13:03:04.681Z: JOB_MESSAGE_DETAILED: Cleaning up.
INFO:apache_beam.runners.dataflow.dataflow_runner:2020-08-24T13:03:04.732Z: JOB_MESSAGE_DEBUG: Starting **** pool teardown.
INFO:apache_beam.runners.dataflow.dataflow_runner:2020-08-24T13:03:04.765Z: JOB_MESSAGE_BASIC: Stopping **** pool...
INFO:apache_beam.runners.dataflow.dataflow_runner:2020-08-24T13:03:56.336Z: JOB_MESSAGE_DETAILED: Autoscaling: Resized **** pool from 5 to 0.
INFO:apache_beam.runners.dataflow.dataflow_runner:2020-08-24T13:03:56.375Z: JOB_MESSAGE_BASIC: Worker pool stopped.
INFO:apache_beam.runners.dataflow.dataflow_runner:2020-08-24T13:03:56.413Z: JOB_MESSAGE_DEBUG: Tearing down pending resources...
INFO:apache_beam.runners.dataflow.dataflow_runner:Job 2020-08-24_05_25_20-12895441199238433645 is in state JOB_STATE_DONE
INFO:apache_beam.testing.load_tests.load_test_metrics_utils:Load test results for test: f7a170d03b0e4b03b9e0f967ef32c2ab and timestamp: 1598274244.031897:
INFO:apache_beam.testing.load_tests.load_test_metrics_utils:Metric: python_dataflow_batch_gbk_1_runtime Value: 1927
INFO:apache_beam.testing.load_tests.load_test_metrics_utils:Metric: python_dataflow_batch_gbk_1_measure_latency_count_latency Value: 512
INFO:apache_beam.testing.load_tests.load_test_metrics_utils:Metric: python_dataflow_batch_gbk_1_measure_latency_max_latency Value: 9224970311034168
INFO:apache_beam.testing.load_tests.load_test_metrics_utils:Metric: python_dataflow_batch_gbk_1_measure_latency_min_latency Value: 9224970310776052
Traceback (most recent call last):
File "/usr/lib/python3.7/runpy.py", line 193, in _run_module_as_main
"__main__", mod_spec)
File "/usr/lib/python3.7/runpy.py", line 85, in _run_code
exec(code, run_globals)
File "<https://ci-beam.apache.org/job/beam_LoadTests_Python_GBK_Dataflow_Batch/ws/src/sdks/python/apache_beam/testing/load_tests/group_by_key_test.py",> line 120, in <module>
GroupByKeyTest().run()
File "<https://ci-beam.apache.org/job/beam_LoadTests_Python_GBK_Dataflow_Batch/ws/src/sdks/python/apache_beam/testing/load_tests/load_test.py",> line 153, in run
self._metrics_monitor.publish_metrics(self.result)
File "<https://ci-beam.apache.org/job/beam_LoadTests_Python_GBK_Dataflow_Batch/ws/src/sdks/python/apache_beam/testing/load_tests/load_test_metrics_utils.py",> line 227, in publish_metrics
publisher.publish(insert_dicts)
File "<https://ci-beam.apache.org/job/beam_LoadTests_Python_GBK_Dataflow_Batch/ws/src/sdks/python/apache_beam/testing/load_tests/load_test_metrics_utils.py",> line 375, in publish
% (result[METRICS_TYPE_LABEL], result[VALUE_LABEL])
TypeError: %d format: a number is required, not NoneType
> Task :sdks:python:apache_beam:testing:load_tests:run FAILED
FAILURE: Build failed with an exception.
* Where:
Build file '<https://ci-beam.apache.org/job/beam_LoadTests_Python_GBK_Dataflow_Batch/ws/src/sdks/python/apache_beam/testing/load_tests/build.gradle'> line: 58
* What went wrong:
Execution failed for task ':sdks:python:apache_beam:testing:load_tests:run'.
> error occurred
* Try:
Run with --stacktrace option to get the stack trace. Run with --info or --debug option to get more log output. Run with --scan to get full insights.
* Get more help at https://help.gradle.org
Deprecated Gradle features were used in this build, making it incompatible with Gradle 6.0.
Use '--warning-mode all' to show the individual deprecation warnings.
See https://docs.gradle.org/5.2.1/userguide/command_line_interface.html#sec:command_line_warnings
BUILD FAILED in 39m 46s
5 actionable tasks: 5 executed
Publishing build scan...
https://gradle.com/s/cs763jmjc4rfi
Build step 'Invoke Gradle script' changed build result to FAILURE
Build step 'Invoke Gradle script' marked build as failure
---------------------------------------------------------------------
To unsubscribe, e-mail: builds-unsubscribe@beam.apache.org
For additional commands, e-mail: builds-help@beam.apache.org
Build failed in Jenkins: beam_LoadTests_Python_GBK_Dataflow_Batch
#449
Posted by Apache Jenkins Server <je...@builds.apache.org>.
See <https://ci-beam.apache.org/job/beam_LoadTests_Python_GBK_Dataflow_Batch/449/display/redirect?page=changes>
Changes:
[noreply] [BEAM-7587] Spark portable streaming (#12157)
[noreply] Merge pull request #12653 from [BEAM-10758] Centralized Glob Translation
------------------------------------------
[...truncated 23.02 KB...]
Processing /home/jenkins/.cache/pip/wheels/dc/9a/e9/49e627353476cec8484343c4ab656f1e0d783ee77b9dde2d1f/crcmod-1.7-cp37-cp37m-linux_x86_64.whl
Processing /home/jenkins/.cache/pip/wheels/a4/61/fd/c57e374e580aa78a45ed78d5859b3a44436af17e22ca53284f/dill-0.3.1.1-py3-none-any.whl
Collecting fastavro<0.24,>=0.21.4
Using cached fastavro-0.23.6-cp37-cp37m-manylinux2010_x86_64.whl (1.4 MB)
Requirement already satisfied: future<1.0.0,>=0.18.2 in <https://ci-beam.apache.org/job/beam_LoadTests_Python_GBK_Dataflow_Batch/ws/src/build/gradleenv/1329484227/lib/python3.7/site-packages> (from apache-beam==2.25.0.dev0) (0.18.2)
Requirement already satisfied: grpcio<2,>=1.29.0 in <https://ci-beam.apache.org/job/beam_LoadTests_Python_GBK_Dataflow_Batch/ws/src/build/gradleenv/1329484227/lib/python3.7/site-packages> (from apache-beam==2.25.0.dev0) (1.31.0)
Processing /home/jenkins/.cache/pip/wheels/0a/7d/38/ea4eaf831518e6cd867b515b88919a9785eb66f11def5ab859/hdfs-2.5.8-py3-none-any.whl
Collecting httplib2<0.18.0,>=0.8
Using cached httplib2-0.17.4-py3-none-any.whl (95 kB)
Collecting mock<3.0.0,>=1.0.1
Using cached mock-2.0.0-py2.py3-none-any.whl (56 kB)
Collecting numpy<2,>=1.14.3
Using cached numpy-1.19.1-cp37-cp37m-manylinux2010_x86_64.whl (14.5 MB)
Collecting pymongo<4.0.0,>=3.8.0
Using cached pymongo-3.11.0-cp37-cp37m-manylinux2014_x86_64.whl (511 kB)
Processing /home/jenkins/.cache/pip/wheels/86/73/7a/3b3f76a2142176605ff38fbca574327962c71e25a43197a4c1/oauth2client-3.0.0-py3-none-any.whl
Requirement already satisfied: protobuf<4,>=3.12.2 in <https://ci-beam.apache.org/job/beam_LoadTests_Python_GBK_Dataflow_Batch/ws/src/build/gradleenv/1329484227/lib/python3.7/site-packages> (from apache-beam==2.25.0.dev0) (3.13.0)
Collecting pydot<2,>=1.2.0
Using cached pydot-1.4.1-py2.py3-none-any.whl (19 kB)
Collecting python-dateutil<3,>=2.8.0
Using cached python_dateutil-2.8.1-py2.py3-none-any.whl (227 kB)
Collecting pytz>=2018.3
Using cached pytz-2020.1-py2.py3-none-any.whl (510 kB)
Collecting requests<3.0.0,>=2.24.0
Using cached requests-2.24.0-py2.py3-none-any.whl (61 kB)
Collecting typing-extensions<3.8.0,>=3.7.0
Using cached typing_extensions-3.7.4.2-py3-none-any.whl (22 kB)
Processing /home/jenkins/.cache/pip/wheels/bc/49/5f/fdb5b9d85055c478213e0158ac122b596816149a02d82e0ab1/avro_python3-1.9.2.1-py3-none-any.whl
Collecting pyarrow<0.18.0,>=0.15.1
Using cached pyarrow-0.17.1-cp37-cp37m-manylinux2014_x86_64.whl (63.8 MB)
Collecting boto3>=1.9
Using cached boto3-1.14.47-py2.py3-none-any.whl (129 kB)
Collecting cachetools<4,>=3.1.0
Using cached cachetools-3.1.1-py2.py3-none-any.whl (11 kB)
Processing /home/jenkins/.cache/pip/wheels/19/b5/2f/1cc3cf2b31e7a9cd1508731212526d9550271274d351c96f16/google_apitools-0.5.31-py3-none-any.whl
Collecting google-auth<2,>=1.18.0
Using cached google_auth-1.20.1-py2.py3-none-any.whl (91 kB)
Collecting google-cloud-datastore<2,>=1.7.1
Using cached google_cloud_datastore-1.15.0-py2.py3-none-any.whl (132 kB)
Collecting google-cloud-pubsub<2,>=0.39.0
Using cached google_cloud_pubsub-1.7.0-py2.py3-none-any.whl (144 kB)
Collecting google-cloud-bigquery<2,>=1.6.0
Using cached google_cloud_bigquery-1.27.2-py2.py3-none-any.whl (172 kB)
Collecting google-cloud-core<2,>=0.28.1
Using cached google_cloud_core-1.4.1-py2.py3-none-any.whl (26 kB)
Collecting google-cloud-bigtable<2,>=0.31.1
Using cached google_cloud_bigtable-1.4.0-py2.py3-none-any.whl (265 kB)
Collecting google-cloud-spanner<2,>=1.13.0
Using cached google_cloud_spanner-1.17.1-py2.py3-none-any.whl (250 kB)
Collecting grpcio-gcp<1,>=0.2.2
Using cached grpcio_gcp-0.2.2-py2.py3-none-any.whl (9.4 kB)
Collecting google-cloud-dlp<2,>=0.12.0
Using cached google_cloud_dlp-1.0.0-py2.py3-none-any.whl (169 kB)
Collecting google-cloud-language<2,>=1.3.0
Using cached google_cloud_language-1.3.0-py2.py3-none-any.whl (83 kB)
Collecting google-cloud-videointelligence<2,>=1.8.0
Using cached google_cloud_videointelligence-1.15.0-py2.py3-none-any.whl (180 kB)
Collecting google-cloud-vision<2,>=0.38.0
Using cached google_cloud_vision-1.0.0-py2.py3-none-any.whl (435 kB)
Collecting freezegun>=0.3.12
Using cached freezegun-0.3.15-py2.py3-none-any.whl (14 kB)
Collecting nose>=1.3.7
Using cached nose-1.3.7-py3-none-any.whl (154 kB)
Processing /home/jenkins/.cache/pip/wheels/2e/29/a9/431158315f33abeaad2905460f5ffb18fc30f7ed7c66c47dee/nose_xunitmp-0.4.1-py3-none-any.whl
Collecting parameterized<0.8.0,>=0.7.1
Using cached parameterized-0.7.4-py2.py3-none-any.whl (25 kB)
Collecting pyhamcrest!=1.10.0,<2.0.0,>=1.9
Using cached PyHamcrest-1.10.1-py3-none-any.whl (48 kB)
Processing /home/jenkins/.cache/pip/wheels/5e/03/1e/e1e954795d6f35dfc7b637fe2277bff021303bd9570ecea653/PyYAML-5.3.1-cp37-cp37m-linux_x86_64.whl
Collecting requests_mock<2.0,>=1.7
Using cached requests_mock-1.8.0-py2.py3-none-any.whl (23 kB)
Collecting tenacity<6.0,>=5.0.2
Using cached tenacity-5.1.5-py2.py3-none-any.whl (34 kB)
Collecting pytest<5.0,>=4.4.0
Using cached pytest-4.6.11-py2.py3-none-any.whl (231 kB)
Collecting pytest-xdist<2,>=1.29.0
Using cached pytest_xdist-1.34.0-py2.py3-none-any.whl (36 kB)
Collecting pytest-timeout<2,>=1.3.3
Using cached pytest_timeout-1.4.2-py2.py3-none-any.whl (10 kB)
Collecting pandas<1,>=0.25.2
Using cached pandas-0.25.3-cp37-cp37m-manylinux1_x86_64.whl (10.4 MB)
Collecting sqlalchemy<2.0,>=1.3
Using cached SQLAlchemy-1.3.19-cp37-cp37m-manylinux2010_x86_64.whl (1.3 MB)
Collecting psycopg2-binary<3.0.0,>=2.8.5
Using cached psycopg2_binary-2.8.5-cp37-cp37m-manylinux1_x86_64.whl (2.9 MB)
Processing /home/jenkins/.cache/pip/wheels/22/11/6e/126cbd2f544f9966ee22e074e5a3b7ab9b22bb2d4a6217e599/testcontainers-3.0.3-py2.py3-none-any.whl
Requirement already satisfied: six>=1.5.2 in <https://ci-beam.apache.org/job/beam_LoadTests_Python_GBK_Dataflow_Batch/ws/src/build/gradleenv/1329484227/lib/python3.7/site-packages> (from grpcio<2,>=1.29.0->apache-beam==2.25.0.dev0) (1.15.0)
Processing /home/jenkins/.cache/pip/wheels/9b/04/dd/7daf4150b6d9b12949298737de9431a324d4b797ffd63f526e/docopt-0.6.2-py2.py3-none-any.whl
Collecting pbr>=0.11
Using cached pbr-5.4.5-py2.py3-none-any.whl (110 kB)
Collecting pyasn1>=0.1.7
Using cached pyasn1-0.4.8-py2.py3-none-any.whl (77 kB)
Collecting rsa>=3.1.4
Using cached rsa-4.6-py3-none-any.whl (47 kB)
Collecting pyasn1-modules>=0.0.5
Using cached pyasn1_modules-0.2.8-py2.py3-none-any.whl (155 kB)
Requirement already satisfied: setuptools in <https://ci-beam.apache.org/job/beam_LoadTests_Python_GBK_Dataflow_Batch/ws/src/build/gradleenv/1329484227/lib/python3.7/site-packages> (from protobuf<4,>=3.12.2->apache-beam==2.25.0.dev0) (49.6.0)
Collecting pyparsing>=2.1.4
Using cached pyparsing-2.4.7-py2.py3-none-any.whl (67 kB)
Collecting certifi>=2017.4.17
Using cached certifi-2020.6.20-py2.py3-none-any.whl (156 kB)
Collecting chardet<4,>=3.0.2
Using cached chardet-3.0.4-py2.py3-none-any.whl (133 kB)
Collecting urllib3!=1.25.0,!=1.25.1,<1.26,>=1.21.1
Using cached urllib3-1.25.10-py2.py3-none-any.whl (127 kB)
Collecting idna<3,>=2.5
Using cached idna-2.10-py2.py3-none-any.whl (58 kB)
Collecting jmespath<1.0.0,>=0.7.1
Using cached jmespath-0.10.0-py2.py3-none-any.whl (24 kB)
Collecting botocore<1.18.0,>=1.17.47
Using cached botocore-1.17.47-py2.py3-none-any.whl (6.5 MB)
Collecting s3transfer<0.4.0,>=0.3.0
Using cached s3transfer-0.3.3-py2.py3-none-any.whl (69 kB)
Collecting fasteners>=0.14
Using cached fasteners-0.15-py2.py3-none-any.whl (23 kB)
Collecting google-api-core[grpc]<2.0.0dev,>=1.14.0
Using cached google_api_core-1.22.1-py2.py3-none-any.whl (91 kB)
Processing /home/jenkins/.cache/pip/wheels/b9/ee/67/2e444183030cb8d31ce8b34cee34a7afdbd3ba5959ea846380/grpc_google_iam_v1-0.12.3-py3-none-any.whl
Collecting google-resumable-media<2.0dev,>=0.5.0
Using cached google_resumable_media-0.7.1-py2.py3-none-any.whl (42 kB)
Requirement already satisfied: pluggy<1.0,>=0.12 in <https://ci-beam.apache.org/job/beam_LoadTests_Python_GBK_Dataflow_Batch/ws/src/build/gradleenv/1329484227/lib/python3.7/site-packages> (from pytest<5.0,>=4.4.0->apache-beam==2.25.0.dev0) (0.13.1)
Requirement already satisfied: importlib-metadata>=0.12; python_version < "3.8" in <https://ci-beam.apache.org/job/beam_LoadTests_Python_GBK_Dataflow_Batch/ws/src/build/gradleenv/1329484227/lib/python3.7/site-packages> (from pytest<5.0,>=4.4.0->apache-beam==2.25.0.dev0) (1.7.0)
Requirement already satisfied: py>=1.5.0 in <https://ci-beam.apache.org/job/beam_LoadTests_Python_GBK_Dataflow_Batch/ws/src/build/gradleenv/1329484227/lib/python3.7/site-packages> (from pytest<5.0,>=4.4.0->apache-beam==2.25.0.dev0) (1.9.0)
Collecting more-itertools>=4.0.0; python_version > "2.7"
Using cached more_itertools-8.4.0-py3-none-any.whl (43 kB)
Collecting packaging
Using cached packaging-20.4-py2.py3-none-any.whl (37 kB)
Collecting attrs>=17.4.0
Using cached attrs-20.1.0-py2.py3-none-any.whl (49 kB)
Collecting wcwidth
Using cached wcwidth-0.2.5-py2.py3-none-any.whl (30 kB)
Collecting atomicwrites>=1.0
Using cached atomicwrites-1.4.0-py2.py3-none-any.whl (6.8 kB)
Collecting execnet>=1.1
Using cached execnet-1.7.1-py2.py3-none-any.whl (39 kB)
Collecting pytest-forked
Using cached pytest_forked-1.3.0-py2.py3-none-any.whl (4.7 kB)
Collecting crayons
Using cached crayons-0.3.1-py2.py3-none-any.whl (4.6 kB)
Collecting deprecation
Using cached deprecation-2.1.0-py2.py3-none-any.whl (11 kB)
Collecting docker
Using cached docker-4.3.1-py2.py3-none-any.whl (145 kB)
Processing /home/jenkins/.cache/pip/wheels/62/76/4c/aa25851149f3f6d9785f6c869387ad82b3fd37582fa8147ac6/wrapt-1.12.1-cp37-cp37m-linux_x86_64.whl
Processing /home/jenkins/.cache/pip/wheels/4e/29/41/2a34b96f3d4bf9ab8ccaac5d86db4334fa17d79e7027a5b86f/blindspin-2.0.1-py3-none-any.whl
Collecting docutils<0.16,>=0.10
Using cached docutils-0.15.2-py3-none-any.whl (547 kB)
Collecting monotonic>=0.1
Using cached monotonic-1.5-py2.py3-none-any.whl (5.3 kB)
Collecting googleapis-common-protos<2.0dev,>=1.6.0
Using cached googleapis_common_protos-1.52.0-py2.py3-none-any.whl (100 kB)
Collecting google-crc32c<0.2dev,>=0.1.0; python_version >= "3.5"
Using cached google_crc32c-0.1.0-cp37-cp37m-manylinux2010_x86_64.whl (39 kB)
Requirement already satisfied: zipp>=0.5 in <https://ci-beam.apache.org/job/beam_LoadTests_Python_GBK_Dataflow_Batch/ws/src/build/gradleenv/1329484227/lib/python3.7/site-packages> (from importlib-metadata>=0.12; python_version < "3.8"->pytest<5.0,>=4.4.0->apache-beam==2.25.0.dev0) (3.1.0)
Collecting apipkg>=1.4
Using cached apipkg-1.5-py2.py3-none-any.whl (4.9 kB)
Collecting colorama
Using cached colorama-0.4.3-py2.py3-none-any.whl (15 kB)
Collecting websocket-client>=0.32.0
Using cached websocket_client-0.57.0-py2.py3-none-any.whl (200 kB)
Collecting cffi>=1.0.0
Using cached cffi-1.14.2-cp37-cp37m-manylinux1_x86_64.whl (401 kB)
Collecting pycparser
Using cached pycparser-2.20-py2.py3-none-any.whl (112 kB)
Building wheels for collected packages: apache-beam
Building wheel for apache-beam (setup.py): started
Building wheel for apache-beam (setup.py): finished with status 'done'
Created wheel for apache-beam: filename=apache_beam-2.25.0.dev0-py3-none-any.whl size=2197167 sha256=54a3b18e830a591034cdad78858bfdbfeeacb84afe8dcd24df6249c3c4fee6df
Stored in directory: /home/jenkins/.cache/pip/wheels/77/c3/45/f8c936a7742001e3bc0d0f63813dd268a96c932cc292dc2aae
Successfully built apache-beam
Installing collected packages: crcmod, dill, pytz, fastavro, certifi, chardet, urllib3, idna, requests, docopt, hdfs, httplib2, pbr, mock, numpy, pymongo, pyasn1, rsa, pyasn1-modules, oauth2client, pyparsing, pydot, python-dateutil, typing-extensions, avro-python3, pyarrow, jmespath, docutils, botocore, s3transfer, boto3, cachetools, monotonic, fasteners, google-apitools, google-auth, googleapis-common-protos, google-api-core, google-cloud-core, google-cloud-datastore, grpc-google-iam-v1, google-cloud-pubsub, pycparser, cffi, google-crc32c, google-resumable-media, google-cloud-bigquery, google-cloud-bigtable, google-cloud-spanner, grpcio-gcp, google-cloud-dlp, google-cloud-language, google-cloud-videointelligence, google-cloud-vision, freezegun, nose, nose-xunitmp, parameterized, pyhamcrest, pyyaml, requests-mock, tenacity, more-itertools, packaging, attrs, wcwidth, atomicwrites, pytest, apipkg, execnet, pytest-forked, pytest-xdist, pytest-timeout, pandas, sqlalchemy, psycopg2-binary, colorama, crayons, deprecation, websocket-client, docker, wrapt, blindspin, testcontainers, apache-beam
Successfully installed apache-beam-2.25.0.dev0 apipkg-1.5 atomicwrites-1.4.0 attrs-20.1.0 avro-python3-1.9.2.1 blindspin-2.0.1 boto3-1.14.47 botocore-1.17.47 cachetools-3.1.1 certifi-2020.6.20 cffi-1.14.2 chardet-3.0.4 colorama-0.4.3 crayons-0.3.1 crcmod-1.7 deprecation-2.1.0 dill-0.3.1.1 docker-4.3.1 docopt-0.6.2 docutils-0.15.2 execnet-1.7.1 fastavro-0.23.6 fasteners-0.15 freezegun-0.3.15 google-api-core-1.22.1 google-apitools-0.5.31 google-auth-1.20.1 google-cloud-bigquery-1.27.2 google-cloud-bigtable-1.4.0 google-cloud-core-1.4.1 google-cloud-datastore-1.15.0 google-cloud-dlp-1.0.0 google-cloud-language-1.3.0 google-cloud-pubsub-1.7.0 google-cloud-spanner-1.17.1 google-cloud-videointelligence-1.15.0 google-cloud-vision-1.0.0 google-crc32c-0.1.0 google-resumable-media-0.7.1 googleapis-common-protos-1.52.0 grpc-google-iam-v1-0.12.3 grpcio-gcp-0.2.2 hdfs-2.5.8 httplib2-0.17.4 idna-2.10 jmespath-0.10.0 mock-2.0.0 monotonic-1.5 more-itertools-8.4.0 nose-1.3.7 nose-xunitmp-0.4.1 numpy-1.19.1 oauth2client-3.0.0 packaging-20.4 pandas-0.25.3 parameterized-0.7.4 pbr-5.4.5 psycopg2-binary-2.8.5 pyarrow-0.17.1 pyasn1-0.4.8 pyasn1-modules-0.2.8 pycparser-2.20 pydot-1.4.1 pyhamcrest-1.10.1 pymongo-3.11.0 pyparsing-2.4.7 pytest-4.6.11 pytest-forked-1.3.0 pytest-timeout-1.4.2 pytest-xdist-1.34.0 python-dateutil-2.8.1 pytz-2020.1 pyyaml-5.3.1 requests-2.24.0 requests-mock-1.8.0 rsa-4.6 s3transfer-0.3.3 sqlalchemy-1.3.19 tenacity-5.1.5 testcontainers-3.0.3 typing-extensions-3.7.4.2 urllib3-1.25.10 wcwidth-0.2.5 websocket-client-0.57.0 wrapt-1.12.1
> Task :sdks:python:apache_beam:testing:load_tests:run
INFO:apache_beam.runners.portability.stager:Copying Beam SDK "<https://ci-beam.apache.org/job/beam_LoadTests_Python_GBK_Dataflow_Batch/ws/src/sdks/python/build/apache-beam.tar.gz"> to staging location.
WARNING:root:Make sure that locally built Python SDK docker image has Python 3.7 interpreter.
INFO:root:Using Python SDK docker image: apache/beam_python3.7_sdk:2.25.0.dev. If the image is not available at local, we will try to pull from hub.docker.com
INFO:apache_beam.runners.dataflow.internal.apiclient:Defaulting to the temp_location as staging_location: gs://temp-storage-for-perf-tests/loadtests
INFO:apache_beam.internal.gcp.auth:Setting socket default timeout to 60 seconds.
INFO:apache_beam.internal.gcp.auth:socket default timeout is 60.0 seconds.
INFO:apache_beam.runners.dataflow.internal.apiclient:Starting GCS upload to gs://temp-storage-for-perf-tests/loadtests/load-tests-python-dataflow-batch-gbk-1-0823100158.1598185538.431279/pipeline.pb...
INFO:oauth2client.transport:Attempting refresh to obtain initial access_token
INFO:oauth2client.transport:Attempting refresh to obtain initial access_token
INFO:apache_beam.runners.dataflow.internal.apiclient:Completed GCS upload to gs://temp-storage-for-perf-tests/loadtests/load-tests-python-dataflow-batch-gbk-1-0823100158.1598185538.431279/pipeline.pb in 0 seconds.
INFO:apache_beam.runners.dataflow.internal.apiclient:Starting GCS upload to gs://temp-storage-for-perf-tests/loadtests/load-tests-python-dataflow-batch-gbk-1-0823100158.1598185538.431279/dataflow_python_sdk.tar...
INFO:apache_beam.runners.dataflow.internal.apiclient:Completed GCS upload to gs://temp-storage-for-perf-tests/loadtests/load-tests-python-dataflow-batch-gbk-1-0823100158.1598185538.431279/dataflow_python_sdk.tar in 0 seconds.
WARNING:apache_beam.options.pipeline_options:Discarding unparseable args: ['--iterations=1', '--fanout=1']
WARNING:apache_beam.options.pipeline_options:Discarding unparseable args: ['--iterations=1', '--fanout=1']
INFO:apache_beam.runners.dataflow.internal.apiclient:Create job: <Job
createTime: '2020-08-23T12:25:40.044585Z'
currentStateTime: '1970-01-01T00:00:00Z'
id: '2020-08-23_05_25_38-6915148046458032466'
location: 'us-central1'
name: 'load-tests-python-dataflow-batch-gbk-1-0823100158'
projectId: 'apache-beam-testing'
stageStates: []
startTime: '2020-08-23T12:25:40.044585Z'
steps: []
tempFiles: []
type: TypeValueValuesEnum(JOB_TYPE_BATCH, 1)>
INFO:apache_beam.runners.dataflow.internal.apiclient:Created job with id: [2020-08-23_05_25_38-6915148046458032466]
INFO:apache_beam.runners.dataflow.internal.apiclient:Submitted job: 2020-08-23_05_25_38-6915148046458032466
INFO:apache_beam.runners.dataflow.internal.apiclient:To access the Dataflow monitoring console, please navigate to https://console.cloud.google.com/dataflow/jobs/us-central1/2020-08-23_05_25_38-6915148046458032466?project=apache-beam-testing
INFO:apache_beam.runners.dataflow.dataflow_runner:Job 2020-08-23_05_25_38-6915148046458032466 is in state JOB_STATE_PENDING
INFO:apache_beam.runners.dataflow.dataflow_runner:2020-08-23T12:25:42.471Z: JOB_MESSAGE_BASIC: Worker configuration: n1-standard-1 in us-central1-f.
INFO:apache_beam.runners.dataflow.dataflow_runner:2020-08-23T12:25:42.776Z: JOB_MESSAGE_ERROR: Workflow failed. Causes: The Compute Engine API has not fully initialized. Please try again in a few minutes., Unable to get information for region us-central1.
INFO:apache_beam.runners.dataflow.dataflow_runner:2020-08-23T12:25:42.803Z: JOB_MESSAGE_DETAILED: Cleaning up.
INFO:apache_beam.runners.dataflow.dataflow_runner:2020-08-23T12:25:42.845Z: JOB_MESSAGE_BASIC: Worker pool stopped.
Traceback (most recent call last):
File "/usr/lib/python3.7/runpy.py", line 193, in _run_module_as_main
"__main__", mod_spec)
File "/usr/lib/python3.7/runpy.py", line 85, in _run_code
exec(code, run_globals)
File "<https://ci-beam.apache.org/job/beam_LoadTests_Python_GBK_Dataflow_Batch/ws/src/sdks/python/apache_beam/testing/load_tests/group_by_key_test.py",> line 120, in <module>
GroupByKeyTest().run()
File "<https://ci-beam.apache.org/job/beam_LoadTests_Python_GBK_Dataflow_Batch/ws/src/sdks/python/apache_beam/testing/load_tests/load_test.py",> line 152, in run
self.result.wait_until_finish(duration=self.timeout_ms)
File "<https://ci-beam.apache.org/job/beam_LoadTests_Python_GBK_Dataflow_Batch/ws/src/sdks/python/apache_beam/runners/dataflow/dataflow_runner.py",> line 1625, in wait_until_finish
'Job did not reach to a terminal state after waiting indefinitely.')
AssertionError: Job did not reach to a terminal state after waiting indefinitely.
> Task :sdks:python:apache_beam:testing:load_tests:run FAILED
FAILURE: Build failed with an exception.
* Where:
Build file '<https://ci-beam.apache.org/job/beam_LoadTests_Python_GBK_Dataflow_Batch/ws/src/sdks/python/apache_beam/testing/load_tests/build.gradle'> line: 58
* What went wrong:
Execution failed for task ':sdks:python:apache_beam:testing:load_tests:run'.
> error occurred
* Try:
Run with --stacktrace option to get the stack trace. Run with --info or --debug option to get more log output. Run with --scan to get full insights.
* Get more help at https://help.gradle.org
Deprecated Gradle features were used in this build, making it incompatible with Gradle 6.0.
Use '--warning-mode all' to show the individual deprecation warnings.
See https://docs.gradle.org/5.2.1/userguide/command_line_interface.html#sec:command_line_warnings
BUILD FAILED in 1m 32s
5 actionable tasks: 5 executed
Publishing build scan...
https://gradle.com/s/5l2xujrmfydok
Build step 'Invoke Gradle script' changed build result to FAILURE
Build step 'Invoke Gradle script' marked build as failure
---------------------------------------------------------------------
To unsubscribe, e-mail: builds-unsubscribe@beam.apache.org
For additional commands, e-mail: builds-help@beam.apache.org
Build failed in Jenkins: beam_LoadTests_Python_GBK_Dataflow_Batch
#448
Posted by Apache Jenkins Server <je...@builds.apache.org>.
See <https://ci-beam.apache.org/job/beam_LoadTests_Python_GBK_Dataflow_Batch/448/display/redirect?page=changes>
Changes:
[Udi Meiri] Color Jenkins logs support
[ningk] Added a whitespace lint precommit job.
[ningk] Removed trailing whitespaces from all markdown and gradle build files.
[ningk] Updated jenkins precommit job README, added comments of what needs to be
[ningk] Removed trailing whitespaces from HEAD changes
[Alan Myrvold] [BEAM-10049] Add licenses for go dependencies in python, java, and go
[Robin Qiu] Fix bug in JoinScanWithRefConverter
[noreply] Propagate BigQuery streaming insert throttled time to Dataflow worker in
[tysonjh] [BEAM-10751] Revert "Extending archiveJunit post-commit task with
[noreply] [BEAM-10764] Make is_in_ipython robust (#12641)
[noreply] [BEAM-10766] Fix flake where ByteString coercion could modify cached
[ningk] [BEAM-10771] Added Whitespacelint job to pull request template
[noreply] Use setCoder, not setSchema (#12662)
[noreply] [BEAM-10703] Prepare Dataflow Java runner for shardable states (#12578)
[noreply] [BEAM-10549] Improve runtime type checking performance for the Python
[Kyle Weaver] [BEAM-10460] Remove SparkPortableExecutionTest altogether.
[noreply] [BEAM-10788] Also disable immutability checking for transforms within
[noreply] [BEAM-5715, BEAM-8862, BEAM-8702] Removes all references to grpc_all and
[noreply] [BEAM-10761] Prefer TestPubsub#assertSubscriptionEventuallyExists when
[noreply] [BEAM-10654] Implemented ExternalSchemaIOTransformRegistrar for jdbc
[noreply] Merge pull request #12580 from [BEAM-2855] nexmark python suite
[noreply] [BEAM-9918] Adding tests and documentation to xlang components (#12667)
------------------------------------------
[...truncated 26.55 KB...]
Collecting grpcio-gcp<1,>=0.2.2
Using cached grpcio_gcp-0.2.2-py2.py3-none-any.whl (9.4 kB)
Collecting google-cloud-dlp<2,>=0.12.0
Using cached google_cloud_dlp-1.0.0-py2.py3-none-any.whl (169 kB)
Collecting google-cloud-language<2,>=1.3.0
Using cached google_cloud_language-1.3.0-py2.py3-none-any.whl (83 kB)
Collecting google-cloud-videointelligence<2,>=1.8.0
Using cached google_cloud_videointelligence-1.15.0-py2.py3-none-any.whl (180 kB)
Collecting google-cloud-vision<2,>=0.38.0
Using cached google_cloud_vision-1.0.0-py2.py3-none-any.whl (435 kB)
Collecting freezegun>=0.3.12
Using cached freezegun-0.3.15-py2.py3-none-any.whl (14 kB)
Collecting nose>=1.3.7
Using cached nose-1.3.7-py3-none-any.whl (154 kB)
Processing /home/jenkins/.cache/pip/wheels/2e/29/a9/431158315f33abeaad2905460f5ffb18fc30f7ed7c66c47dee/nose_xunitmp-0.4.1-py3-none-any.whl
Collecting parameterized<0.8.0,>=0.7.1
Using cached parameterized-0.7.4-py2.py3-none-any.whl (25 kB)
Collecting pyhamcrest!=1.10.0,<2.0.0,>=1.9
Using cached PyHamcrest-1.10.1-py3-none-any.whl (48 kB)
Processing /home/jenkins/.cache/pip/wheels/5e/03/1e/e1e954795d6f35dfc7b637fe2277bff021303bd9570ecea653/PyYAML-5.3.1-cp37-cp37m-linux_x86_64.whl
Collecting requests_mock<2.0,>=1.7
Using cached requests_mock-1.8.0-py2.py3-none-any.whl (23 kB)
Collecting tenacity<6.0,>=5.0.2
Using cached tenacity-5.1.5-py2.py3-none-any.whl (34 kB)
Collecting pytest<5.0,>=4.4.0
Using cached pytest-4.6.11-py2.py3-none-any.whl (231 kB)
Collecting pytest-xdist<2,>=1.29.0
Using cached pytest_xdist-1.34.0-py2.py3-none-any.whl (36 kB)
Collecting pytest-timeout<2,>=1.3.3
Using cached pytest_timeout-1.4.2-py2.py3-none-any.whl (10 kB)
Collecting pandas<1,>=0.25.2
Using cached pandas-0.25.3-cp37-cp37m-manylinux1_x86_64.whl (10.4 MB)
Collecting sqlalchemy<2.0,>=1.3
Using cached SQLAlchemy-1.3.19-cp37-cp37m-manylinux2010_x86_64.whl (1.3 MB)
Collecting psycopg2-binary<3.0.0,>=2.8.5
Using cached psycopg2_binary-2.8.5-cp37-cp37m-manylinux1_x86_64.whl (2.9 MB)
Processing /home/jenkins/.cache/pip/wheels/22/11/6e/126cbd2f544f9966ee22e074e5a3b7ab9b22bb2d4a6217e599/testcontainers-3.0.3-py2.py3-none-any.whl
Requirement already satisfied: six>=1.5.2 in <https://ci-beam.apache.org/job/beam_LoadTests_Python_GBK_Dataflow_Batch/ws/src/build/gradleenv/1329484227/lib/python3.7/site-packages> (from grpcio<2,>=1.29.0->apache-beam==2.25.0.dev0) (1.15.0)
Processing /home/jenkins/.cache/pip/wheels/9b/04/dd/7daf4150b6d9b12949298737de9431a324d4b797ffd63f526e/docopt-0.6.2-py2.py3-none-any.whl
Collecting pbr>=0.11
Using cached pbr-5.4.5-py2.py3-none-any.whl (110 kB)
Collecting pyasn1-modules>=0.0.5
Using cached pyasn1_modules-0.2.8-py2.py3-none-any.whl (155 kB)
Collecting pyasn1>=0.1.7
Using cached pyasn1-0.4.8-py2.py3-none-any.whl (77 kB)
Collecting rsa>=3.1.4
Using cached rsa-4.6-py3-none-any.whl (47 kB)
Requirement already satisfied: setuptools in <https://ci-beam.apache.org/job/beam_LoadTests_Python_GBK_Dataflow_Batch/ws/src/build/gradleenv/1329484227/lib/python3.7/site-packages> (from protobuf<4,>=3.12.2->apache-beam==2.25.0.dev0) (49.6.0)
Collecting pyparsing>=2.1.4
Using cached pyparsing-2.4.7-py2.py3-none-any.whl (67 kB)
Collecting chardet<4,>=3.0.2
Using cached chardet-3.0.4-py2.py3-none-any.whl (133 kB)
Collecting certifi>=2017.4.17
Using cached certifi-2020.6.20-py2.py3-none-any.whl (156 kB)
Collecting idna<3,>=2.5
Using cached idna-2.10-py2.py3-none-any.whl (58 kB)
Collecting urllib3!=1.25.0,!=1.25.1,<1.26,>=1.21.1
Using cached urllib3-1.25.10-py2.py3-none-any.whl (127 kB)
Collecting s3transfer<0.4.0,>=0.3.0
Using cached s3transfer-0.3.3-py2.py3-none-any.whl (69 kB)
Collecting botocore<1.18.0,>=1.17.47
Using cached botocore-1.17.47-py2.py3-none-any.whl (6.5 MB)
Collecting jmespath<1.0.0,>=0.7.1
Using cached jmespath-0.10.0-py2.py3-none-any.whl (24 kB)
Collecting fasteners>=0.14
Using cached fasteners-0.15-py2.py3-none-any.whl (23 kB)
Collecting google-api-core[grpc]<2.0.0dev,>=1.14.0
Using cached google_api_core-1.22.1-py2.py3-none-any.whl (91 kB)
Processing /home/jenkins/.cache/pip/wheels/b9/ee/67/2e444183030cb8d31ce8b34cee34a7afdbd3ba5959ea846380/grpc_google_iam_v1-0.12.3-py3-none-any.whl
Collecting google-resumable-media<2.0dev,>=0.5.0
Using cached google_resumable_media-0.7.1-py2.py3-none-any.whl (42 kB)
Requirement already satisfied: importlib-metadata>=0.12; python_version < "3.8" in <https://ci-beam.apache.org/job/beam_LoadTests_Python_GBK_Dataflow_Batch/ws/src/build/gradleenv/1329484227/lib/python3.7/site-packages> (from pytest<5.0,>=4.4.0->apache-beam==2.25.0.dev0) (1.7.0)
Collecting more-itertools>=4.0.0; python_version > "2.7"
Using cached more_itertools-8.4.0-py3-none-any.whl (43 kB)
Collecting atomicwrites>=1.0
Using cached atomicwrites-1.4.0-py2.py3-none-any.whl (6.8 kB)
Requirement already satisfied: pluggy<1.0,>=0.12 in <https://ci-beam.apache.org/job/beam_LoadTests_Python_GBK_Dataflow_Batch/ws/src/build/gradleenv/1329484227/lib/python3.7/site-packages> (from pytest<5.0,>=4.4.0->apache-beam==2.25.0.dev0) (0.13.1)
Collecting attrs>=17.4.0
Using cached attrs-20.1.0-py2.py3-none-any.whl (49 kB)
Collecting packaging
Using cached packaging-20.4-py2.py3-none-any.whl (37 kB)
Requirement already satisfied: py>=1.5.0 in <https://ci-beam.apache.org/job/beam_LoadTests_Python_GBK_Dataflow_Batch/ws/src/build/gradleenv/1329484227/lib/python3.7/site-packages> (from pytest<5.0,>=4.4.0->apache-beam==2.25.0.dev0) (1.9.0)
Collecting wcwidth
Using cached wcwidth-0.2.5-py2.py3-none-any.whl (30 kB)
Collecting execnet>=1.1
Using cached execnet-1.7.1-py2.py3-none-any.whl (39 kB)
Collecting pytest-forked
Using cached pytest_forked-1.3.0-py2.py3-none-any.whl (4.7 kB)
Collecting deprecation
Using cached deprecation-2.1.0-py2.py3-none-any.whl (11 kB)
Processing /home/jenkins/.cache/pip/wheels/62/76/4c/aa25851149f3f6d9785f6c869387ad82b3fd37582fa8147ac6/wrapt-1.12.1-cp37-cp37m-linux_x86_64.whl
Processing /home/jenkins/.cache/pip/wheels/4e/29/41/2a34b96f3d4bf9ab8ccaac5d86db4334fa17d79e7027a5b86f/blindspin-2.0.1-py3-none-any.whl
Collecting crayons
Using cached crayons-0.3.1-py2.py3-none-any.whl (4.6 kB)
Collecting docker
Using cached docker-4.3.1-py2.py3-none-any.whl (145 kB)
Collecting docutils<0.16,>=0.10
Using cached docutils-0.15.2-py3-none-any.whl (547 kB)
Collecting monotonic>=0.1
Using cached monotonic-1.5-py2.py3-none-any.whl (5.3 kB)
Collecting googleapis-common-protos<2.0dev,>=1.6.0
Using cached googleapis_common_protos-1.52.0-py2.py3-none-any.whl (100 kB)
Collecting google-crc32c<0.2dev,>=0.1.0; python_version >= "3.5"
Using cached google_crc32c-0.1.0-cp37-cp37m-manylinux2010_x86_64.whl (39 kB)
Requirement already satisfied: zipp>=0.5 in <https://ci-beam.apache.org/job/beam_LoadTests_Python_GBK_Dataflow_Batch/ws/src/build/gradleenv/1329484227/lib/python3.7/site-packages> (from importlib-metadata>=0.12; python_version < "3.8"->pytest<5.0,>=4.4.0->apache-beam==2.25.0.dev0) (3.1.0)
Collecting apipkg>=1.4
Using cached apipkg-1.5-py2.py3-none-any.whl (4.9 kB)
Collecting colorama
Using cached colorama-0.4.3-py2.py3-none-any.whl (15 kB)
Collecting websocket-client>=0.32.0
Using cached websocket_client-0.57.0-py2.py3-none-any.whl (200 kB)
Collecting cffi>=1.0.0
Using cached cffi-1.14.2-cp37-cp37m-manylinux1_x86_64.whl (401 kB)
Collecting pycparser
Using cached pycparser-2.20-py2.py3-none-any.whl (112 kB)
Building wheels for collected packages: apache-beam
Building wheel for apache-beam (setup.py): started
Building wheel for apache-beam (setup.py): finished with status 'done'
Created wheel for apache-beam: filename=apache_beam-2.25.0.dev0-py3-none-any.whl size=2197167 sha256=335a47bedb56b3135d8634d68c1168b476fda85454dbc22c57c487a04ec7d69f
Stored in directory: /home/jenkins/.cache/pip/wheels/77/c3/45/f8c936a7742001e3bc0d0f63813dd268a96c932cc292dc2aae
Successfully built apache-beam
Installing collected packages: crcmod, dill, pytz, fastavro, docopt, chardet, certifi, idna, urllib3, requests, hdfs, httplib2, pbr, mock, numpy, pymongo, pyasn1, pyasn1-modules, rsa, oauth2client, pyparsing, pydot, python-dateutil, typing-extensions, avro-python3, pyarrow, docutils, jmespath, botocore, s3transfer, boto3, cachetools, monotonic, fasteners, google-apitools, google-auth, googleapis-common-protos, google-api-core, google-cloud-core, google-cloud-datastore, grpc-google-iam-v1, google-cloud-pubsub, pycparser, cffi, google-crc32c, google-resumable-media, google-cloud-bigquery, google-cloud-bigtable, google-cloud-spanner, grpcio-gcp, google-cloud-dlp, google-cloud-language, google-cloud-videointelligence, google-cloud-vision, freezegun, nose, nose-xunitmp, parameterized, pyhamcrest, pyyaml, requests-mock, tenacity, more-itertools, atomicwrites, attrs, packaging, wcwidth, pytest, apipkg, execnet, pytest-forked, pytest-xdist, pytest-timeout, pandas, sqlalchemy, psycopg2-binary, deprecation, wrapt, blindspin, colorama, crayons, websocket-client, docker, testcontainers, apache-beam
Successfully installed apache-beam-2.25.0.dev0 apipkg-1.5 atomicwrites-1.4.0 attrs-20.1.0 avro-python3-1.9.2.1 blindspin-2.0.1 boto3-1.14.47 botocore-1.17.47 cachetools-3.1.1 certifi-2020.6.20 cffi-1.14.2 chardet-3.0.4 colorama-0.4.3 crayons-0.3.1 crcmod-1.7 deprecation-2.1.0 dill-0.3.1.1 docker-4.3.1 docopt-0.6.2 docutils-0.15.2 execnet-1.7.1 fastavro-0.23.6 fasteners-0.15 freezegun-0.3.15 google-api-core-1.22.1 google-apitools-0.5.31 google-auth-1.20.1 google-cloud-bigquery-1.27.2 google-cloud-bigtable-1.4.0 google-cloud-core-1.4.1 google-cloud-datastore-1.15.0 google-cloud-dlp-1.0.0 google-cloud-language-1.3.0 google-cloud-pubsub-1.7.0 google-cloud-spanner-1.17.1 google-cloud-videointelligence-1.15.0 google-cloud-vision-1.0.0 google-crc32c-0.1.0 google-resumable-media-0.7.1 googleapis-common-protos-1.52.0 grpc-google-iam-v1-0.12.3 grpcio-gcp-0.2.2 hdfs-2.5.8 httplib2-0.17.4 idna-2.10 jmespath-0.10.0 mock-2.0.0 monotonic-1.5 more-itertools-8.4.0 nose-1.3.7 nose-xunitmp-0.4.1 numpy-1.19.1 oauth2client-3.0.0 packaging-20.4 pandas-0.25.3 parameterized-0.7.4 pbr-5.4.5 psycopg2-binary-2.8.5 pyarrow-0.17.1 pyasn1-0.4.8 pyasn1-modules-0.2.8 pycparser-2.20 pydot-1.4.1 pyhamcrest-1.10.1 pymongo-3.11.0 pyparsing-2.4.7 pytest-4.6.11 pytest-forked-1.3.0 pytest-timeout-1.4.2 pytest-xdist-1.34.0 python-dateutil-2.8.1 pytz-2020.1 pyyaml-5.3.1 requests-2.24.0 requests-mock-1.8.0 rsa-4.6 s3transfer-0.3.3 sqlalchemy-1.3.19 tenacity-5.1.5 testcontainers-3.0.3 typing-extensions-3.7.4.2 urllib3-1.25.10 wcwidth-0.2.5 websocket-client-0.57.0 wrapt-1.12.1
> Task :sdks:python:apache_beam:testing:load_tests:run
INFO:apache_beam.runners.portability.stager:Copying Beam SDK "<https://ci-beam.apache.org/job/beam_LoadTests_Python_GBK_Dataflow_Batch/ws/src/sdks/python/build/apache-beam.tar.gz"> to staging location.
WARNING:root:Make sure that locally built Python SDK docker image has Python 3.7 interpreter.
INFO:root:Using Python SDK docker image: apache/beam_python3.7_sdk:2.25.0.dev. If the image is not available at local, we will try to pull from hub.docker.com
INFO:apache_beam.runners.dataflow.internal.apiclient:Defaulting to the temp_location as staging_location: gs://temp-storage-for-perf-tests/loadtests
INFO:apache_beam.internal.gcp.auth:Setting socket default timeout to 60 seconds.
INFO:apache_beam.internal.gcp.auth:socket default timeout is 60.0 seconds.
INFO:apache_beam.runners.dataflow.internal.apiclient:Starting GCS upload to gs://temp-storage-for-perf-tests/loadtests/load-tests-python-dataflow-batch-gbk-1-0822100138.1598099147.720610/pipeline.pb...
INFO:oauth2client.transport:Attempting refresh to obtain initial access_token
INFO:oauth2client.transport:Attempting refresh to obtain initial access_token
INFO:apache_beam.runners.dataflow.internal.apiclient:Completed GCS upload to gs://temp-storage-for-perf-tests/loadtests/load-tests-python-dataflow-batch-gbk-1-0822100138.1598099147.720610/pipeline.pb in 0 seconds.
INFO:apache_beam.runners.dataflow.internal.apiclient:Starting GCS upload to gs://temp-storage-for-perf-tests/loadtests/load-tests-python-dataflow-batch-gbk-1-0822100138.1598099147.720610/dataflow_python_sdk.tar...
INFO:apache_beam.runners.dataflow.internal.apiclient:Completed GCS upload to gs://temp-storage-for-perf-tests/loadtests/load-tests-python-dataflow-batch-gbk-1-0822100138.1598099147.720610/dataflow_python_sdk.tar in 0 seconds.
WARNING:apache_beam.options.pipeline_options:Discarding unparseable args: ['--iterations=1', '--fanout=1']
WARNING:apache_beam.options.pipeline_options:Discarding unparseable args: ['--iterations=1', '--fanout=1']
INFO:apache_beam.runners.dataflow.internal.apiclient:Create job: <Job
createTime: '2020-08-22T12:25:49.377798Z'
currentStateTime: '1970-01-01T00:00:00Z'
id: '2020-08-22_05_25_48-16109003915206467853'
location: 'us-central1'
name: 'load-tests-python-dataflow-batch-gbk-1-0822100138'
projectId: 'apache-beam-testing'
stageStates: []
startTime: '2020-08-22T12:25:49.377798Z'
steps: []
tempFiles: []
type: TypeValueValuesEnum(JOB_TYPE_BATCH, 1)>
INFO:apache_beam.runners.dataflow.internal.apiclient:Created job with id: [2020-08-22_05_25_48-16109003915206467853]
INFO:apache_beam.runners.dataflow.internal.apiclient:Submitted job: 2020-08-22_05_25_48-16109003915206467853
INFO:apache_beam.runners.dataflow.internal.apiclient:To access the Dataflow monitoring console, please navigate to https://console.cloud.google.com/dataflow/jobs/us-central1/2020-08-22_05_25_48-16109003915206467853?project=apache-beam-testing
INFO:apache_beam.runners.dataflow.dataflow_runner:Job 2020-08-22_05_25_48-16109003915206467853 is in state JOB_STATE_PENDING
INFO:apache_beam.runners.dataflow.dataflow_runner:2020-08-22T12:25:51.784Z: JOB_MESSAGE_BASIC: Worker configuration: n1-standard-1 in us-central1-f.
INFO:apache_beam.runners.dataflow.dataflow_runner:2020-08-22T12:25:52.592Z: JOB_MESSAGE_DETAILED: Expanding CoGroupByKey operations into optimizable parts.
INFO:apache_beam.runners.dataflow.dataflow_runner:2020-08-22T12:25:52.617Z: JOB_MESSAGE_DEBUG: Combiner lifting skipped for step GroupByKey 0: GroupByKey not followed by a combiner.
INFO:apache_beam.runners.dataflow.dataflow_runner:2020-08-22T12:25:52.644Z: JOB_MESSAGE_DETAILED: Expanding GroupByKey operations into optimizable parts.
INFO:apache_beam.runners.dataflow.dataflow_runner:2020-08-22T12:25:52.669Z: JOB_MESSAGE_DETAILED: Lifting ValueCombiningMappingFns into MergeBucketsMappingFns
INFO:apache_beam.runners.dataflow.dataflow_runner:2020-08-22T12:25:52.714Z: JOB_MESSAGE_DEBUG: Annotating graph with Autotuner information.
INFO:apache_beam.runners.dataflow.dataflow_runner:2020-08-22T12:25:52.750Z: JOB_MESSAGE_DETAILED: Fusing adjacent ParDo, Read, Write, and Flatten operations
INFO:apache_beam.runners.dataflow.dataflow_runner:2020-08-22T12:25:52.779Z: JOB_MESSAGE_DETAILED: Fusing consumer Measure time: Start into Read
INFO:apache_beam.runners.dataflow.dataflow_runner:2020-08-22T12:25:52.802Z: JOB_MESSAGE_DETAILED: Fusing consumer Assign timestamps into Measure time: Start
INFO:apache_beam.runners.dataflow.dataflow_runner:2020-08-22T12:25:52.839Z: JOB_MESSAGE_DETAILED: Fusing consumer GroupByKey 0/Reify into Assign timestamps
INFO:apache_beam.runners.dataflow.dataflow_runner:2020-08-22T12:25:52.864Z: JOB_MESSAGE_DETAILED: Fusing consumer GroupByKey 0/Write into GroupByKey 0/Reify
INFO:apache_beam.runners.dataflow.dataflow_runner:2020-08-22T12:25:52.887Z: JOB_MESSAGE_DETAILED: Fusing consumer GroupByKey 0/GroupByWindow into GroupByKey 0/Read
INFO:apache_beam.runners.dataflow.dataflow_runner:2020-08-22T12:25:52.912Z: JOB_MESSAGE_DETAILED: Fusing consumer Ungroup 0 into GroupByKey 0/GroupByWindow
INFO:apache_beam.runners.dataflow.dataflow_runner:2020-08-22T12:25:52.935Z: JOB_MESSAGE_DETAILED: Fusing consumer Measure latency into Ungroup 0
INFO:apache_beam.runners.dataflow.dataflow_runner:2020-08-22T12:25:52.960Z: JOB_MESSAGE_DETAILED: Fusing consumer Measure time: End 0 into Measure latency
INFO:apache_beam.runners.dataflow.dataflow_runner:2020-08-22T12:25:52.983Z: JOB_MESSAGE_DEBUG: Workflow config is missing a default resource spec.
INFO:apache_beam.runners.dataflow.dataflow_runner:2020-08-22T12:25:53.006Z: JOB_MESSAGE_DEBUG: Adding StepResource setup and teardown to workflow graph.
INFO:apache_beam.runners.dataflow.dataflow_runner:2020-08-22T12:25:53.129Z: JOB_MESSAGE_DEBUG: Adding workflow start and stop steps.
INFO:apache_beam.runners.dataflow.dataflow_runner:2020-08-22T12:25:53.158Z: JOB_MESSAGE_DEBUG: Assigning stage ids.
INFO:apache_beam.runners.dataflow.dataflow_runner:2020-08-22T12:25:53.264Z: JOB_MESSAGE_DEBUG: Executing wait step start13
INFO:apache_beam.runners.dataflow.dataflow_runner:2020-08-22T12:25:53.315Z: JOB_MESSAGE_BASIC: Executing operation GroupByKey 0/Create
INFO:apache_beam.runners.dataflow.dataflow_runner:2020-08-22T12:25:53.363Z: JOB_MESSAGE_DEBUG: Starting **** pool setup.
INFO:apache_beam.runners.dataflow.dataflow_runner:2020-08-22T12:25:53.383Z: JOB_MESSAGE_BASIC: Starting 5 ****s in us-central1-f...
INFO:apache_beam.runners.dataflow.dataflow_runner:2020-08-22T12:25:53.411Z: JOB_MESSAGE_BASIC: Finished operation GroupByKey 0/Create
INFO:apache_beam.runners.dataflow.dataflow_runner:2020-08-22T12:25:53.470Z: JOB_MESSAGE_DEBUG: Value "GroupByKey 0/Session" materialized.
INFO:apache_beam.runners.dataflow.dataflow_runner:2020-08-22T12:25:53.522Z: JOB_MESSAGE_BASIC: Executing operation Read+Measure time: Start+Assign timestamps+GroupByKey 0/Reify+GroupByKey 0/Write
INFO:apache_beam.runners.dataflow.dataflow_runner:Job 2020-08-22_05_25_48-16109003915206467853 is in state JOB_STATE_RUNNING
INFO:apache_beam.runners.dataflow.dataflow_runner:2020-08-22T12:26:15.769Z: JOB_MESSAGE_WARNING: Your project already contains 100 Dataflow-created metric descriptors and Stackdriver will not create new Dataflow custom metrics for this job. Each unique user-defined metric name (independent of the DoFn in which it is defined) produces a new metric descriptor. To delete old / unused metric descriptors see https://developers.google.com/apis-explorer/#p/monitoring/v3/monitoring.projects.metricDescriptors.list and https://developers.google.com/apis-explorer/#p/monitoring/v3/monitoring.projects.metricDescriptors.delete
INFO:apache_beam.runners.dataflow.dataflow_runner:2020-08-22T12:26:19.826Z: JOB_MESSAGE_DETAILED: Autoscaling: Raised the number of ****s to 1 based on the rate of progress in the currently running stage(s).
INFO:apache_beam.runners.dataflow.dataflow_runner:2020-08-22T12:26:19.861Z: JOB_MESSAGE_DETAILED: Resized **** pool to 1, though goal was 5. This could be a quota issue.
INFO:apache_beam.runners.dataflow.dataflow_runner:2020-08-22T12:26:25.224Z: JOB_MESSAGE_DETAILED: Autoscaling: Raised the number of ****s to 5 based on the rate of progress in the currently running stage(s).
INFO:apache_beam.runners.dataflow.dataflow_runner:2020-08-22T12:28:01.713Z: JOB_MESSAGE_DETAILED: Workers have started successfully.
INFO:apache_beam.runners.dataflow.dataflow_runner:2020-08-22T12:28:01.754Z: JOB_MESSAGE_DETAILED: Workers have started successfully.
INFO:apache_beam.runners.dataflow.dataflow_runner:2020-08-22T12:58:55.474Z: JOB_MESSAGE_BASIC: Finished operation Read+Measure time: Start+Assign timestamps+GroupByKey 0/Reify+GroupByKey 0/Write
INFO:apache_beam.runners.dataflow.dataflow_runner:2020-08-22T12:58:55.648Z: JOB_MESSAGE_BASIC: Executing operation GroupByKey 0/Close
INFO:apache_beam.runners.dataflow.dataflow_runner:2020-08-22T12:58:55.836Z: JOB_MESSAGE_BASIC: Finished operation GroupByKey 0/Close
INFO:apache_beam.runners.dataflow.dataflow_runner:2020-08-22T12:58:55.894Z: JOB_MESSAGE_BASIC: Executing operation GroupByKey 0/Read+GroupByKey 0/GroupByWindow+Ungroup 0+Measure latency+Measure time: End 0
INFO:apache_beam.runners.dataflow.dataflow_runner:2020-08-22T13:03:27.252Z: JOB_MESSAGE_BASIC: Finished operation GroupByKey 0/Read+GroupByKey 0/GroupByWindow+Ungroup 0+Measure latency+Measure time: End 0
INFO:apache_beam.runners.dataflow.dataflow_runner:2020-08-22T13:03:27.453Z: JOB_MESSAGE_DEBUG: Executing success step success11
INFO:apache_beam.runners.dataflow.dataflow_runner:2020-08-22T13:03:27.518Z: JOB_MESSAGE_DETAILED: Cleaning up.
INFO:apache_beam.runners.dataflow.dataflow_runner:2020-08-22T13:03:27.565Z: JOB_MESSAGE_DEBUG: Starting **** pool teardown.
INFO:apache_beam.runners.dataflow.dataflow_runner:2020-08-22T13:03:27.592Z: JOB_MESSAGE_BASIC: Stopping **** pool...
INFO:apache_beam.runners.dataflow.dataflow_runner:2020-08-22T13:04:23.105Z: JOB_MESSAGE_DETAILED: Autoscaling: Resized **** pool from 5 to 0.
INFO:apache_beam.runners.dataflow.dataflow_runner:2020-08-22T13:04:23.152Z: JOB_MESSAGE_BASIC: Worker pool stopped.
INFO:apache_beam.runners.dataflow.dataflow_runner:2020-08-22T13:04:23.191Z: JOB_MESSAGE_DEBUG: Tearing down pending resources...
INFO:apache_beam.runners.dataflow.dataflow_runner:Job 2020-08-22_05_25_48-16109003915206467853 is in state JOB_STATE_DONE
INFO:apache_beam.testing.load_tests.load_test_metrics_utils:Load test results for test: e42fbe66438142a294da96dc2039a4fc and timestamp: 1598101471.4792202:
INFO:apache_beam.testing.load_tests.load_test_metrics_utils:Metric: python_dataflow_batch_gbk_1_runtime Value: 1934
INFO:apache_beam.testing.load_tests.load_test_metrics_utils:Metric: python_dataflow_batch_gbk_1_measure_latency_count_latency Value: 512
INFO:apache_beam.testing.load_tests.load_test_metrics_utils:Metric: python_dataflow_batch_gbk_1_measure_latency_max_latency Value: 9224970138257086
INFO:apache_beam.testing.load_tests.load_test_metrics_utils:Metric: python_dataflow_batch_gbk_1_measure_latency_min_latency Value: 9224970137990876
Traceback (most recent call last):
File "/usr/lib/python3.7/runpy.py", line 193, in _run_module_as_main
"__main__", mod_spec)
File "/usr/lib/python3.7/runpy.py", line 85, in _run_code
exec(code, run_globals)
File "<https://ci-beam.apache.org/job/beam_LoadTests_Python_GBK_Dataflow_Batch/ws/src/sdks/python/apache_beam/testing/load_tests/group_by_key_test.py",> line 120, in <module>
GroupByKeyTest().run()
File "<https://ci-beam.apache.org/job/beam_LoadTests_Python_GBK_Dataflow_Batch/ws/src/sdks/python/apache_beam/testing/load_tests/load_test.py",> line 153, in run
self._metrics_monitor.publish_metrics(self.result)
File "<https://ci-beam.apache.org/job/beam_LoadTests_Python_GBK_Dataflow_Batch/ws/src/sdks/python/apache_beam/testing/load_tests/load_test_metrics_utils.py",> line 227, in publish_metrics
publisher.publish(insert_dicts)
File "<https://ci-beam.apache.org/job/beam_LoadTests_Python_GBK_Dataflow_Batch/ws/src/sdks/python/apache_beam/testing/load_tests/load_test_metrics_utils.py",> line 375, in publish
% (result[METRICS_TYPE_LABEL], result[VALUE_LABEL])
TypeError: %d format: a number is required, not NoneType
> Task :sdks:python:apache_beam:testing:load_tests:run FAILED
FAILURE: Build failed with an exception.
* Where:
Build file '<https://ci-beam.apache.org/job/beam_LoadTests_Python_GBK_Dataflow_Batch/ws/src/sdks/python/apache_beam/testing/load_tests/build.gradle'> line: 58
* What went wrong:
Execution failed for task ':sdks:python:apache_beam:testing:load_tests:run'.
> error occurred
* Try:
Run with --stacktrace option to get the stack trace. Run with --info or --debug option to get more log output. Run with --scan to get full insights.
* Get more help at https://help.gradle.org
Deprecated Gradle features were used in this build, making it incompatible with Gradle 6.0.
Use '--warning-mode all' to show the individual deprecation warnings.
See https://docs.gradle.org/5.2.1/userguide/command_line_interface.html#sec:command_line_warnings
BUILD FAILED in 40m 9s
5 actionable tasks: 5 executed
Publishing build scan...
https://gradle.com/s/lpy2iuih2z2le
Build step 'Invoke Gradle script' changed build result to FAILURE
Build step 'Invoke Gradle script' marked build as failure
---------------------------------------------------------------------
To unsubscribe, e-mail: builds-unsubscribe@beam.apache.org
For additional commands, e-mail: builds-help@beam.apache.org
Build failed in Jenkins: beam_LoadTests_Python_GBK_Dataflow_Batch
#447
Posted by Apache Jenkins Server <je...@builds.apache.org>.
See <https://ci-beam.apache.org/job/beam_LoadTests_Python_GBK_Dataflow_Batch/447/display/redirect?page=changes>
Changes:
[david.janicek] [BEAM-10292] LocalFileSystem.matchNewResource method throws
[Kamil Wasilewski] [BEAM-10674] Python CoGBK: Remove unnecessary step. Adjust parameters to
[Kamil Wasilewski] [BEAM-10674] Python CoGBK: Add streaming job
[Kyle Weaver] [BEAM-9118] Increase portable_runner_test timeout.
[Kyle Weaver] [BEAM-10770] Remove DataflowPortabilityApiUnsupported annotation.
[daniel.o.programmer] [BEAM-3301] Consolidating starcgen method names in graph/fn.go and
[daniel.o.programmer] [BEAM-10289] Fixing miscalculated SDF split fraction.
[david.janicek] [BEAM-10292] changes after review
[noreply] [BEAM-10701] Generate Codecov XML (#12566)
[noreply] [BEAM-9979] Fix read index being reported to be reset after any metrics
[noreply] [BEAM-9546] DataframeTransform can now consume a schema-aware
------------------------------------------
[...truncated 26.33 KB...]
Collecting grpcio-gcp<1,>=0.2.2
Using cached grpcio_gcp-0.2.2-py2.py3-none-any.whl (9.4 kB)
Collecting google-cloud-dlp<2,>=0.12.0
Using cached google_cloud_dlp-1.0.0-py2.py3-none-any.whl (169 kB)
Collecting google-cloud-language<2,>=1.3.0
Using cached google_cloud_language-1.3.0-py2.py3-none-any.whl (83 kB)
Collecting google-cloud-videointelligence<2,>=1.8.0
Using cached google_cloud_videointelligence-1.15.0-py2.py3-none-any.whl (180 kB)
Collecting google-cloud-vision<2,>=0.38.0
Using cached google_cloud_vision-1.0.0-py2.py3-none-any.whl (435 kB)
Collecting freezegun>=0.3.12
Using cached freezegun-0.3.15-py2.py3-none-any.whl (14 kB)
Collecting nose>=1.3.7
Using cached nose-1.3.7-py3-none-any.whl (154 kB)
Processing /home/jenkins/.cache/pip/wheels/2e/29/a9/431158315f33abeaad2905460f5ffb18fc30f7ed7c66c47dee/nose_xunitmp-0.4.1-py3-none-any.whl
Collecting parameterized<0.8.0,>=0.7.1
Using cached parameterized-0.7.4-py2.py3-none-any.whl (25 kB)
Collecting pyhamcrest!=1.10.0,<2.0.0,>=1.9
Using cached PyHamcrest-1.10.1-py3-none-any.whl (48 kB)
Processing /home/jenkins/.cache/pip/wheels/5e/03/1e/e1e954795d6f35dfc7b637fe2277bff021303bd9570ecea653/PyYAML-5.3.1-cp37-cp37m-linux_x86_64.whl
Collecting requests_mock<2.0,>=1.7
Using cached requests_mock-1.8.0-py2.py3-none-any.whl (23 kB)
Collecting tenacity<6.0,>=5.0.2
Using cached tenacity-5.1.5-py2.py3-none-any.whl (34 kB)
Collecting pytest<5.0,>=4.4.0
Using cached pytest-4.6.11-py2.py3-none-any.whl (231 kB)
Collecting pytest-xdist<2,>=1.29.0
Using cached pytest_xdist-1.34.0-py2.py3-none-any.whl (36 kB)
Collecting pytest-timeout<2,>=1.3.3
Using cached pytest_timeout-1.4.2-py2.py3-none-any.whl (10 kB)
Collecting pandas<1,>=0.25.2
Using cached pandas-0.25.3-cp37-cp37m-manylinux1_x86_64.whl (10.4 MB)
Collecting sqlalchemy<2.0,>=1.3
Using cached SQLAlchemy-1.3.19-cp37-cp37m-manylinux2010_x86_64.whl (1.3 MB)
Collecting psycopg2-binary<3.0.0,>=2.8.5
Using cached psycopg2_binary-2.8.5-cp37-cp37m-manylinux1_x86_64.whl (2.9 MB)
Processing /home/jenkins/.cache/pip/wheels/22/11/6e/126cbd2f544f9966ee22e074e5a3b7ab9b22bb2d4a6217e599/testcontainers-3.0.3-py2.py3-none-any.whl
Requirement already satisfied: six>=1.5.2 in <https://ci-beam.apache.org/job/beam_LoadTests_Python_GBK_Dataflow_Batch/ws/src/build/gradleenv/1329484227/lib/python3.7/site-packages> (from grpcio<2,>=1.29.0->apache-beam==2.25.0.dev0) (1.15.0)
Processing /home/jenkins/.cache/pip/wheels/9b/04/dd/7daf4150b6d9b12949298737de9431a324d4b797ffd63f526e/docopt-0.6.2-py2.py3-none-any.whl
Collecting pbr>=0.11
Using cached pbr-5.4.5-py2.py3-none-any.whl (110 kB)
Collecting rsa>=3.1.4
Using cached rsa-4.6-py3-none-any.whl (47 kB)
Collecting pyasn1-modules>=0.0.5
Using cached pyasn1_modules-0.2.8-py2.py3-none-any.whl (155 kB)
Collecting pyasn1>=0.1.7
Using cached pyasn1-0.4.8-py2.py3-none-any.whl (77 kB)
Requirement already satisfied: setuptools in <https://ci-beam.apache.org/job/beam_LoadTests_Python_GBK_Dataflow_Batch/ws/src/build/gradleenv/1329484227/lib/python3.7/site-packages> (from protobuf<4,>=3.12.2->apache-beam==2.25.0.dev0) (49.6.0)
Collecting pyparsing>=2.1.4
Using cached pyparsing-2.4.7-py2.py3-none-any.whl (67 kB)
Collecting certifi>=2017.4.17
Using cached certifi-2020.6.20-py2.py3-none-any.whl (156 kB)
Collecting chardet<4,>=3.0.2
Using cached chardet-3.0.4-py2.py3-none-any.whl (133 kB)
Collecting urllib3!=1.25.0,!=1.25.1,<1.26,>=1.21.1
Using cached urllib3-1.25.10-py2.py3-none-any.whl (127 kB)
Collecting idna<3,>=2.5
Using cached idna-2.10-py2.py3-none-any.whl (58 kB)
Collecting jmespath<1.0.0,>=0.7.1
Using cached jmespath-0.10.0-py2.py3-none-any.whl (24 kB)
Collecting s3transfer<0.4.0,>=0.3.0
Using cached s3transfer-0.3.3-py2.py3-none-any.whl (69 kB)
Collecting botocore<1.18.0,>=1.17.47
Using cached botocore-1.17.47-py2.py3-none-any.whl (6.5 MB)
Collecting fasteners>=0.14
Using cached fasteners-0.15-py2.py3-none-any.whl (23 kB)
Collecting google-api-core[grpc]<2.0.0dev,>=1.14.0
Using cached google_api_core-1.22.1-py2.py3-none-any.whl (91 kB)
Processing /home/jenkins/.cache/pip/wheels/b9/ee/67/2e444183030cb8d31ce8b34cee34a7afdbd3ba5959ea846380/grpc_google_iam_v1-0.12.3-py3-none-any.whl
Collecting google-resumable-media<2.0dev,>=0.5.0
Using cached google_resumable_media-0.7.1-py2.py3-none-any.whl (42 kB)
Collecting attrs>=17.4.0
Using cached attrs-20.1.0-py2.py3-none-any.whl (49 kB)
Collecting more-itertools>=4.0.0; python_version > "2.7"
Using cached more_itertools-8.4.0-py3-none-any.whl (43 kB)
Collecting wcwidth
Using cached wcwidth-0.2.5-py2.py3-none-any.whl (30 kB)
Requirement already satisfied: importlib-metadata>=0.12; python_version < "3.8" in <https://ci-beam.apache.org/job/beam_LoadTests_Python_GBK_Dataflow_Batch/ws/src/build/gradleenv/1329484227/lib/python3.7/site-packages> (from pytest<5.0,>=4.4.0->apache-beam==2.25.0.dev0) (1.7.0)
Requirement already satisfied: pluggy<1.0,>=0.12 in <https://ci-beam.apache.org/job/beam_LoadTests_Python_GBK_Dataflow_Batch/ws/src/build/gradleenv/1329484227/lib/python3.7/site-packages> (from pytest<5.0,>=4.4.0->apache-beam==2.25.0.dev0) (0.13.1)
Collecting atomicwrites>=1.0
Using cached atomicwrites-1.4.0-py2.py3-none-any.whl (6.8 kB)
Collecting packaging
Using cached packaging-20.4-py2.py3-none-any.whl (37 kB)
Requirement already satisfied: py>=1.5.0 in <https://ci-beam.apache.org/job/beam_LoadTests_Python_GBK_Dataflow_Batch/ws/src/build/gradleenv/1329484227/lib/python3.7/site-packages> (from pytest<5.0,>=4.4.0->apache-beam==2.25.0.dev0) (1.9.0)
Collecting execnet>=1.1
Using cached execnet-1.7.1-py2.py3-none-any.whl (39 kB)
Collecting pytest-forked
Using cached pytest_forked-1.3.0-py2.py3-none-any.whl (4.7 kB)
Collecting docker
Using cached docker-4.3.1-py2.py3-none-any.whl (145 kB)
Processing /home/jenkins/.cache/pip/wheels/4e/29/41/2a34b96f3d4bf9ab8ccaac5d86db4334fa17d79e7027a5b86f/blindspin-2.0.1-py3-none-any.whl
Processing /home/jenkins/.cache/pip/wheels/62/76/4c/aa25851149f3f6d9785f6c869387ad82b3fd37582fa8147ac6/wrapt-1.12.1-cp37-cp37m-linux_x86_64.whl
Collecting deprecation
Using cached deprecation-2.1.0-py2.py3-none-any.whl (11 kB)
Collecting crayons
Using cached crayons-0.3.1-py2.py3-none-any.whl (4.6 kB)
Collecting docutils<0.16,>=0.10
Using cached docutils-0.15.2-py3-none-any.whl (547 kB)
Collecting monotonic>=0.1
Using cached monotonic-1.5-py2.py3-none-any.whl (5.3 kB)
Collecting googleapis-common-protos<2.0dev,>=1.6.0
Using cached googleapis_common_protos-1.52.0-py2.py3-none-any.whl (100 kB)
Collecting google-crc32c<0.2dev,>=0.1.0; python_version >= "3.5"
Using cached google_crc32c-0.1.0-cp37-cp37m-manylinux2010_x86_64.whl (39 kB)
Requirement already satisfied: zipp>=0.5 in <https://ci-beam.apache.org/job/beam_LoadTests_Python_GBK_Dataflow_Batch/ws/src/build/gradleenv/1329484227/lib/python3.7/site-packages> (from importlib-metadata>=0.12; python_version < "3.8"->pytest<5.0,>=4.4.0->apache-beam==2.25.0.dev0) (3.1.0)
Collecting apipkg>=1.4
Using cached apipkg-1.5-py2.py3-none-any.whl (4.9 kB)
Collecting websocket-client>=0.32.0
Using cached websocket_client-0.57.0-py2.py3-none-any.whl (200 kB)
Collecting colorama
Using cached colorama-0.4.3-py2.py3-none-any.whl (15 kB)
Collecting cffi>=1.0.0
Using cached cffi-1.14.2-cp37-cp37m-manylinux1_x86_64.whl (401 kB)
Collecting pycparser
Using cached pycparser-2.20-py2.py3-none-any.whl (112 kB)
Building wheels for collected packages: apache-beam
Building wheel for apache-beam (setup.py): started
Building wheel for apache-beam (setup.py): finished with status 'done'
Created wheel for apache-beam: filename=apache_beam-2.25.0.dev0-py3-none-any.whl size=2179154 sha256=109fe2568e14d7068d6a984952df8c1be4f9245c6925741a541f7cd1888cf2a0
Stored in directory: /home/jenkins/.cache/pip/wheels/77/c3/45/f8c936a7742001e3bc0d0f63813dd268a96c932cc292dc2aae
Successfully built apache-beam
Installing collected packages: crcmod, dill, pytz, fastavro, certifi, chardet, urllib3, idna, requests, docopt, hdfs, httplib2, pbr, mock, numpy, pymongo, pyasn1, rsa, pyasn1-modules, oauth2client, pyparsing, pydot, python-dateutil, typing-extensions, avro-python3, pyarrow, jmespath, docutils, botocore, s3transfer, boto3, cachetools, monotonic, fasteners, google-apitools, google-auth, googleapis-common-protos, google-api-core, google-cloud-core, google-cloud-datastore, grpc-google-iam-v1, google-cloud-pubsub, pycparser, cffi, google-crc32c, google-resumable-media, google-cloud-bigquery, google-cloud-bigtable, google-cloud-spanner, grpcio-gcp, google-cloud-dlp, google-cloud-language, google-cloud-videointelligence, google-cloud-vision, freezegun, nose, nose-xunitmp, parameterized, pyhamcrest, pyyaml, requests-mock, tenacity, attrs, more-itertools, wcwidth, atomicwrites, packaging, pytest, apipkg, execnet, pytest-forked, pytest-xdist, pytest-timeout, pandas, sqlalchemy, psycopg2-binary, websocket-client, docker, blindspin, wrapt, deprecation, colorama, crayons, testcontainers, apache-beam
Successfully installed apache-beam-2.25.0.dev0 apipkg-1.5 atomicwrites-1.4.0 attrs-20.1.0 avro-python3-1.9.2.1 blindspin-2.0.1 boto3-1.14.47 botocore-1.17.47 cachetools-3.1.1 certifi-2020.6.20 cffi-1.14.2 chardet-3.0.4 colorama-0.4.3 crayons-0.3.1 crcmod-1.7 deprecation-2.1.0 dill-0.3.1.1 docker-4.3.1 docopt-0.6.2 docutils-0.15.2 execnet-1.7.1 fastavro-0.23.6 fasteners-0.15 freezegun-0.3.15 google-api-core-1.22.1 google-apitools-0.5.31 google-auth-1.20.1 google-cloud-bigquery-1.27.2 google-cloud-bigtable-1.4.0 google-cloud-core-1.4.1 google-cloud-datastore-1.15.0 google-cloud-dlp-1.0.0 google-cloud-language-1.3.0 google-cloud-pubsub-1.7.0 google-cloud-spanner-1.17.1 google-cloud-videointelligence-1.15.0 google-cloud-vision-1.0.0 google-crc32c-0.1.0 google-resumable-media-0.7.1 googleapis-common-protos-1.52.0 grpc-google-iam-v1-0.12.3 grpcio-gcp-0.2.2 hdfs-2.5.8 httplib2-0.17.4 idna-2.10 jmespath-0.10.0 mock-2.0.0 monotonic-1.5 more-itertools-8.4.0 nose-1.3.7 nose-xunitmp-0.4.1 numpy-1.19.1 oauth2client-3.0.0 packaging-20.4 pandas-0.25.3 parameterized-0.7.4 pbr-5.4.5 psycopg2-binary-2.8.5 pyarrow-0.17.1 pyasn1-0.4.8 pyasn1-modules-0.2.8 pycparser-2.20 pydot-1.4.1 pyhamcrest-1.10.1 pymongo-3.11.0 pyparsing-2.4.7 pytest-4.6.11 pytest-forked-1.3.0 pytest-timeout-1.4.2 pytest-xdist-1.34.0 python-dateutil-2.8.1 pytz-2020.1 pyyaml-5.3.1 requests-2.24.0 requests-mock-1.8.0 rsa-4.6 s3transfer-0.3.3 sqlalchemy-1.3.19 tenacity-5.1.5 testcontainers-3.0.3 typing-extensions-3.7.4.2 urllib3-1.25.10 wcwidth-0.2.5 websocket-client-0.57.0 wrapt-1.12.1
> Task :sdks:python:apache_beam:testing:load_tests:run
INFO:apache_beam.runners.portability.stager:Copying Beam SDK "<https://ci-beam.apache.org/job/beam_LoadTests_Python_GBK_Dataflow_Batch/ws/src/sdks/python/build/apache-beam.tar.gz"> to staging location.
WARNING:root:Make sure that locally built Python SDK docker image has Python 3.7 interpreter.
INFO:root:Using Python SDK docker image: apache/beam_python3.7_sdk:2.25.0.dev. If the image is not available at local, we will try to pull from hub.docker.com
INFO:apache_beam.runners.dataflow.internal.apiclient:Defaulting to the temp_location as staging_location: gs://temp-storage-for-perf-tests/loadtests
INFO:apache_beam.internal.gcp.auth:Setting socket default timeout to 60 seconds.
INFO:apache_beam.internal.gcp.auth:socket default timeout is 60.0 seconds.
INFO:apache_beam.runners.dataflow.internal.apiclient:Starting GCS upload to gs://temp-storage-for-perf-tests/loadtests/load-tests-python-dataflow-batch-gbk-1-0821100158.1598012733.919075/pipeline.pb...
INFO:oauth2client.transport:Attempting refresh to obtain initial access_token
INFO:oauth2client.transport:Attempting refresh to obtain initial access_token
INFO:apache_beam.runners.dataflow.internal.apiclient:Completed GCS upload to gs://temp-storage-for-perf-tests/loadtests/load-tests-python-dataflow-batch-gbk-1-0821100158.1598012733.919075/pipeline.pb in 0 seconds.
INFO:apache_beam.runners.dataflow.internal.apiclient:Starting GCS upload to gs://temp-storage-for-perf-tests/loadtests/load-tests-python-dataflow-batch-gbk-1-0821100158.1598012733.919075/dataflow_python_sdk.tar...
INFO:apache_beam.runners.dataflow.internal.apiclient:Completed GCS upload to gs://temp-storage-for-perf-tests/loadtests/load-tests-python-dataflow-batch-gbk-1-0821100158.1598012733.919075/dataflow_python_sdk.tar in 0 seconds.
WARNING:apache_beam.options.pipeline_options:Discarding unparseable args: ['--iterations=1', '--fanout=1']
WARNING:apache_beam.options.pipeline_options:Discarding unparseable args: ['--iterations=1', '--fanout=1']
INFO:apache_beam.runners.dataflow.internal.apiclient:Create job: <Job
createTime: '2020-08-21T12:25:35.917962Z'
currentStateTime: '1970-01-01T00:00:00Z'
id: '2020-08-21_05_25_34-9531729166094075257'
location: 'us-central1'
name: 'load-tests-python-dataflow-batch-gbk-1-0821100158'
projectId: 'apache-beam-testing'
stageStates: []
startTime: '2020-08-21T12:25:35.917962Z'
steps: []
tempFiles: []
type: TypeValueValuesEnum(JOB_TYPE_BATCH, 1)>
INFO:apache_beam.runners.dataflow.internal.apiclient:Created job with id: [2020-08-21_05_25_34-9531729166094075257]
INFO:apache_beam.runners.dataflow.internal.apiclient:Submitted job: 2020-08-21_05_25_34-9531729166094075257
INFO:apache_beam.runners.dataflow.internal.apiclient:To access the Dataflow monitoring console, please navigate to https://console.cloud.google.com/dataflow/jobs/us-central1/2020-08-21_05_25_34-9531729166094075257?project=apache-beam-testing
INFO:apache_beam.runners.dataflow.dataflow_runner:Job 2020-08-21_05_25_34-9531729166094075257 is in state JOB_STATE_PENDING
INFO:apache_beam.runners.dataflow.dataflow_runner:2020-08-21T12:25:38.482Z: JOB_MESSAGE_BASIC: Worker configuration: n1-standard-1 in us-central1-f.
INFO:apache_beam.runners.dataflow.dataflow_runner:2020-08-21T12:25:39.254Z: JOB_MESSAGE_DETAILED: Expanding CoGroupByKey operations into optimizable parts.
INFO:apache_beam.runners.dataflow.dataflow_runner:2020-08-21T12:25:39.280Z: JOB_MESSAGE_DEBUG: Combiner lifting skipped for step GroupByKey 0: GroupByKey not followed by a combiner.
INFO:apache_beam.runners.dataflow.dataflow_runner:2020-08-21T12:25:39.352Z: JOB_MESSAGE_DETAILED: Expanding GroupByKey operations into optimizable parts.
INFO:apache_beam.runners.dataflow.dataflow_runner:2020-08-21T12:25:39.374Z: JOB_MESSAGE_DETAILED: Lifting ValueCombiningMappingFns into MergeBucketsMappingFns
INFO:apache_beam.runners.dataflow.dataflow_runner:2020-08-21T12:25:39.476Z: JOB_MESSAGE_DEBUG: Annotating graph with Autotuner information.
INFO:apache_beam.runners.dataflow.dataflow_runner:2020-08-21T12:25:39.518Z: JOB_MESSAGE_DETAILED: Fusing adjacent ParDo, Read, Write, and Flatten operations
INFO:apache_beam.runners.dataflow.dataflow_runner:2020-08-21T12:25:39.556Z: JOB_MESSAGE_DETAILED: Fusing consumer Measure time: Start into Read
INFO:apache_beam.runners.dataflow.dataflow_runner:2020-08-21T12:25:39.589Z: JOB_MESSAGE_DETAILED: Fusing consumer Assign timestamps into Measure time: Start
INFO:apache_beam.runners.dataflow.dataflow_runner:2020-08-21T12:25:39.623Z: JOB_MESSAGE_DETAILED: Fusing consumer GroupByKey 0/Reify into Assign timestamps
INFO:apache_beam.runners.dataflow.dataflow_runner:2020-08-21T12:25:39.649Z: JOB_MESSAGE_DETAILED: Fusing consumer GroupByKey 0/Write into GroupByKey 0/Reify
INFO:apache_beam.runners.dataflow.dataflow_runner:2020-08-21T12:25:39.681Z: JOB_MESSAGE_DETAILED: Fusing consumer GroupByKey 0/GroupByWindow into GroupByKey 0/Read
INFO:apache_beam.runners.dataflow.dataflow_runner:2020-08-21T12:25:39.715Z: JOB_MESSAGE_DETAILED: Fusing consumer Ungroup 0 into GroupByKey 0/GroupByWindow
INFO:apache_beam.runners.dataflow.dataflow_runner:2020-08-21T12:25:39.747Z: JOB_MESSAGE_DETAILED: Fusing consumer Measure latency into Ungroup 0
INFO:apache_beam.runners.dataflow.dataflow_runner:2020-08-21T12:25:39.783Z: JOB_MESSAGE_DETAILED: Fusing consumer Measure time: End 0 into Measure latency
INFO:apache_beam.runners.dataflow.dataflow_runner:2020-08-21T12:25:39.835Z: JOB_MESSAGE_DEBUG: Workflow config is missing a default resource spec.
INFO:apache_beam.runners.dataflow.dataflow_runner:2020-08-21T12:25:39.861Z: JOB_MESSAGE_DEBUG: Adding StepResource setup and teardown to workflow graph.
INFO:apache_beam.runners.dataflow.dataflow_runner:2020-08-21T12:25:39.889Z: JOB_MESSAGE_DEBUG: Adding workflow start and stop steps.
INFO:apache_beam.runners.dataflow.dataflow_runner:2020-08-21T12:25:39.938Z: JOB_MESSAGE_DEBUG: Assigning stage ids.
INFO:apache_beam.runners.dataflow.dataflow_runner:2020-08-21T12:25:40.213Z: JOB_MESSAGE_DEBUG: Executing wait step start13
INFO:apache_beam.runners.dataflow.dataflow_runner:2020-08-21T12:25:40.312Z: JOB_MESSAGE_BASIC: Executing operation GroupByKey 0/Create
INFO:apache_beam.runners.dataflow.dataflow_runner:2020-08-21T12:25:40.356Z: JOB_MESSAGE_DEBUG: Starting **** pool setup.
INFO:apache_beam.runners.dataflow.dataflow_runner:2020-08-21T12:25:40.391Z: JOB_MESSAGE_BASIC: Starting 5 ****s in us-central1-f...
INFO:apache_beam.runners.dataflow.dataflow_runner:2020-08-21T12:25:40.434Z: JOB_MESSAGE_BASIC: Finished operation GroupByKey 0/Create
INFO:apache_beam.runners.dataflow.dataflow_runner:2020-08-21T12:25:40.492Z: JOB_MESSAGE_DEBUG: Value "GroupByKey 0/Session" materialized.
INFO:apache_beam.runners.dataflow.dataflow_runner:2020-08-21T12:25:40.564Z: JOB_MESSAGE_BASIC: Executing operation Read+Measure time: Start+Assign timestamps+GroupByKey 0/Reify+GroupByKey 0/Write
INFO:apache_beam.runners.dataflow.dataflow_runner:Job 2020-08-21_05_25_34-9531729166094075257 is in state JOB_STATE_RUNNING
INFO:apache_beam.runners.dataflow.dataflow_runner:2020-08-21T12:26:08.935Z: JOB_MESSAGE_DETAILED: Autoscaling: Raised the number of ****s to 3 based on the rate of progress in the currently running stage(s).
INFO:apache_beam.runners.dataflow.dataflow_runner:2020-08-21T12:26:08.972Z: JOB_MESSAGE_DETAILED: Resized **** pool to 3, though goal was 5. This could be a quota issue.
INFO:apache_beam.runners.dataflow.dataflow_runner:2020-08-21T12:26:11.950Z: JOB_MESSAGE_WARNING: Your project already contains 100 Dataflow-created metric descriptors and Stackdriver will not create new Dataflow custom metrics for this job. Each unique user-defined metric name (independent of the DoFn in which it is defined) produces a new metric descriptor. To delete old / unused metric descriptors see https://developers.google.com/apis-explorer/#p/monitoring/v3/monitoring.projects.metricDescriptors.list and https://developers.google.com/apis-explorer/#p/monitoring/v3/monitoring.projects.metricDescriptors.delete
INFO:apache_beam.runners.dataflow.dataflow_runner:2020-08-21T12:26:14.297Z: JOB_MESSAGE_DETAILED: Autoscaling: Raised the number of ****s to 5 based on the rate of progress in the currently running stage(s).
INFO:apache_beam.runners.dataflow.dataflow_runner:2020-08-21T12:27:45.767Z: JOB_MESSAGE_DETAILED: Workers have started successfully.
INFO:apache_beam.runners.dataflow.dataflow_runner:2020-08-21T12:27:45.798Z: JOB_MESSAGE_DETAILED: Workers have started successfully.
INFO:apache_beam.runners.dataflow.dataflow_runner:2020-08-21T12:58:36.911Z: JOB_MESSAGE_BASIC: Finished operation Read+Measure time: Start+Assign timestamps+GroupByKey 0/Reify+GroupByKey 0/Write
INFO:apache_beam.runners.dataflow.dataflow_runner:2020-08-21T12:58:37.198Z: JOB_MESSAGE_BASIC: Executing operation GroupByKey 0/Close
INFO:apache_beam.runners.dataflow.dataflow_runner:2020-08-21T12:58:37.296Z: JOB_MESSAGE_BASIC: Finished operation GroupByKey 0/Close
INFO:apache_beam.runners.dataflow.dataflow_runner:2020-08-21T12:58:37.375Z: JOB_MESSAGE_BASIC: Executing operation GroupByKey 0/Read+GroupByKey 0/GroupByWindow+Ungroup 0+Measure latency+Measure time: End 0
INFO:apache_beam.runners.dataflow.dataflow_runner:2020-08-21T13:03:10.239Z: JOB_MESSAGE_BASIC: Finished operation GroupByKey 0/Read+GroupByKey 0/GroupByWindow+Ungroup 0+Measure latency+Measure time: End 0
INFO:apache_beam.runners.dataflow.dataflow_runner:2020-08-21T13:03:10.293Z: JOB_MESSAGE_DEBUG: Executing success step success11
INFO:apache_beam.runners.dataflow.dataflow_runner:2020-08-21T13:03:10.360Z: JOB_MESSAGE_DETAILED: Cleaning up.
INFO:apache_beam.runners.dataflow.dataflow_runner:2020-08-21T13:03:10.579Z: JOB_MESSAGE_DEBUG: Starting **** pool teardown.
INFO:apache_beam.runners.dataflow.dataflow_runner:2020-08-21T13:03:10.620Z: JOB_MESSAGE_BASIC: Stopping **** pool...
INFO:apache_beam.runners.dataflow.dataflow_runner:2020-08-21T13:04:02.412Z: JOB_MESSAGE_DETAILED: Autoscaling: Resized **** pool from 5 to 0.
INFO:apache_beam.runners.dataflow.dataflow_runner:2020-08-21T13:04:02.447Z: JOB_MESSAGE_BASIC: Worker pool stopped.
INFO:apache_beam.runners.dataflow.dataflow_runner:2020-08-21T13:04:02.487Z: JOB_MESSAGE_DEBUG: Tearing down pending resources...
INFO:apache_beam.runners.dataflow.dataflow_runner:Job 2020-08-21_05_25_34-9531729166094075257 is in state JOB_STATE_DONE
INFO:apache_beam.testing.load_tests.load_test_metrics_utils:Load test results for test: 14831b5d1f2a4b89b2d201484196865d and timestamp: 1598015058.0362437:
INFO:apache_beam.testing.load_tests.load_test_metrics_utils:Metric: python_dataflow_batch_gbk_1_runtime Value: 1937
INFO:apache_beam.testing.load_tests.load_test_metrics_utils:Metric: python_dataflow_batch_gbk_1_measure_latency_count_latency Value: 512
INFO:apache_beam.testing.load_tests.load_test_metrics_utils:Metric: python_dataflow_batch_gbk_1_measure_latency_max_latency Value: 9224970051840062
INFO:apache_beam.testing.load_tests.load_test_metrics_utils:Metric: python_dataflow_batch_gbk_1_measure_latency_min_latency Value: 9224970051572308
Traceback (most recent call last):
File "/usr/lib/python3.7/runpy.py", line 193, in _run_module_as_main
"__main__", mod_spec)
File "/usr/lib/python3.7/runpy.py", line 85, in _run_code
exec(code, run_globals)
File "<https://ci-beam.apache.org/job/beam_LoadTests_Python_GBK_Dataflow_Batch/ws/src/sdks/python/apache_beam/testing/load_tests/group_by_key_test.py",> line 120, in <module>
GroupByKeyTest().run()
File "<https://ci-beam.apache.org/job/beam_LoadTests_Python_GBK_Dataflow_Batch/ws/src/sdks/python/apache_beam/testing/load_tests/load_test.py",> line 153, in run
self._metrics_monitor.publish_metrics(self.result)
File "<https://ci-beam.apache.org/job/beam_LoadTests_Python_GBK_Dataflow_Batch/ws/src/sdks/python/apache_beam/testing/load_tests/load_test_metrics_utils.py",> line 227, in publish_metrics
publisher.publish(insert_dicts)
File "<https://ci-beam.apache.org/job/beam_LoadTests_Python_GBK_Dataflow_Batch/ws/src/sdks/python/apache_beam/testing/load_tests/load_test_metrics_utils.py",> line 375, in publish
% (result[METRICS_TYPE_LABEL], result[VALUE_LABEL])
TypeError: %d format: a number is required, not NoneType
> Task :sdks:python:apache_beam:testing:load_tests:run FAILED
FAILURE: Build failed with an exception.
* Where:
Build file '<https://ci-beam.apache.org/job/beam_LoadTests_Python_GBK_Dataflow_Batch/ws/src/sdks/python/apache_beam/testing/load_tests/build.gradle'> line: 58
* What went wrong:
Execution failed for task ':sdks:python:apache_beam:testing:load_tests:run'.
> error occurred
* Try:
Run with --stacktrace option to get the stack trace. Run with --info or --debug option to get more log output. Run with --scan to get full insights.
* Get more help at https://help.gradle.org
Deprecated Gradle features were used in this build, making it incompatible with Gradle 6.0.
Use '--warning-mode all' to show the individual deprecation warnings.
See https://docs.gradle.org/5.2.1/userguide/command_line_interface.html#sec:command_line_warnings
BUILD FAILED in 40m 0s
5 actionable tasks: 5 executed
Publishing build scan...
https://gradle.com/s/6ufxd6ay37ane
Build step 'Invoke Gradle script' changed build result to FAILURE
Build step 'Invoke Gradle script' marked build as failure
---------------------------------------------------------------------
To unsubscribe, e-mail: builds-unsubscribe@beam.apache.org
For additional commands, e-mail: builds-help@beam.apache.org